{
  "zenodoId": 4687065,
  "doi": "10.5281/zenodo.4687065",
  "id": "c6e3b5d8-9308-4db0-909e-ccea601846fa",
  "name": "land_surface_temperature",
  "profile": "raster-data-resource",
  "datapackage_version": [
    "1.0-beta"
  ],
  "title": "Global annual mean temperature",
  "description": "Data show the annual mean land surface temperature at world scale.",
  "version": "0.1",
  "created": "2017-11-16",
  "keywords": [
    "climatic data",
    "temperature"
  ],
  "licenses": [
    {
      "id": "CC-BY-4.0",
      "title": "Creative Commons Attribution 4.0 International",
      "url": "https://creativecommons.org/licenses/by/4.0/legalcode"
    }
  ],
  "sources": [
    {
      "name": "eurolst",
      "title": "BIO1: Annual mean temperature (\u00b0C * 10)",
      "owner": "FMach",
      "file": "eurolst_clim.bio01.tif",
      "path": "http://www.geodati.fmach.it/eurolst/eurolst_clim.bio01.zip"
    }
  ],
  "contributors": [
    {
      "title": "Pietro Zambelli",
      "email": "Pietro.Zambelli@eurac.edu",
      "role": "author",
      "organization": "Eurac Research"
    },
    {
      "title": "Chiara Scaramuzzino",
      "email": "Chiara.Scaramuzzino@eurac.edu",
      "role": "author",
      "organization": "Eurac Research"
    }
  ],
  "transformation": {
    "operator": "/",
    "value": 10
  },
  "resources": [
    {
      "name": "land_surface_temperature",
      "title": "Global annual mean land surface temperature",
      "path": "data/land_surface_temperature.tif",
      "description": "The data show the global annual mean land surface temperature.",
      "unit": "Celsius",
      "format": "tif",
      "encoding": "utf-8",
      "raster": {
        "epsg": "3035"
      },
      "data processing": "Mean",
      "temporal": {
        "start": "2002-01-01 00:00:00",
        "end": "2012-12-31 23:59:59"
      }
    }
  ]
}