{
  "zenodoId": 4687071,
  "doi": "10.5281/zenodo.4687071",
  "name": "Heating and cooling degree days",
  "profile": "tabular-data-resource",
  "title": "Monthly average of heating and cooling degree days",
  "description": "Data show the average of heating and cooling degree days in the EU28 at NUTS2 level.",
  "version": "0.1",
  "created": "2017-11-16",
  "keywords": [
    "climatic data",
    "heating",
    "cooling",
    "degree days"
  ],
  "licenses": [
    {
      "id": "CC-BY-4.0",
      "title": "Creative Commons Attribution 4.0 International",
      "url": "https://creativecommons.org/licenses/by/4.0/legalcode"
    }
  ],
  "sources": [
    {
      "name": "eurostat",
      "title": "Heating and cooling degree days",
      "owner": "Eurostat",
      "file": "",
      "path": "ec.europa.eu/eurostat/estat-navtree-portlet-prod/BulkDownloadListing?sort=1&file=data%2Fnrg_chddr2_m.tsv.gz"
    }
  ],
  "contributors": [
    {
      "title": "Pietro Zambelli",
      "email": "Pietro.Zambelli@eurac.edu",
      "role": "author",
      "organization": "Eurac Research"
    },
    {
      "title": "Chiara Scaramuzzino",
      "email": "Chiara.Scaramuzzino@eurac.edu",
      "role": "author",
      "organization": "Eurac Research"
    }
  ],
  "resources": [
    {
      "name": "hddcdd",
      "title": "Heating and cooling degree days",
      "path": "data/output_hddcdd.csv",
      "description": "The data show the monthly average of heating and cooling degree days in the EU28 at NUTS2 level.",
      "profile": "tabular-data-resource",
      "encoding": "utf-8",
      "format": "csv",
      "mediatype": "text/csv",
      "spatial_resolution": "NUTS2",
      "temporal_resolution": "month",
      "spatial_key_field": "NUTS_ID",
      "data processing": "Script to obtain output_potential.csv in data2sqlite_csv",
      "temporal": {
        "start": "1974-01-01 00:00:00",
        "end": "2016-12-31 23:59:59"
      },
      "bytes": "8",
      "schema": {
        "fields": [
          {
            "name": "NUTS_ID",
            "type": "string",
            "unit": ""
          },
          {
            "name": "indic_nrg",
            "type": "string",
            "unit": ""
          },
          {
            "name": "datetime",
            "type": "datetime",
            "unit": ""
          },
          {
            "name": "value",
            "type": "float",
            "unit": "\u00b0C"
          }
        ]
      },
      "dialect": {
        "delimiter": ",",
        "doubleQuote": true
      }
    }
  ],
  "id": "81a33a1d-1181-4212-94ed-62281e4d3873"
}