EESchema Schematic File Version 4
LIBS:radio-subboard-cache
EELAYER 26 0
EELAYER END
$Descr A4 11693 8268
encoding utf-8
Sheet 1 1
Title "400001-Node Radio Subboard"
Date "2019-01-18"
Rev "A"
Comp "HMS"
Comment1 "Drawn: C. Swinoga"
Comment2 "Check: C. Swinoga"
Comment3 ""
Comment4 ""
$EndDescr
$Comp
L RF_AM_FM:RFM95W-915S2 U1
U 1 1 5C1D66B5
P 4900 4200
F 0 "U1" H 5050 4750 50  0000 C CNN
F 1 "RFM95" H 5050 4650 50  0000 C CNN
F 2 "capstone_footprints:RFM9X_THT" H 4900 4200 50  0001 C CNN
F 3 "" H 4900 4200 50  0001 C CNN
F 4 "109990166" H 5050 4850 50  0001 C CNN "PN"
	1    4900 4200
	1    0    0    -1  
$EndComp
$Comp
L Device:Antenna_Dipole AE1
U 1 1 5C1D6858
P 7900 4350
F 0 "AE1" V 7904 4330 50  0000 L CNN
F 1 "Antenna_Dipole" V 7995 4330 50  0000 L CNN
F 2 "capstone_footprints:dipole-holddown" H 7900 4350 50  0001 C CNN
F 3 "~" H 7900 4350 50  0001 C CNN
	1    7900 4350
	0    1    1    0   
$EndComp
$Comp
L Device:C C2
U 1 1 5C1D68BC
P 7300 4400
F 0 "C2" H 7415 4446 50  0000 L CNN
F 1 "7.2p" H 7415 4355 50  0000 L CNN
F 2 "Capacitor_SMD:C_0603_1608Metric" H 7338 4250 50  0001 C CNN
F 3 "~" H 7300 4400 50  0001 C CNN
F 4 "CBR06C729B5GAC" H 7300 4400 50  0001 C CNN "PN"
	1    7300 4400
	1    0    0    -1  
$EndComp
$Comp
L Device:L L1
U 1 1 5C1D691D
P 7100 4200
F 0 "L1" V 6922 4200 50  0000 C CNN
F 1 "6.8n" V 7013 4200 50  0000 C CNN
F 2 "Inductor_SMD:L_0603_1608Metric" H 7100 4200 50  0001 C CNN
F 3 "~" H 7100 4200 50  0001 C CNN
F 4 "LQW18AN6N8G8ZD" V 7100 4200 50  0001 C CNN "PN"
	1    7100 4200
	0    1    1    0   
$EndComp
$Comp
L Device:C C3
U 1 1 5C1D6959
P 6900 4400
F 0 "C3" H 7015 4446 50  0000 L CNN
F 1 "8p" H 7015 4355 50  0000 L CNN
F 2 "Capacitor_SMD:C_0603_1608Metric" H 6938 4250 50  0001 C CNN
F 3 "~" H 6900 4400 50  0001 C CNN
F 4 "CBR06C809BAGAC " H 6900 4400 50  0001 C CNN "PN"
	1    6900 4400
	1    0    0    -1  
$EndComp
$Comp
L Device:C C1
U 1 1 5C1D6A11
P 6000 2650
F 0 "C1" H 6115 2696 50  0000 L CNN
F 1 "10u" H 6115 2605 50  0000 L CNN
F 2 "Capacitor_SMD:C_0603_1608Metric_Pad1.05x0.95mm_HandSolder" H 6038 2500 50  0001 C CNN
F 3 "~" H 6000 2650 50  0001 C CNN
	1    6000 2650
	1    0    0    -1  
$EndComp
$Comp
L power:GND #PWR06
U 1 1 5C1D6EE6
P 6000 2850
F 0 "#PWR06" H 6000 2600 50  0001 C CNN
F 1 "GND" H 6005 2677 50  0000 C CNN
F 2 "" H 6000 2850 50  0001 C CNN
F 3 "" H 6000 2850 50  0001 C CNN
	1    6000 2850
	1    0    0    -1  
$EndComp
$Comp
L Device:Transformer_1P_1S T1
U 1 1 5C1D7F71
P 6450 4400
F 0 "T1" H 6450 4650 50  0000 C CNN
F 1 "CX2024NL" H 6450 4150 50  0000 C CNN
F 2 "capstone_footprints:CX2024NL" H 6450 4400 50  0001 C CNN
F 3 "~" H 6450 4400 50  0001 C CNN
F 4 "CX2024NL" H 6450 4750 50  0001 C CNN "PN"
	1    6450 4400
	1    0    0    -1  
$EndComp
$Comp
L power:GND #PWR04
U 1 1 5C1D8915
P 6000 4650
F 0 "#PWR04" H 6000 4400 50  0001 C CNN
F 1 "GND" H 6005 4477 50  0000 C CNN
F 2 "" H 6000 4650 50  0001 C CNN
F 3 "" H 6000 4650 50  0001 C CNN
	1    6000 4650
	1    0    0    -1  
$EndComp
$Comp
L power:GND #PWR0101
U 1 1 5C1FC9CE
P 4900 4900
F 0 "#PWR0101" H 4900 4650 50  0001 C CNN
F 1 "GND" H 4905 4727 50  0000 C CNN
F 2 "" H 4900 4900 50  0001 C CNN
F 3 "" H 4900 4900 50  0001 C CNN
	1    4900 4900
	1    0    0    -1  
$EndComp
$Comp
L power:GND #PWR01
U 1 1 5C27ECB1
P 4400 3050
F 0 "#PWR01" H 4400 2800 50  0001 C CNN
F 1 "GND" H 4405 2877 50  0000 C CNN
F 2 "" H 4400 3050 50  0001 C CNN
F 3 "" H 4400 3050 50  0001 C CNN
	1    4400 3050
	1    0    0    -1  
$EndComp
$Comp
L Connector_Generic:Conn_02x07_Odd_Even J1
U 1 1 5C27ECB8
P 4900 2700
F 0 "J1" V 4950 3100 50  0000 C CNN
F 1 "Conn_02x07_Odd_Even" V 4300 2700 50  0000 C CNN
F 2 "capstone_footprints:MOLEX_878331420" H 4900 2700 50  0001 C CNN
F 3 "~" H 4900 2700 50  0001 C CNN
F 4 "878331420" H 4950 3200 50  0001 C CNN "PN"
	1    4900 2700
	0    -1   1    0   
$EndComp
Text GLabel 4850 3600 0    50   Input ~ 0
3V3
Text GLabel 5950 2450 0    50   Input ~ 0
3V3
Text Label 4350 4100 2    50   ~ 0
MISO_3V3
Text Label 4350 4000 2    50   ~ 0
MOSI_3V3
Text Label 4350 3900 2    50   ~ 0
SCLK_3V3
Text Label 4350 4400 2    50   ~ 0
RST_3V3
Text Label 4350 4200 2    50   ~ 0
CS_3V3
Text Label 5450 4600 0    50   ~ 0
DIO0_3V3
Text Label 5450 4500 0    50   ~ 0
DIO1_3V3
Text Label 5450 4400 0    50   ~ 0
DIO2_3V3
Text Label 5450 4300 0    50   ~ 0
DIO3_3V3
Text Label 5450 4200 0    50   ~ 0
DIO4_3V3
Text Label 5450 4100 0    50   ~ 0
DIO5_3V3
Text Label 7550 4200 0    50   ~ 0
Ant_P
Text Label 7550 4600 0    50   ~ 0
Ant_N
Text Label 6050 4050 0    50   ~ 0
Ant_Unbal
Text GLabel 4550 2350 0    50   Input ~ 0
3V3
Text Label 4800 2500 1    50   ~ 0
MISO_3V3
Text Label 4900 2500 1    50   ~ 0
MOSI_3V3
Text Label 5000 2500 1    50   ~ 0
SCLK_3V3
Text Label 5200 2500 1    50   ~ 0
RST_3V3
Text Label 4900 3000 3    50   ~ 0
DIO0_3V3
Text Label 5100 2500 1    50   ~ 0
CS_3V3
Text Label 5000 3000 3    50   ~ 0
DIO1_3V3
Text Label 5100 3000 3    50   ~ 0
DIO2_3V3
Text Label 4700 3000 3    50   ~ 0
DIO3_3V3
Text Label 4800 3000 3    50   ~ 0
DIO4_3V3
Text Label 5200 3000 3    50   ~ 0
DIO5_3V3
Wire Wire Line
	5950 2450 6000 2450
Wire Wire Line
	6000 2450 6000 2500
Wire Wire Line
	6000 2800 6000 2850
Wire Wire Line
	7250 4200 7300 4200
Wire Wire Line
	7300 4200 7300 4250
Wire Wire Line
	6950 4200 6900 4200
Wire Wire Line
	6900 4200 6900 4250
Wire Wire Line
	6900 4550 6900 4600
Wire Wire Line
	6900 4600 7300 4600
Wire Wire Line
	7300 4600 7300 4550
Wire Wire Line
	7300 4200 7700 4200
Wire Wire Line
	7700 4200 7700 4350
Wire Wire Line
	7700 4450 7700 4600
Wire Wire Line
	7700 4600 7300 4600
Wire Wire Line
	6900 4200 6850 4200
Wire Wire Line
	6900 4600 6850 4600
Wire Wire Line
	6050 4600 6000 4600
Wire Wire Line
	6000 4600 6000 4650
Wire Wire Line
	4400 4100 4350 4100
Wire Wire Line
	4400 4000 4350 4000
Wire Wire Line
	4400 3900 4350 3900
Wire Wire Line
	4400 4200 4350 4200
Wire Wire Line
	4400 4400 4350 4400
Wire Wire Line
	5450 4600 5400 4600
Wire Wire Line
	5450 4500 5400 4500
Wire Wire Line
	5450 4400 5400 4400
Wire Wire Line
	5450 4300 5400 4300
Wire Wire Line
	5450 4200 5400 4200
Wire Wire Line
	5400 4100 5450 4100
Wire Wire Line
	6050 3900 6050 4200
Wire Wire Line
	4850 3600 4900 3600
Wire Wire Line
	4900 3600 4900 3700
Wire Wire Line
	4900 4800 4900 4850
Wire Wire Line
	5000 4800 5000 4850
Wire Wire Line
	5000 4850 4900 4850
Wire Wire Line
	4900 4850 4900 4900
Wire Wire Line
	4800 4800 4800 4850
Wire Wire Line
	4800 4850 4900 4850
Wire Wire Line
	6050 3900 5400 3900
Wire Wire Line
	4550 2350 4600 2350
Wire Wire Line
	4600 2350 4600 2500
Wire Wire Line
	4700 2500 4700 2450
Wire Wire Line
	4700 2450 4400 2450
Wire Wire Line
	4400 2450 4400 3050
Wire Wire Line
	4400 3050 4600 3050
Wire Wire Line
	4600 3050 4600 3000
Connection ~ 7300 4200
Connection ~ 7300 4600
Connection ~ 6900 4200
Connection ~ 6900 4600
Connection ~ 4900 4850
Connection ~ 4400 3050
$EndSCHEMATC
