(kicad_pcb (version 20171130) (host pcbnew "(5.0.2)-1")

  (general
    (thickness 1.6)
    (drawings 30)
    (tracks 81)
    (zones 0)
    (modules 10)
    (nets 18)
  )

  (page A4)
  (layers
    (0 F.Cu signal)
    (1 In1.Cu power hide)
    (2 In2.Cu power hide)
    (31 B.Cu signal)
    (32 B.Adhes user)
    (33 F.Adhes user)
    (34 B.Paste user hide)
    (35 F.Paste user hide)
    (36 B.SilkS user)
    (37 F.SilkS user)
    (38 B.Mask user hide)
    (39 F.Mask user hide)
    (40 Dwgs.User user hide)
    (41 Cmts.User user)
    (42 Eco1.User user hide)
    (43 Eco2.User user hide)
    (44 Edge.Cuts user)
    (45 Margin user)
    (46 B.CrtYd user hide)
    (47 F.CrtYd user hide)
    (48 B.Fab user hide)
    (49 F.Fab user hide)
  )

  (setup
    (last_trace_width 0.25)
    (trace_clearance 0.2)
    (zone_clearance 0.508)
    (zone_45_only no)
    (trace_min 0.2)
    (segment_width 0.2)
    (edge_width 0.15)
    (via_size 0.8)
    (via_drill 0.4)
    (via_min_size 0.4)
    (via_min_drill 0.3)
    (uvia_size 0.3)
    (uvia_drill 0.1)
    (uvias_allowed no)
    (uvia_min_size 0.2)
    (uvia_min_drill 0.1)
    (pcb_text_width 0.3)
    (pcb_text_size 1.5 1.5)
    (mod_edge_width 0.15)
    (mod_text_size 1 1)
    (mod_text_width 0.15)
    (pad_size 1.524 1.524)
    (pad_drill 0.762)
    (pad_to_mask_clearance 0.051)
    (solder_mask_min_width 0.25)
    (aux_axis_origin 0 0)
    (visible_elements 7FFFFFFF)
    (pcbplotparams
      (layerselection 0x010f0_ffffffff)
      (usegerberextensions false)
      (usegerberattributes false)
      (usegerberadvancedattributes false)
      (creategerberjobfile false)
      (excludeedgelayer true)
      (linewidth 0.100000)
      (plotframeref false)
      (viasonmask false)
      (mode 1)
      (useauxorigin false)
      (hpglpennumber 1)
      (hpglpenspeed 20)
      (hpglpendiameter 15.000000)
      (psnegative false)
      (psa4output false)
      (plotreference true)
      (plotvalue true)
      (plotinvisibletext false)
      (padsonsilk false)
      (subtractmaskfromsilk false)
      (outputformat 1)
      (mirror false)
      (drillshape 0)
      (scaleselection 1)
      (outputdirectory "artwork/"))
  )

  (net 0 "")
  (net 1 3V3)
  (net 2 GND)
  (net 3 /DIO1_3V3)
  (net 4 /DIO2_3V3)
  (net 5 /MISO_3V3)
  (net 6 /DIO3_3V3)
  (net 7 /MOSI_3V3)
  (net 8 /DIO4_3V3)
  (net 9 /SCLK_3V3)
  (net 10 /DIO5_3V3)
  (net 11 /RST_3V3)
  (net 12 /CS_3V3)
  (net 13 /DIO0_3V3)
  (net 14 /Ant_P)
  (net 15 /Ant_N)
  (net 16 /Ant_Unbal)
  (net 17 "Net-(C3-Pad1)")

  (net_class Default "This is the default net class."
    (clearance 0.2)
    (trace_width 0.25)
    (via_dia 0.8)
    (via_drill 0.4)
    (uvia_dia 0.3)
    (uvia_drill 0.1)
    (add_net /CS_3V3)
    (add_net /DIO0_3V3)
    (add_net /DIO1_3V3)
    (add_net /DIO2_3V3)
    (add_net /DIO3_3V3)
    (add_net /DIO4_3V3)
    (add_net /DIO5_3V3)
    (add_net /MISO_3V3)
    (add_net /MOSI_3V3)
    (add_net /RST_3V3)
    (add_net /SCLK_3V3)
    (add_net "Net-(C3-Pad1)")
  )

  (net_class 50Ohm ""
    (clearance 0.5)
    (trace_width 0.29337)
    (via_dia 0.8)
    (via_drill 0.4)
    (uvia_dia 0.3)
    (uvia_drill 0.1)
    (add_net /Ant_N)
    (add_net /Ant_P)
    (add_net /Ant_Unbal)
  )

  (net_class PWR ""
    (clearance 0.2)
    (trace_width 0.4)
    (via_dia 0.8)
    (via_drill 0.4)
    (uvia_dia 0.3)
    (uvia_drill 0.1)
    (add_net 3V3)
    (add_net GND)
  )

  (module capstone_footprints:RFM9X_THT locked (layer F.Cu) (tedit 5C1EBEEF) (tstamp 5C2B43B1)
    (at 190.754 83.566 180)
    (path /5C1D66B5)
    (fp_text reference U1 (at 0 -9.5 180) (layer F.SilkS)
      (effects (font (size 1 1) (thickness 0.15)))
    )
    (fp_text value RFM95 (at 0 7 180) (layer F.Fab)
      (effects (font (size 1 1) (thickness 0.15)))
    )
    (fp_line (start 8 -8) (end 8 8) (layer F.Fab) (width 0.15))
    (fp_line (start -8 8) (end 8 8) (layer F.Fab) (width 0.15))
    (fp_line (start -8 -8) (end 8 -8) (layer F.Fab) (width 0.15))
    (fp_line (start -8 -8) (end -8 8) (layer F.Fab) (width 0.15))
    (fp_line (start -5 -5.5) (end 1 -5.5) (layer F.Fab) (width 0.15))
    (fp_line (start 1 -5.5) (end 1 0.5) (layer F.Fab) (width 0.15))
    (fp_line (start 1 0.5) (end -5 0.5) (layer F.Fab) (width 0.15))
    (fp_line (start -5 0.5) (end -5 -5.5) (layer F.Fab) (width 0.15))
    (fp_line (start 2 -7) (end 4.5 -7) (layer F.Fab) (width 0.15))
    (fp_line (start 4.5 -7) (end 4.5 -3.5) (layer F.Fab) (width 0.15))
    (fp_line (start 4.5 -3.5) (end 2 -3.5) (layer F.Fab) (width 0.15))
    (fp_line (start 2 -3.5) (end 2 -7) (layer F.Fab) (width 0.15))
    (fp_line (start -8 -8.5) (end 8 -8.5) (layer F.SilkS) (width 0.15))
    (fp_line (start -8 8.5) (end 8 8.5) (layer F.SilkS) (width 0.15))
    (fp_circle (center -9 -9) (end -9 -8.5) (layer F.SilkS) (width 0.15))
    (pad 9 thru_hole circle (at 7 7 180) (size 1.7 1.7) (drill 0.85) (layers *.Cu *.Mask)
      (net 16 /Ant_Unbal))
    (pad 10 thru_hole rect (at 7 5 180) (size 3 1.3) (drill 0.85 (offset 0.5 0)) (layers *.Cu *.Mask)
      (net 2 GND))
    (pad 11 thru_hole rect (at 7 3 180) (size 3 1.3) (drill 0.85 (offset 0.5 0)) (layers *.Cu *.Mask)
      (net 6 /DIO3_3V3))
    (pad 12 thru_hole rect (at 7 1 180) (size 3 1.3) (drill 0.85 (offset 0.5 0)) (layers *.Cu *.Mask)
      (net 8 /DIO4_3V3))
    (pad 13 thru_hole rect (at 7 -1 180) (size 3 1.3) (drill 0.85 (offset 0.5 0)) (layers *.Cu *.Mask)
      (net 1 3V3))
    (pad 14 thru_hole rect (at 7 -3 180) (size 3 1.3) (drill 0.85 (offset 0.5 0)) (layers *.Cu *.Mask)
      (net 13 /DIO0_3V3))
    (pad 15 thru_hole rect (at 7 -5 180) (size 3 1.3) (drill 0.85 (offset 0.5 0)) (layers *.Cu *.Mask)
      (net 3 /DIO1_3V3))
    (pad 8 thru_hole rect (at -7 7 180) (size 3 1.3) (drill 0.85 (offset -0.5 0)) (layers *.Cu *.Mask)
      (net 2 GND))
    (pad 7 thru_hole rect (at -7 5 180) (size 3 1.3) (drill 0.85 (offset -0.5 0)) (layers *.Cu *.Mask)
      (net 10 /DIO5_3V3))
    (pad 6 thru_hole rect (at -7 3 180) (size 3 1.3) (drill 0.85 (offset -0.5 0)) (layers *.Cu *.Mask)
      (net 11 /RST_3V3))
    (pad 5 thru_hole rect (at -7 1 180) (size 3 1.3) (drill 0.85 (offset -0.5 0)) (layers *.Cu *.Mask)
      (net 12 /CS_3V3))
    (pad 4 thru_hole rect (at -7 -1 180) (size 3 1.3) (drill 0.85 (offset -0.5 0)) (layers *.Cu *.Mask)
      (net 9 /SCLK_3V3))
    (pad 3 thru_hole rect (at -7 -3 180) (size 3 1.3) (drill 0.85 (offset -0.5 0)) (layers *.Cu *.Mask)
      (net 7 /MOSI_3V3))
    (pad 2 thru_hole rect (at -7 -5 180) (size 3 1.3) (drill 0.85 (offset -0.5 0)) (layers *.Cu *.Mask)
      (net 5 /MISO_3V3))
    (pad 16 thru_hole rect (at 7 -7 180) (size 3 1.3) (drill 0.85 (offset 0.5 0)) (layers *.Cu *.Mask)
      (net 4 /DIO2_3V3))
    (pad 1 thru_hole rect (at -7 -7 180) (size 3 1.3) (drill 0.85 (offset -0.5 0)) (layers *.Cu *.Mask)
      (net 2 GND))
    (model ${CAPSTONE_3DMOD}/RM95.step
      (offset (xyz -8 8 0.5))
      (scale (xyz 1 1 1))
      (rotate (xyz -90 0 0))
    )
  )

  (module capstone_footprints:dipole-holddown (layer B.Cu) (tedit 5C1A97DE) (tstamp 5C27CE35)
    (at 190.5 97.79)
    (path /5C1D6858)
    (fp_text reference AE1 (at 0 1.75) (layer B.SilkS)
      (effects (font (size 1 1) (thickness 0.15)) (justify mirror))
    )
    (fp_text value Antenna_Dipole (at 0 2.032) (layer B.Fab)
      (effects (font (size 1 1) (thickness 0.15)) (justify mirror))
    )
    (fp_poly (pts (xy -77.47 1.27) (xy -2.54 1.27) (xy -2.54 -1.27) (xy -77.47 -1.27)) (layer B.Fab) (width 0.15))
    (fp_poly (pts (xy 2.54 1.27) (xy 77.47 1.27) (xy 77.47 -1.27) (xy 2.54 -1.27)) (layer B.Fab) (width 0.15))
    (fp_arc (start -11.43 -3.81) (end -10.16 -3.81) (angle 180) (layer B.Fab) (width 0.15))
    (fp_arc (start 11.43 -3.81) (end 12.7 -3.81) (angle 180) (layer B.Fab) (width 0.15))
    (fp_arc (start -11.43 3.81) (end -12.7 3.81) (angle 180) (layer B.Fab) (width 0.15))
    (fp_arc (start 11.43 3.81) (end 10.16 3.81) (angle 180) (layer B.Fab) (width 0.15))
    (pad 1 thru_hole circle (at -1.27 0) (size 1.7 1.7) (drill 1) (layers *.Cu *.Mask)
      (net 14 /Ant_P))
    (pad 2 thru_hole circle (at 1.27 0) (size 1.7 1.7) (drill 1) (layers *.Cu *.Mask)
      (net 15 /Ant_N))
    (model ${CAPSTONE_3DMOD}/dipole_antenna.STEP
      (offset (xyz -2.1 0 1))
      (scale (xyz 1 1 1))
      (rotate (xyz -90 0 90))
    )
  )

  (module Capacitor_SMD:C_0603_1608Metric_Pad1.05x0.95mm_HandSolder (layer F.Cu) (tedit 5B301BBE) (tstamp 5C29AB87)
    (at 180.34 82.945 90)
    (descr "Capacitor SMD 0603 (1608 Metric), square (rectangular) end terminal, IPC_7351 nominal with elongated pad for handsoldering. (Body size source: http://www.tortai-tech.com/upload/download/2011102023233369053.pdf), generated with kicad-footprint-generator")
    (tags "capacitor handsolder")
    (path /5C1D6A11)
    (attr smd)
    (fp_text reference C1 (at 0 -1.27 90) (layer F.SilkS)
      (effects (font (size 1 1) (thickness 0.15)))
    )
    (fp_text value 10u (at 0 1.43 90) (layer F.Fab)
      (effects (font (size 1 1) (thickness 0.15)))
    )
    (fp_line (start -0.8 0.4) (end -0.8 -0.4) (layer F.Fab) (width 0.1))
    (fp_line (start -0.8 -0.4) (end 0.8 -0.4) (layer F.Fab) (width 0.1))
    (fp_line (start 0.8 -0.4) (end 0.8 0.4) (layer F.Fab) (width 0.1))
    (fp_line (start 0.8 0.4) (end -0.8 0.4) (layer F.Fab) (width 0.1))
    (fp_line (start -0.171267 -0.51) (end 0.171267 -0.51) (layer F.SilkS) (width 0.12))
    (fp_line (start -0.171267 0.51) (end 0.171267 0.51) (layer F.SilkS) (width 0.12))
    (fp_line (start -1.65 0.73) (end -1.65 -0.73) (layer F.CrtYd) (width 0.05))
    (fp_line (start -1.65 -0.73) (end 1.65 -0.73) (layer F.CrtYd) (width 0.05))
    (fp_line (start 1.65 -0.73) (end 1.65 0.73) (layer F.CrtYd) (width 0.05))
    (fp_line (start 1.65 0.73) (end -1.65 0.73) (layer F.CrtYd) (width 0.05))
    (fp_text user %R (at 0 0 90) (layer F.Fab)
      (effects (font (size 0.4 0.4) (thickness 0.06)))
    )
    (pad 1 smd roundrect (at -0.875 0 90) (size 1.05 0.95) (layers F.Cu F.Paste F.Mask) (roundrect_rratio 0.25)
      (net 1 3V3))
    (pad 2 smd roundrect (at 0.875 0 90) (size 1.05 0.95) (layers F.Cu F.Paste F.Mask) (roundrect_rratio 0.25)
      (net 2 GND))
    (model ${KISYS3DMOD}/Capacitor_SMD.3dshapes/C_0603_1608Metric.wrl
      (at (xyz 0 0 0))
      (scale (xyz 1 1 1))
      (rotate (xyz 0 0 0))
    )
  )

  (module capstone_footprints:CX2024NL locked (layer B.Cu) (tedit 5C0F34CD) (tstamp 5C29BB87)
    (at 188.6375 86.078 270)
    (path /5C1D7F71)
    (fp_text reference T1 (at 3.302 -5.334 270) (layer B.SilkS)
      (effects (font (size 1 1) (thickness 0.15)) (justify mirror))
    )
    (fp_text value CX2024NL (at 2.794 1.524 270) (layer B.Fab)
      (effects (font (size 1 1) (thickness 0.15)) (justify mirror))
    )
    (fp_line (start 0 0.762) (end 5.842 0.762) (layer B.SilkS) (width 0.15))
    (fp_line (start 5.842 0.762) (end 5.842 -4.572) (layer B.SilkS) (width 0.15))
    (fp_line (start 5.842 -4.572) (end 0 -4.572) (layer B.SilkS) (width 0.15))
    (fp_line (start 0 -4.572) (end 0 0.762) (layer B.SilkS) (width 0.15))
    (pad 1 smd rect (at 0 0 270) (size 1.524 1.27) (layers B.Cu B.Paste B.Mask)
      (net 16 /Ant_Unbal))
    (pad "" smd rect (at 0 -1.8542 270) (size 1.524 1.27) (layers B.Cu B.Paste B.Mask))
    (pad 2 smd rect (at 0 -3.7084 270) (size 1.524 1.27) (layers B.Cu B.Paste B.Mask)
      (net 2 GND))
    (pad 3 smd rect (at 5.8166 -3.7084 270) (size 1.524 1.27) (layers B.Cu B.Paste B.Mask)
      (net 15 /Ant_N))
    (pad "" smd rect (at 5.8166 -1.8542 270) (size 1.524 1.27) (layers B.Cu B.Paste B.Mask))
    (pad 4 smd rect (at 5.8166 0 270) (size 1.524 1.27) (layers B.Cu B.Paste B.Mask)
      (net 17 "Net-(C3-Pad1)"))
    (model ${CAPSTONE_3DMOD}/balun.step
      (offset (xyz 2.9 -1.9 0))
      (scale (xyz 1.2 1 1.1))
      (rotate (xyz -90 0 90))
    )
  )

  (module Capacitor_SMD:C_0603_1608Metric (layer B.Cu) (tedit 5B301BBE) (tstamp 5C355128)
    (at 191.3625 95.2875)
    (descr "Capacitor SMD 0603 (1608 Metric), square (rectangular) end terminal, IPC_7351 nominal, (Body size source: http://www.tortai-tech.com/upload/download/2011102023233369053.pdf), generated with kicad-footprint-generator")
    (tags capacitor)
    (path /5C1D68BC)
    (attr smd)
    (fp_text reference C2 (at 2.3625 0) (layer B.SilkS)
      (effects (font (size 1 1) (thickness 0.15)) (justify mirror))
    )
    (fp_text value 7.2p (at 0 -1.43) (layer B.Fab)
      (effects (font (size 1 1) (thickness 0.15)) (justify mirror))
    )
    (fp_line (start -0.8 -0.4) (end -0.8 0.4) (layer B.Fab) (width 0.1))
    (fp_line (start -0.8 0.4) (end 0.8 0.4) (layer B.Fab) (width 0.1))
    (fp_line (start 0.8 0.4) (end 0.8 -0.4) (layer B.Fab) (width 0.1))
    (fp_line (start 0.8 -0.4) (end -0.8 -0.4) (layer B.Fab) (width 0.1))
    (fp_line (start -0.162779 0.51) (end 0.162779 0.51) (layer B.SilkS) (width 0.12))
    (fp_line (start -0.162779 -0.51) (end 0.162779 -0.51) (layer B.SilkS) (width 0.12))
    (fp_line (start -1.48 -0.73) (end -1.48 0.73) (layer B.CrtYd) (width 0.05))
    (fp_line (start -1.48 0.73) (end 1.48 0.73) (layer B.CrtYd) (width 0.05))
    (fp_line (start 1.48 0.73) (end 1.48 -0.73) (layer B.CrtYd) (width 0.05))
    (fp_line (start 1.48 -0.73) (end -1.48 -0.73) (layer B.CrtYd) (width 0.05))
    (fp_text user %R (at 0 0) (layer B.Fab)
      (effects (font (size 0.4 0.4) (thickness 0.06)) (justify mirror))
    )
    (pad 1 smd roundrect (at -0.7875 0) (size 0.875 0.95) (layers B.Cu B.Paste B.Mask) (roundrect_rratio 0.25)
      (net 14 /Ant_P))
    (pad 2 smd roundrect (at 0.7875 0) (size 0.875 0.95) (layers B.Cu B.Paste B.Mask) (roundrect_rratio 0.25)
      (net 15 /Ant_N))
    (model ${KISYS3DMOD}/Capacitor_SMD.3dshapes/C_0603_1608Metric.wrl
      (at (xyz 0 0 0))
      (scale (xyz 1 1 1))
      (rotate (xyz 0 0 0))
    )
  )

  (module Capacitor_SMD:C_0603_1608Metric (layer B.Cu) (tedit 5B301BBE) (tstamp 5C355138)
    (at 191.3625 93.7125)
    (descr "Capacitor SMD 0603 (1608 Metric), square (rectangular) end terminal, IPC_7351 nominal, (Body size source: http://www.tortai-tech.com/upload/download/2011102023233369053.pdf), generated with kicad-footprint-generator")
    (tags capacitor)
    (path /5C1D6959)
    (attr smd)
    (fp_text reference C3 (at 2.3625 0) (layer B.SilkS)
      (effects (font (size 1 1) (thickness 0.15)) (justify mirror))
    )
    (fp_text value 8p (at 0 -1.43) (layer B.Fab)
      (effects (font (size 1 1) (thickness 0.15)) (justify mirror))
    )
    (fp_text user %R (at 0 0) (layer B.Fab)
      (effects (font (size 0.4 0.4) (thickness 0.06)) (justify mirror))
    )
    (fp_line (start 1.48 -0.73) (end -1.48 -0.73) (layer B.CrtYd) (width 0.05))
    (fp_line (start 1.48 0.73) (end 1.48 -0.73) (layer B.CrtYd) (width 0.05))
    (fp_line (start -1.48 0.73) (end 1.48 0.73) (layer B.CrtYd) (width 0.05))
    (fp_line (start -1.48 -0.73) (end -1.48 0.73) (layer B.CrtYd) (width 0.05))
    (fp_line (start -0.162779 -0.51) (end 0.162779 -0.51) (layer B.SilkS) (width 0.12))
    (fp_line (start -0.162779 0.51) (end 0.162779 0.51) (layer B.SilkS) (width 0.12))
    (fp_line (start 0.8 -0.4) (end -0.8 -0.4) (layer B.Fab) (width 0.1))
    (fp_line (start 0.8 0.4) (end 0.8 -0.4) (layer B.Fab) (width 0.1))
    (fp_line (start -0.8 0.4) (end 0.8 0.4) (layer B.Fab) (width 0.1))
    (fp_line (start -0.8 -0.4) (end -0.8 0.4) (layer B.Fab) (width 0.1))
    (pad 2 smd roundrect (at 0.7875 0) (size 0.875 0.95) (layers B.Cu B.Paste B.Mask) (roundrect_rratio 0.25)
      (net 15 /Ant_N))
    (pad 1 smd roundrect (at -0.7875 0) (size 0.875 0.95) (layers B.Cu B.Paste B.Mask) (roundrect_rratio 0.25)
      (net 17 "Net-(C3-Pad1)"))
    (model ${KISYS3DMOD}/Capacitor_SMD.3dshapes/C_0603_1608Metric.wrl
      (at (xyz 0 0 0))
      (scale (xyz 1 1 1))
      (rotate (xyz 0 0 0))
    )
  )

  (module Inductor_SMD:L_0603_1608Metric (layer B.Cu) (tedit 5B301BBE) (tstamp 5C355148)
    (at 189 94.5 90)
    (descr "Inductor SMD 0603 (1608 Metric), square (rectangular) end terminal, IPC_7351 nominal, (Body size source: http://www.tortai-tech.com/upload/download/2011102023233369053.pdf), generated with kicad-footprint-generator")
    (tags inductor)
    (path /5C1D691D)
    (attr smd)
    (fp_text reference L1 (at 0 -1.575 90) (layer B.SilkS)
      (effects (font (size 1 1) (thickness 0.15)) (justify mirror))
    )
    (fp_text value 6.8n (at 0 -1.43 90) (layer B.Fab)
      (effects (font (size 1 1) (thickness 0.15)) (justify mirror))
    )
    (fp_line (start -0.8 -0.4) (end -0.8 0.4) (layer B.Fab) (width 0.1))
    (fp_line (start -0.8 0.4) (end 0.8 0.4) (layer B.Fab) (width 0.1))
    (fp_line (start 0.8 0.4) (end 0.8 -0.4) (layer B.Fab) (width 0.1))
    (fp_line (start 0.8 -0.4) (end -0.8 -0.4) (layer B.Fab) (width 0.1))
    (fp_line (start -0.162779 0.51) (end 0.162779 0.51) (layer B.SilkS) (width 0.12))
    (fp_line (start -0.162779 -0.51) (end 0.162779 -0.51) (layer B.SilkS) (width 0.12))
    (fp_line (start -1.48 -0.73) (end -1.48 0.73) (layer B.CrtYd) (width 0.05))
    (fp_line (start -1.48 0.73) (end 1.48 0.73) (layer B.CrtYd) (width 0.05))
    (fp_line (start 1.48 0.73) (end 1.48 -0.73) (layer B.CrtYd) (width 0.05))
    (fp_line (start 1.48 -0.73) (end -1.48 -0.73) (layer B.CrtYd) (width 0.05))
    (fp_text user %R (at 0 0 90) (layer B.Fab)
      (effects (font (size 0.4 0.4) (thickness 0.06)) (justify mirror))
    )
    (pad 1 smd roundrect (at -0.7875 0 90) (size 0.875 0.95) (layers B.Cu B.Paste B.Mask) (roundrect_rratio 0.25)
      (net 14 /Ant_P))
    (pad 2 smd roundrect (at 0.7875 0 90) (size 0.875 0.95) (layers B.Cu B.Paste B.Mask) (roundrect_rratio 0.25)
      (net 17 "Net-(C3-Pad1)"))
    (model ${KISYS3DMOD}/Inductor_SMD.3dshapes/L_0603_1608Metric.wrl
      (at (xyz 0 0 0))
      (scale (xyz 1 1 1))
      (rotate (xyz 0 0 0))
    )
  )

  (module capstone_footprints:MOLEX_878331420 locked (layer F.Cu) (tedit 5C3E5F65) (tstamp 5C3E67E2)
    (at 190.5 71.2)
    (path /5C27ECB8)
    (fp_text reference J1 (at -9.525 -2) (layer F.SilkS)
      (effects (font (size 1 1) (thickness 0.15)))
    )
    (fp_text value Conn_02x07_Odd_Even (at 0 4) (layer F.Fab)
      (effects (font (size 1 1) (thickness 0.15)))
    )
    (fp_line (start -8.325 -6.4) (end 8.325 -6.4) (layer F.SilkS) (width 0.15))
    (fp_line (start -8.325 1) (end -8.325 -6.4) (layer F.SilkS) (width 0.15))
    (fp_line (start 8.325 1) (end -8.325 1) (layer F.SilkS) (width 0.15))
    (fp_line (start 8.325 1) (end 8.325 -6.4) (layer F.SilkS) (width 0.15))
    (fp_line (start -7 -6.4) (end -6 -5) (layer F.SilkS) (width 0.15))
    (fp_line (start -5 -6.4) (end -6 -5) (layer F.SilkS) (width 0.15))
    (pad 1 thru_hole circle (at -6 0) (size 1.5 1.5) (drill 0.9) (layers *.Cu *.Mask)
      (net 1 3V3))
    (pad 2 thru_hole circle (at -6 2) (size 1.5 1.5) (drill 0.9) (layers *.Cu *.Mask)
      (net 2 GND))
    (pad 3 thru_hole circle (at -4 0) (size 1.5 1.5) (drill 0.9) (layers *.Cu *.Mask)
      (net 2 GND))
    (pad 4 thru_hole circle (at -4 2) (size 1.5 1.5) (drill 0.9) (layers *.Cu *.Mask)
      (net 6 /DIO3_3V3))
    (pad 5 thru_hole circle (at -2 0) (size 1.5 1.5) (drill 0.9) (layers *.Cu *.Mask)
      (net 5 /MISO_3V3))
    (pad 6 thru_hole circle (at -2 2) (size 1.5 1.5) (drill 0.9) (layers *.Cu *.Mask)
      (net 8 /DIO4_3V3))
    (pad 7 thru_hole circle (at 0 0) (size 1.5 1.5) (drill 0.9) (layers *.Cu *.Mask)
      (net 7 /MOSI_3V3))
    (pad 8 thru_hole circle (at 0 2) (size 1.5 1.5) (drill 0.9) (layers *.Cu *.Mask)
      (net 13 /DIO0_3V3))
    (pad 9 thru_hole circle (at 2 0) (size 1.5 1.5) (drill 0.9) (layers *.Cu *.Mask)
      (net 9 /SCLK_3V3))
    (pad 10 thru_hole circle (at 2 2) (size 1.5 1.5) (drill 0.9) (layers *.Cu *.Mask)
      (net 3 /DIO1_3V3))
    (pad 11 thru_hole circle (at 4 0) (size 1.5 1.5) (drill 0.9) (layers *.Cu *.Mask)
      (net 12 /CS_3V3))
    (pad 12 thru_hole circle (at 4 2) (size 1.5 1.5) (drill 0.9) (layers *.Cu *.Mask)
      (net 4 /DIO2_3V3))
    (pad 13 thru_hole circle (at 6 0) (size 1.5 1.5) (drill 0.9) (layers *.Cu *.Mask)
      (net 11 /RST_3V3))
    (pad 14 thru_hole circle (at 6 2) (size 1.5 1.5) (drill 0.9) (layers *.Cu *.Mask)
      (net 10 /DIO5_3V3))
    (model ${CAPSTONE_3DMOD}/878331420.stp
      (offset (xyz 0 3.2 3.4))
      (scale (xyz 1 1 1))
      (rotate (xyz 0 0 0))
    )
  )

  (module MountingHole:MountingHole_3.2mm_M3_ISO7380_Pad (layer F.Cu) (tedit 5C4205FC) (tstamp 5C61D9B1)
    (at 178.435 74.295)
    (descr "Mounting Hole 3.2mm, M3, ISO7380")
    (tags "mounting hole 3.2mm m3 iso7380")
    (attr virtual)
    (fp_text reference REF** (at -2.54 -4.445) (layer F.SilkS) hide
      (effects (font (size 1 1) (thickness 0.15)))
    )
    (fp_text value MountingHole_3.2mm_M3_ISO7380_Pad (at 0 3.85) (layer F.Fab)
      (effects (font (size 1 1) (thickness 0.15)))
    )
    (fp_circle (center 0 0) (end 3.1 0) (layer F.CrtYd) (width 0.05))
    (fp_circle (center 0 0) (end 2.85 0) (layer Cmts.User) (width 0.15))
    (fp_text user %R (at 0.3 0) (layer F.Fab)
      (effects (font (size 1 1) (thickness 0.15)))
    )
    (pad 1 thru_hole circle (at 0 0) (size 5.7 5.7) (drill 3.2) (layers *.Cu *.Mask))
  )

  (module capstone_footprints:LOGO_SL_Small (layer B.Cu) (tedit 5C475E07) (tstamp 5C70FDED)
    (at 200 71.9 270)
    (fp_text reference G*** (at 0 0 270) (layer B.SilkS) hide
      (effects (font (size 1.524 1.524) (thickness 0.3)) (justify mirror))
    )
    (fp_text value LOGO (at 0.75 0 270) (layer B.SilkS) hide
      (effects (font (size 1.524 1.524) (thickness 0.3)) (justify mirror))
    )
    (fp_poly (pts (xy 1.644338 2.165309) (xy 1.696826 2.165204) (xy 1.739114 2.164955) (xy 1.772453 2.164504)
      (xy 1.798093 2.163793) (xy 1.817283 2.162765) (xy 1.831275 2.161361) (xy 1.841318 2.159525)
      (xy 1.848662 2.157198) (xy 1.854558 2.154324) (xy 1.857536 2.15255) (xy 1.874261 2.138054)
      (xy 1.888406 2.119093) (xy 1.890036 2.116038) (xy 1.891811 2.112041) (xy 1.893403 2.107118)
      (xy 1.894822 2.100578) (xy 1.896081 2.09173) (xy 1.897192 2.079883) (xy 1.898167 2.064347)
      (xy 1.899018 2.044431) (xy 1.899756 2.019443) (xy 1.900395 1.988694) (xy 1.900946 1.951491)
      (xy 1.901421 1.907146) (xy 1.901831 1.854965) (xy 1.90219 1.79426) (xy 1.902508 1.724338)
      (xy 1.902799 1.64451) (xy 1.903074 1.554083) (xy 1.903344 1.452368) (xy 1.903623 1.338674)
      (xy 1.903635 1.3335) (xy 1.903894 1.210296) (xy 1.904052 1.099311) (xy 1.904104 1.000067)
      (xy 1.904048 0.912085) (xy 1.90388 0.834884) (xy 1.903597 0.767985) (xy 1.903196 0.71091)
      (xy 1.902672 0.663178) (xy 1.902022 0.62431) (xy 1.901244 0.593827) (xy 1.900333 0.571249)
      (xy 1.899286 0.556096) (xy 1.898101 0.54789) (xy 1.898045 0.547679) (xy 1.883952 0.518584)
      (xy 1.866053 0.498467) (xy 1.841463 0.47625) (xy 1.623994 0.476274) (xy 1.561739 0.476319)
      (xy 1.510882 0.476598) (xy 1.470122 0.477355) (xy 1.438156 0.478828) (xy 1.413683 0.481261)
      (xy 1.395401 0.484895) (xy 1.382008 0.48997) (xy 1.372202 0.496728) (xy 1.364682 0.505411)
      (xy 1.358145 0.516259) (xy 1.352806 0.526548) (xy 1.349462 0.533627) (xy 1.346748 0.541323)
      (xy 1.344599 0.550966) (xy 1.342948 0.56389) (xy 1.341731 0.581425) (xy 1.340881 0.604903)
      (xy 1.340334 0.635656) (xy 1.340023 0.675015) (xy 1.339883 0.724312) (xy 1.33985 0.784879)
      (xy 1.33985 0.789863) (xy 1.339673 0.864056) (xy 1.339079 0.926809) (xy 1.337972 0.979378)
      (xy 1.336254 1.02302) (xy 1.33383 1.05899) (xy 1.330603 1.088545) (xy 1.326477 1.112941)
      (xy 1.321356 1.133433) (xy 1.315142 1.151279) (xy 1.311453 1.159918) (xy 1.296796 1.186278)
      (xy 1.281916 1.200393) (xy 1.266115 1.202712) (xy 1.253396 1.197082) (xy 1.236736 1.182153)
      (xy 1.221891 1.159618) (xy 1.207864 1.127672) (xy 1.196558 1.094112) (xy 1.182845 1.057271)
      (xy 1.167368 1.031835) (xy 1.14893 1.016526) (xy 1.126334 1.010061) (xy 1.1176 1.00965)
      (xy 1.091625 1.014229) (xy 1.070656 1.02858) (xy 1.053789 1.053622) (xy 1.040821 1.087889)
      (xy 1.026411 1.13084) (xy 1.011981 1.162231) (xy 0.996947 1.183191) (xy 0.987343 1.191263)
      (xy 0.975129 1.197866) (xy 0.965415 1.196883) (xy 0.955077 1.190818) (xy 0.938998 1.174126)
      (xy 0.924312 1.147246) (xy 0.912074 1.112685) (xy 0.903337 1.072951) (xy 0.902122 1.064754)
      (xy 0.900527 1.046656) (xy 0.899058 1.017705) (xy 0.897761 0.979744) (xy 0.896683 0.934619)
      (xy 0.895867 0.884175) (xy 0.895362 0.830258) (xy 0.89521 0.785354) (xy 0.895133 0.724774)
      (xy 0.894939 0.675526) (xy 0.894563 0.636243) (xy 0.893939 0.605557) (xy 0.893 0.582099)
      (xy 0.891682 0.564502) (xy 0.889918 0.551399) (xy 0.887643 0.541421) (xy 0.884792 0.533201)
      (xy 0.882879 0.528769) (xy 0.869225 0.507152) (xy 0.851842 0.490507) (xy 0.849681 0.489105)
      (xy 0.843463 0.485652) (xy 0.836415 0.482883) (xy 0.827153 0.480722) (xy 0.81429 0.479095)
      (xy 0.796443 0.477929) (xy 0.772226 0.477148) (xy 0.740254 0.476679) (xy 0.699143 0.476447)
      (xy 0.647508 0.476377) (xy 0.612775 0.476381) (xy 0.554552 0.476435) (xy 0.50765 0.476596)
      (xy 0.470687 0.476941) (xy 0.442284 0.477547) (xy 0.42106 0.47849) (xy 0.405635 0.479846)
      (xy 0.394629 0.481692) (xy 0.386662 0.484104) (xy 0.380354 0.487157) (xy 0.376619 0.489439)
      (xy 0.361089 0.503495) (xy 0.346813 0.522909) (xy 0.343281 0.529437) (xy 0.341322 0.533642)
      (xy 0.33957 0.538183) (xy 0.338011 0.543752) (xy 0.336636 0.551043) (xy 0.335433 0.560747)
      (xy 0.334389 0.573556) (xy 0.333495 0.590163) (xy 0.332738 0.611259) (xy 0.332106 0.637536)
      (xy 0.33159 0.669688) (xy 0.331176 0.708406) (xy 0.330853 0.754382) (xy 0.330611 0.808309)
      (xy 0.330438 0.870878) (xy 0.330321 0.942782) (xy 0.330251 1.024713) (xy 0.330215 1.117363)
      (xy 0.330201 1.221424) (xy 0.3302 1.3208) (xy 0.3302 2.085141) (xy 0.343766 2.113166)
      (xy 0.349788 2.125533) (xy 0.355578 2.135772) (xy 0.362327 2.144085) (xy 0.371224 2.150671)
      (xy 0.383458 2.155733) (xy 0.400219 2.15947) (xy 0.422698 2.162084) (xy 0.452083 2.163775)
      (xy 0.489565 2.164744) (xy 0.536334 2.165192) (xy 0.593578 2.16532) (xy 0.652777 2.165327)
      (xy 0.719775 2.165311) (xy 0.775266 2.165147) (xy 0.820446 2.164679) (xy 0.856508 2.163753)
      (xy 0.884646 2.162214) (xy 0.906055 2.159907) (xy 0.921928 2.156677) (xy 0.93346 2.152369)
      (xy 0.941844 2.146828) (xy 0.948275 2.1399) (xy 0.953947 2.131428) (xy 0.957318 2.125817)
      (xy 0.964153 2.112583) (xy 0.974544 2.090289) (xy 0.987272 2.061646) (xy 1.001119 2.029362)
      (xy 1.006661 2.016125) (xy 1.020542 1.983479) (xy 1.033764 1.953737) (xy 1.045129 1.929498)
      (xy 1.05344 1.913363) (xy 1.055705 1.909667) (xy 1.077239 1.887852) (xy 1.102749 1.876896)
      (xy 1.129719 1.877066) (xy 1.155631 1.88863) (xy 1.166565 1.89791) (xy 1.176678 1.911519)
      (xy 1.189269 1.933403) (xy 1.202355 1.959949) (xy 1.20914 1.975456) (xy 1.230138 2.025319)
      (xy 1.247339 2.064678) (xy 1.261466 2.094898) (xy 1.273242 2.117345) (xy 1.283388 2.133383)
      (xy 1.292629 2.144378) (xy 1.301685 2.151694) (xy 1.302826 2.15241) (xy 1.308556 2.155622)
      (xy 1.31502 2.158252) (xy 1.323472 2.160358) (xy 1.335165 2.161998) (xy 1.351349 2.163231)
      (xy 1.373278 2.164114) (xy 1.402204 2.164705) (xy 1.43938 2.165065) (xy 1.486056 2.165249)
      (xy 1.543487 2.165318) (xy 1.5804 2.165327) (xy 1.644338 2.165309)) (layer B.SilkS) (width 0.01))
    (fp_poly (pts (xy -1.327151 2.02024) (xy -1.327151 1.633829) (xy -1.312863 1.612897) (xy -1.304583 1.601278)
      (xy -1.296311 1.591882) (xy -1.286662 1.584474) (xy -1.274253 1.578819) (xy -1.257699 1.574679)
      (xy -1.235618 1.571819) (xy -1.206625 1.570002) (xy -1.169337 1.568993) (xy -1.12237 1.568555)
      (xy -1.06434 1.568452) (xy -1.052408 1.56845) (xy -0.992573 1.568521) (xy -0.94403 1.568857)
      (xy -0.905369 1.569647) (xy -0.875182 1.57108) (xy -0.85206 1.573344) (xy -0.834595 1.576629)
      (xy -0.821379 1.581122) (xy -0.811002 1.587011) (xy -0.802057 1.594486) (xy -0.79375 1.603066)
      (xy -0.777875 1.620268) (xy -0.774419 2.40665) (xy -0.20947 2.40665) (xy -0.211098 0.446088)
      (xy -0.212725 -1.514475) (xy -0.227972 -1.535852) (xy -0.23691 -1.547604) (xy -0.246176 -1.557115)
      (xy -0.257159 -1.564623) (xy -0.271248 -1.570364) (xy -0.289834 -1.574577) (xy -0.314305 -1.577498)
      (xy -0.346051 -1.579365) (xy -0.386461 -1.580415) (xy -0.436924 -1.580886) (xy -0.492368 -1.58101)
      (xy -0.547684 -1.581021) (xy -0.59181 -1.580902) (xy -0.626256 -1.58056) (xy -0.652532 -1.579898)
      (xy -0.672148 -1.578823) (xy -0.686613 -1.577239) (xy -0.697438 -1.575052) (xy -0.706132 -1.572166)
      (xy -0.714206 -1.568486) (xy -0.717421 -1.566862) (xy -0.737213 -1.554397) (xy -0.753986 -1.539911)
      (xy -0.758454 -1.534647) (xy -0.759991 -1.53245) (xy -0.761404 -1.529902) (xy -0.7627 -1.526476)
      (xy -0.763884 -1.521647) (xy -0.764965 -1.514888) (xy -0.765948 -1.505673) (xy -0.76684 -1.493477)
      (xy -0.767647 -1.477774) (xy -0.768377 -1.458037) (xy -0.769036 -1.43374) (xy -0.76963 -1.404358)
      (xy -0.770167 -1.369364) (xy -0.770653 -1.328233) (xy -0.771094 -1.280438) (xy -0.771497 -1.225454)
      (xy -0.771869 -1.162754) (xy -0.772216 -1.091813) (xy -0.772546 -1.012104) (xy -0.772864 -0.923101)
      (xy -0.773178 -0.824279) (xy -0.773493 -0.715111) (xy -0.773818 -0.595072) (xy -0.774157 -0.463635)
      (xy -0.774519 -0.320275) (xy -0.7747 -0.247696) (xy -0.777875 1.021329) (xy -0.79375 1.038533)
      (xy -0.802631 1.047659) (xy -0.811627 1.055024) (xy -0.822147 1.060816) (xy -0.8356 1.065224)
      (xy -0.853395 1.068435) (xy -0.876939 1.070639) (xy -0.907642 1.072024) (xy -0.946912 1.072779)
      (xy -0.996157 1.073091) (xy -1.052408 1.07315) (xy -1.112613 1.073083) (xy -1.161503 1.072724)
      (xy -1.200459 1.071837) (xy -1.230867 1.070186) (xy -1.254111 1.067534) (xy -1.271573 1.063647)
      (xy -1.284637 1.058286) (xy -1.294688 1.051217) (xy -1.303109 1.042203) (xy -1.311284 1.031008)
      (xy -1.312863 1.028704) (xy -1.32715 1.007772) (xy -1.32715 -0.315621) (xy -1.341489 -0.337198)
      (xy -1.35624 -0.353429) (xy -1.376299 -0.368626) (xy -1.38411 -0.373062) (xy -1.392451 -0.377072)
      (xy -1.400839 -0.380252) (xy -1.410788 -0.382699) (xy -1.423811 -0.384507) (xy -1.441424 -0.385773)
      (xy -1.46514 -0.386595) (xy -1.496476 -0.387066) (xy -1.536944 -0.387285) (xy -1.58806 -0.387347)
      (xy -1.609066 -0.38735) (xy -1.664461 -0.387313) (xy -1.708672 -0.387141) (xy -1.743214 -0.386743)
      (xy -1.769605 -0.386027) (xy -1.789358 -0.384902) (xy -1.803991 -0.383275) (xy -1.815019 -0.381057)
      (xy -1.823958 -0.378154) (xy -1.832324 -0.374476) (xy -1.833766 -0.373783) (xy -1.853433 -0.361335)
      (xy -1.86971 -0.346096) (xy -1.873847 -0.340445) (xy -1.875218 -0.33794) (xy -1.87648 -0.334763)
      (xy -1.877639 -0.330407) (xy -1.878699 -0.324364) (xy -1.879664 -0.316128) (xy -1.880539 -0.30519)
      (xy -1.881329 -0.291043) (xy -1.882037 -0.27318) (xy -1.882668 -0.251094) (xy -1.883227 -0.224277)
      (xy -1.883718 -0.192222) (xy -1.884145 -0.154422) (xy -1.884513 -0.110369) (xy -1.884826 -0.059556)
      (xy -1.885089 -0.001475) (xy -1.885306 0.06438) (xy -1.885482 0.138517) (xy -1.885621 0.221444)
      (xy -1.885727 0.313668) (xy -1.885805 0.415696) (xy -1.885859 0.528036) (xy -1.885894 0.651194)
      (xy -1.885914 0.785679) (xy -1.885924 0.931997) (xy -1.885927 1.042988) (xy -1.88595 2.40665)
      (xy -1.32715 2.40665) (xy -1.327151 2.02024)) (layer B.SilkS) (width 0.01))
    (fp_poly (pts (xy 2.399066 -0.445547) (xy 2.401012 -0.449389) (xy 2.402599 -0.457078) (xy 2.403862 -0.469666)
      (xy 2.404838 -0.488204) (xy 2.405561 -0.513745) (xy 2.406067 -0.547339) (xy 2.406393 -0.590039)
      (xy 2.406573 -0.642896) (xy 2.406644 -0.706962) (xy 2.40665 -0.737279) (xy 2.40665 -1.030059)
      (xy 2.346795 -1.086705) (xy 2.283565 -1.15239) (xy 2.232227 -1.218899) (xy 2.191985 -1.28757)
      (xy 2.162041 -1.359744) (xy 2.143249 -1.42875) (xy 2.135183 -1.474175) (xy 2.13046 -1.520278)
      (xy 2.129167 -1.568903) (xy 2.131394 -1.621892) (xy 2.137229 -1.681089) (xy 2.14676 -1.748336)
      (xy 2.160075 -1.825478) (xy 2.163058 -1.8415) (xy 2.174646 -1.904048) (xy 2.183849 -1.95621)
      (xy 2.190924 -2.00002) (xy 2.196124 -2.037514) (xy 2.199706 -2.070728) (xy 2.201925 -2.101696)
      (xy 2.203037 -2.132454) (xy 2.203302 -2.162175) (xy 2.201393 -2.224118) (xy 2.195332 -2.278225)
      (xy 2.184441 -2.328878) (xy 2.170591 -2.373312) (xy 2.156651 -2.413) (xy 1.702213 -2.412863)
      (xy 1.247775 -2.412727) (xy 1.311275 -2.379281) (xy 1.342466 -2.362272) (xy 1.374598 -2.343788)
      (xy 1.402933 -2.326594) (xy 1.41605 -2.318109) (xy 1.449822 -2.292464) (xy 1.486998 -2.259342)
      (xy 1.524548 -2.221865) (xy 1.559446 -2.183156) (xy 1.588661 -2.146338) (xy 1.602756 -2.125568)
      (xy 1.631485 -2.074616) (xy 1.654286 -2.02303) (xy 1.671275 -1.969454) (xy 1.682568 -1.912534)
      (xy 1.688281 -1.850914) (xy 1.68853 -1.783237) (xy 1.68343 -1.708149) (xy 1.673097 -1.624295)
      (xy 1.657647 -1.530318) (xy 1.654895 -1.515262) (xy 1.641008 -1.437614) (xy 1.630178 -1.370602)
      (xy 1.622324 -1.312552) (xy 1.617362 -1.261795) (xy 1.615209 -1.21666) (xy 1.615783 -1.175475)
      (xy 1.619001 -1.13657) (xy 1.62478 -1.098274) (xy 1.632394 -1.061675) (xy 1.656306 -0.982456)
      (xy 1.690535 -0.908313) (xy 1.735763 -0.838087) (xy 1.792673 -0.77062) (xy 1.820209 -0.742841)
      (xy 1.880345 -0.688652) (xy 1.941865 -0.641558) (xy 2.007883 -0.599505) (xy 2.081515 -0.560441)
      (xy 2.133352 -0.536379) (xy 2.15944 -0.5254) (xy 2.191519 -0.5128) (xy 2.227362 -0.499357)
      (xy 2.26474 -0.485847) (xy 2.301426 -0.473048) (xy 2.335193 -0.461737) (xy 2.363814 -0.45269)
      (xy 2.385059 -0.446685) (xy 2.396703 -0.4445) (xy 2.396726 -0.4445) (xy 2.399066 -0.445547)) (layer B.SilkS) (width 0.01))
    (fp_poly (pts (xy 2.40665 -0.19685) (xy 2.392362 -0.196889) (xy 2.378412 -0.198327) (xy 2.354185 -0.202303)
      (xy 2.32175 -0.208373) (xy 2.283178 -0.216095) (xy 2.240536 -0.225029) (xy 2.195895 -0.23473)
      (xy 2.151322 -0.244757) (xy 2.108888 -0.254669) (xy 2.070662 -0.264022) (xy 2.038712 -0.272374)
      (xy 2.037249 -0.272776) (xy 1.953825 -0.297189) (xy 1.878969 -0.322357) (xy 1.808575 -0.349819)
      (xy 1.738535 -0.381117) (xy 1.704975 -0.39739) (xy 1.611636 -0.448237) (xy 1.530252 -0.50242)
      (xy 1.460435 -0.560286) (xy 1.401796 -0.62218) (xy 1.353948 -0.68845) (xy 1.329189 -0.732563)
      (xy 1.307436 -0.781929) (xy 1.292733 -0.831219) (xy 1.28424 -0.884281) (xy 1.281113 -0.944963)
      (xy 1.28106 -0.9525) (xy 1.281387 -0.984986) (xy 1.282814 -1.015349) (xy 1.285678 -1.04583)
      (xy 1.290316 -1.078667) (xy 1.297065 -1.116101) (xy 1.306261 -1.16037) (xy 1.318243 -1.213715)
      (xy 1.3243 -1.23985) (xy 1.342433 -1.323193) (xy 1.355364 -1.396509) (xy 1.363081 -1.46136)
      (xy 1.365575 -1.519309) (xy 1.362835 -1.571918) (xy 1.35485 -1.62075) (xy 1.341609 -1.667368)
      (xy 1.323104 -1.713334) (xy 1.321094 -1.717675) (xy 1.286453 -1.780127) (xy 1.242833 -1.838131)
      (xy 1.189786 -1.891971) (xy 1.126866 -1.941936) (xy 1.053625 -1.988311) (xy 0.969616 -2.031383)
      (xy 0.874391 -2.071439) (xy 0.767502 -2.108766) (xy 0.661852 -2.140018) (xy 0.600319 -2.15603)
      (xy 0.527176 -2.173532) (xy 0.443401 -2.192335) (xy 0.349972 -2.212252) (xy 0.247869 -2.233092)
      (xy 0.138069 -2.254668) (xy 0.021551 -2.276792) (xy -0.100706 -2.299273) (xy -0.227726 -2.321924)
      (xy -0.358528 -2.344555) (xy -0.492134 -2.366979) (xy -0.627567 -2.389007) (xy -0.638201 -2.390706)
      (xy -0.777874 -2.413) (xy -2.40665 -2.413) (xy -2.40665 -2.302249) (xy -2.406335 -2.266024)
      (xy -2.405458 -2.234353) (xy -2.404129 -2.209359) (xy -2.402455 -2.193166) (xy -2.400869 -2.187926)
      (xy -2.393208 -2.186483) (xy -2.374627 -2.184266) (xy -2.34687 -2.181446) (xy -2.311682 -2.178192)
      (xy -2.270808 -2.174673) (xy -2.231007 -2.17145) (xy -2.110093 -2.161512) (xy -1.992966 -2.150958)
      (xy -1.878272 -2.139601) (xy -1.764657 -2.127252) (xy -1.650768 -2.113725) (xy -1.535249 -2.098832)
      (xy -1.416748 -2.082385) (xy -1.293912 -2.064197) (xy -1.165385 -2.044081) (xy -1.029815 -2.021849)
      (xy -0.885847 -1.997313) (xy -0.732127 -1.970286) (xy -0.57785 -1.942501) (xy -0.433957 -1.915721)
      (xy -0.302046 -1.889834) (xy -0.18145 -1.864611) (xy -0.0715 -1.839828) (xy 0.028472 -1.815256)
      (xy 0.119133 -1.790669) (xy 0.201152 -1.76584) (xy 0.275197 -1.740543) (xy 0.341936 -1.71455)
      (xy 0.402037 -1.687636) (xy 0.456169 -1.659573) (xy 0.504998 -1.630135) (xy 0.549194 -1.599095)
      (xy 0.589424 -1.566226) (xy 0.622589 -1.535096) (xy 0.676082 -1.474899) (xy 0.717437 -1.412938)
      (xy 0.747204 -1.347915) (xy 0.765935 -1.278535) (xy 0.774184 -1.203499) (xy 0.7747 -1.177741)
      (xy 0.774015 -1.141906) (xy 0.771719 -1.106927) (xy 0.767449 -1.070378) (xy 0.760842 -1.029832)
      (xy 0.751534 -0.982864) (xy 0.739164 -0.927045) (xy 0.733631 -0.903209) (xy 0.719756 -0.842329)
      (xy 0.709089 -0.791256) (xy 0.701268 -0.747607) (xy 0.695934 -0.708999) (xy 0.692726 -0.673051)
      (xy 0.691283 -0.63738) (xy 0.691118 -0.6223) (xy 0.695466 -0.545749) (xy 0.709509 -0.475106)
      (xy 0.73387 -0.408947) (xy 0.769175 -0.34585) (xy 0.816048 -0.284391) (xy 0.860028 -0.237673)
      (xy 0.929961 -0.176407) (xy 1.010615 -0.119751) (xy 1.102125 -0.067659) (xy 1.20463 -0.020086)
      (xy 1.318267 0.023015) (xy 1.443174 0.06169) (xy 1.579488 0.095985) (xy 1.727346 0.125946)
      (xy 1.886886 0.151618) (xy 2.058246 0.173048) (xy 2.10185 0.177636) (xy 2.14864 0.182124)
      (xy 2.198124 0.186419) (xy 2.246341 0.190206) (xy 2.289332 0.193173) (xy 2.319337 0.19484)
      (xy 2.40665 0.198826) (xy 2.40665 -0.19685)) (layer B.SilkS) (width 0.01))
  )

  (gr_line (start 180.34 93.98) (end 173.99 93.98) (layer Edge.Cuts) (width 0.15))
  (gr_line (start 207.01 93.98) (end 200.66 93.98) (layer Edge.Cuts) (width 0.15))
  (gr_text "REV. A" (at 194.31 74.295 90) (layer B.SilkS)
    (effects (font (size 1.5 1.5) (thickness 0.3)) (justify left mirror))
  )
  (gr_poly (pts (xy 189.23 77.47) (xy 190.5 77.47) (xy 190.5 84.455) (xy 189.23 84.455)) (layer B.SilkS) (width 0.15))
  (gr_text "PN: 400001\nSN: " (at 189.23 74.295 90) (layer B.SilkS) (tstamp 5C61DF82)
    (effects (font (size 1 1) (thickness 0.2)) (justify left mirror))
  )
  (gr_text "HMS Radio Subboard\n" (at 186.69 74.295 90) (layer B.SilkS)
    (effects (font (size 1 1) (thickness 0.2)) (justify left mirror))
  )
  (gr_line (start 178.435 70.485) (end 178.435 65.405) (layer Edge.Cuts) (width 0.15))
  (gr_arc (start 178.435 74.295) (end 178.435 70.485) (angle -180) (layer Edge.Cuts) (width 0.15))
  (gr_text "72.2mm >" (at 197.485 97.79 180) (layer B.SilkS) (tstamp 5C27DBC0)
    (effects (font (size 1 1) (thickness 0.2)) (justify mirror))
  )
  (gr_text "72.2mm >" (at 183.515 97.79) (layer B.SilkS)
    (effects (font (size 1 1) (thickness 0.2)) (justify mirror))
  )
  (gr_line (start 200.66 90.17) (end 200.66 93.98) (layer Edge.Cuts) (width 0.15))
  (gr_line (start 203.2 86.36) (end 200.66 90.17) (layer Edge.Cuts) (width 0.15))
  (gr_line (start 203.2 65.405) (end 203.2 86.36) (layer Edge.Cuts) (width 0.15))
  (gr_line (start 178.435 65.405) (end 203.2 65.405) (layer Edge.Cuts) (width 0.15))
  (gr_line (start 178.435 85.09) (end 178.435 78.105) (layer Edge.Cuts) (width 0.15))
  (gr_line (start 180.34 86.36) (end 178.435 85.09) (layer Edge.Cuts) (width 0.15))
  (gr_line (start 180.34 93.98) (end 180.34 86.36) (layer Edge.Cuts) (width 0.15))
  (gr_line (start 173.99 101.6) (end 207.01 101.6) (layer Edge.Cuts) (width 0.15))
  (gr_line (start 170.18 101.6) (end 171.45 101.6) (layer Edge.Cuts) (width 0.15))
  (gr_line (start 170.18 93.98) (end 170.18 101.6) (layer Edge.Cuts) (width 0.15))
  (gr_line (start 171.45 93.98) (end 170.18 93.98) (layer Edge.Cuts) (width 0.15))
  (gr_line (start 210.82 101.6) (end 209.55 101.6) (layer Edge.Cuts) (width 0.15))
  (gr_line (start 210.82 93.98) (end 210.82 101.6) (layer Edge.Cuts) (width 0.15))
  (gr_line (start 209.55 93.98) (end 210.82 93.98) (layer Edge.Cuts) (width 0.15))
  (gr_arc (start 208.28 101.6) (end 209.55 101.6) (angle -180) (layer Edge.Cuts) (width 0.15))
  (gr_arc (start 208.28 93.98) (end 207.01 93.98) (angle -180) (layer Edge.Cuts) (width 0.15))
  (gr_arc (start 172.72 101.6) (end 173.99 101.6) (angle -180) (layer Edge.Cuts) (width 0.15))
  (gr_arc (start 172.72 93.98) (end 171.45 93.98) (angle -180) (layer Edge.Cuts) (width 0.15))
  (gr_text "915 MHz: 327.6mm wavelength\n1/10: 32.8mm" (at 147.875 76.5) (layer Cmts.User) (tstamp 5C1FBC97)
    (effects (font (size 1 1) (thickness 0.2)) (justify left))
  )
  (gr_text "JLCPCB 1Oz Cu:\n\nUsing JLC7628 (Er=4.60)\nw/ JLCPCB Impedance Calculator\n50 Ohm Trace = 0.29337mm" (at 147.875 67.375) (layer Cmts.User)
    (effects (font (size 1 1) (thickness 0.2)) (justify left))
  )

  (via (at 180.34 84.963) (size 0.8) (drill 0.4) (layers F.Cu B.Cu) (net 1))
  (segment (start 180.34 83.82) (end 180.34 84.963) (width 0.4) (layer F.Cu) (net 1))
  (via (at 180.34 80.772) (size 0.8) (drill 0.4) (layers F.Cu B.Cu) (net 2))
  (segment (start 180.34 82.07) (end 180.34 80.772) (width 0.4) (layer F.Cu) (net 2))
  (via (at 192.278 85.217) (size 0.8) (drill 0.4) (layers F.Cu B.Cu) (net 2))
  (segment (start 192.3459 86.078) (end 192.3459 85.2849) (width 0.4) (layer B.Cu) (net 2))
  (segment (start 192.3459 85.2849) (end 192.278 85.217) (width 0.4) (layer B.Cu) (net 2))
  (segment (start 192.5 74.26066) (end 192.5 73.2) (width 0.25) (layer F.Cu) (net 3))
  (segment (start 192.5 80.055002) (end 192.5 74.26066) (width 0.25) (layer F.Cu) (net 3))
  (segment (start 183.989002 88.566) (end 192.5 80.055002) (width 0.25) (layer F.Cu) (net 3))
  (segment (start 183.754 88.566) (end 183.989002 88.566) (width 0.25) (layer F.Cu) (net 3))
  (segment (start 183.989002 90.566) (end 183.754 90.566) (width 0.25) (layer F.Cu) (net 4))
  (segment (start 195.575001 78.980001) (end 183.989002 90.566) (width 0.25) (layer F.Cu) (net 4))
  (segment (start 195.575001 74.275001) (end 195.575001 78.980001) (width 0.25) (layer F.Cu) (net 4))
  (segment (start 194.5 73.2) (end 195.575001 74.275001) (width 0.25) (layer F.Cu) (net 4))
  (segment (start 189.249999 70.450001) (end 188.5 71.2) (width 0.25) (layer F.Cu) (net 5))
  (segment (start 197.575201 68.774969) (end 190.925031 68.774969) (width 0.25) (layer F.Cu) (net 5))
  (segment (start 202.329055 73.528823) (end 197.575201 68.774969) (width 0.25) (layer F.Cu) (net 5))
  (segment (start 202.329048 85.225954) (end 202.329055 73.528823) (width 0.25) (layer F.Cu) (net 5))
  (segment (start 190.925031 68.774969) (end 189.249999 70.450001) (width 0.25) (layer F.Cu) (net 5))
  (segment (start 198.989002 88.566) (end 202.329048 85.225954) (width 0.25) (layer F.Cu) (net 5))
  (segment (start 197.754 88.566) (end 198.989002 88.566) (width 0.25) (layer F.Cu) (net 5))
  (segment (start 186.5 74.26066) (end 186.5 73.2) (width 0.25) (layer F.Cu) (net 6))
  (segment (start 186.5 78.055002) (end 186.5 74.26066) (width 0.25) (layer F.Cu) (net 6))
  (segment (start 183.989002 80.566) (end 186.5 78.055002) (width 0.25) (layer F.Cu) (net 6))
  (segment (start 183.754 80.566) (end 183.989002 80.566) (width 0.25) (layer F.Cu) (net 6))
  (segment (start 191.249999 70.450001) (end 190.5 71.2) (width 0.25) (layer F.Cu) (net 7))
  (segment (start 192.475021 69.224979) (end 191.249999 70.450001) (width 0.25) (layer F.Cu) (net 7))
  (segment (start 197.388801 69.224979) (end 192.475021 69.224979) (width 0.25) (layer F.Cu) (net 7))
  (segment (start 201.879046 73.715224) (end 197.388801 69.224979) (width 0.25) (layer F.Cu) (net 7))
  (segment (start 201.879039 83.675963) (end 201.879046 73.715224) (width 0.25) (layer F.Cu) (net 7))
  (segment (start 198.989002 86.566) (end 201.879039 83.675963) (width 0.25) (layer F.Cu) (net 7))
  (segment (start 197.754 86.566) (end 198.989002 86.566) (width 0.25) (layer F.Cu) (net 7))
  (segment (start 188.5 74.26066) (end 188.5 73.2) (width 0.25) (layer F.Cu) (net 8))
  (segment (start 188.5 78.055002) (end 188.5 74.26066) (width 0.25) (layer F.Cu) (net 8))
  (segment (start 183.989002 82.566) (end 188.5 78.055002) (width 0.25) (layer F.Cu) (net 8))
  (segment (start 183.754 82.566) (end 183.989002 82.566) (width 0.25) (layer F.Cu) (net 8))
  (segment (start 193.249999 70.450001) (end 192.5 71.2) (width 0.25) (layer F.Cu) (net 9))
  (segment (start 194.025011 69.674989) (end 193.249999 70.450001) (width 0.25) (layer F.Cu) (net 9))
  (segment (start 201.42903 73.901618) (end 197.202401 69.674989) (width 0.25) (layer F.Cu) (net 9))
  (segment (start 197.202401 69.674989) (end 194.025011 69.674989) (width 0.25) (layer F.Cu) (net 9))
  (segment (start 201.429031 82.125971) (end 201.42903 73.901618) (width 0.25) (layer F.Cu) (net 9))
  (segment (start 198.989002 84.566) (end 201.429031 82.125971) (width 0.25) (layer F.Cu) (net 9))
  (segment (start 197.754 84.566) (end 198.989002 84.566) (width 0.25) (layer F.Cu) (net 9))
  (segment (start 197.56066 73.2) (end 196.5 73.2) (width 0.25) (layer F.Cu) (net 10))
  (segment (start 197.623002 73.2) (end 197.56066 73.2) (width 0.25) (layer F.Cu) (net 10))
  (segment (start 200.079001 75.655999) (end 197.623002 73.2) (width 0.25) (layer F.Cu) (net 10))
  (segment (start 200.079001 77.476001) (end 200.079001 75.655999) (width 0.25) (layer F.Cu) (net 10))
  (segment (start 198.989002 78.566) (end 200.079001 77.476001) (width 0.25) (layer F.Cu) (net 10))
  (segment (start 197.754 78.566) (end 198.989002 78.566) (width 0.25) (layer F.Cu) (net 10))
  (segment (start 197.249999 71.949999) (end 196.5 71.2) (width 0.25) (layer F.Cu) (net 11))
  (segment (start 200.529011 75.229011) (end 197.249999 71.949999) (width 0.25) (layer F.Cu) (net 11))
  (segment (start 200.529011 79.025991) (end 200.529011 75.229011) (width 0.25) (layer F.Cu) (net 11))
  (segment (start 198.989002 80.566) (end 200.529011 79.025991) (width 0.25) (layer F.Cu) (net 11))
  (segment (start 197.754 80.566) (end 198.989002 80.566) (width 0.25) (layer F.Cu) (net 11))
  (segment (start 195.249999 70.450001) (end 194.5 71.2) (width 0.25) (layer F.Cu) (net 12))
  (segment (start 195.575001 70.124999) (end 195.249999 70.450001) (width 0.25) (layer F.Cu) (net 12))
  (segment (start 200.979021 74.088019) (end 197.016001 70.124999) (width 0.25) (layer F.Cu) (net 12))
  (segment (start 197.016001 70.124999) (end 195.575001 70.124999) (width 0.25) (layer F.Cu) (net 12))
  (segment (start 200.979021 80.575981) (end 200.979021 74.088019) (width 0.25) (layer F.Cu) (net 12))
  (segment (start 198.989002 82.566) (end 200.979021 80.575981) (width 0.25) (layer F.Cu) (net 12))
  (segment (start 197.754 82.566) (end 198.989002 82.566) (width 0.25) (layer F.Cu) (net 12))
  (segment (start 190.5 74.26066) (end 190.5 73.2) (width 0.25) (layer F.Cu) (net 13))
  (segment (start 190.5 80.055002) (end 190.5 74.26066) (width 0.25) (layer F.Cu) (net 13))
  (segment (start 183.989002 86.566) (end 190.5 80.055002) (width 0.25) (layer F.Cu) (net 13))
  (segment (start 183.754 86.566) (end 183.989002 86.566) (width 0.25) (layer F.Cu) (net 13))
  (segment (start 189 97.56) (end 189.23 97.79) (width 0.29337) (layer B.Cu) (net 14))
  (segment (start 189 95.2875) (end 189 97.56) (width 0.29337) (layer B.Cu) (net 14))
  (segment (start 189 95.2875) (end 190.575 95.2875) (width 0.29337) (layer B.Cu) (net 14))
  (segment (start 192.3459 93.5166) (end 192.15 93.7125) (width 0.29337) (layer B.Cu) (net 15))
  (segment (start 192.3459 91.8946) (end 192.3459 93.5166) (width 0.29337) (layer B.Cu) (net 15))
  (segment (start 192.15 97.41) (end 191.77 97.79) (width 0.29337) (layer B.Cu) (net 15))
  (segment (start 192.15 95.2875) (end 192.15 97.41) (width 0.29337) (layer B.Cu) (net 15))
  (segment (start 192.15 93.7125) (end 192.15 95.2875) (width 0.29337) (layer B.Cu) (net 15))
  (segment (start 188.6375 84.997326) (end 188.6375 86.078) (width 0.29337) (layer B.Cu) (net 16))
  (segment (start 188.6375 80.247419) (end 188.6375 84.997326) (width 0.29337) (layer B.Cu) (net 16))
  (segment (start 184.956081 76.566) (end 188.6375 80.247419) (width 0.29337) (layer B.Cu) (net 16))
  (segment (start 183.754 76.566) (end 184.956081 76.566) (width 0.29337) (layer B.Cu) (net 16))
  (segment (start 188.6375 93.35) (end 189 93.7125) (width 0.25) (layer B.Cu) (net 17))
  (segment (start 188.6375 91.8946) (end 188.6375 93.35) (width 0.25) (layer B.Cu) (net 17))
  (segment (start 189 93.7125) (end 190.575 93.7125) (width 0.25) (layer B.Cu) (net 17))

  (zone (net 1) (net_name 3V3) (layer In1.Cu) (tstamp 5C61E122) (hatch edge 0.508)
    (connect_pads (clearance 0.508))
    (min_thickness 0.254)
    (fill yes (arc_segments 32) (thermal_gap 0.508) (thermal_bridge_width 0.508))
    (polygon
      (pts
        (xy 178.435 65.405) (xy 203.2 65.405) (xy 203.2 86.36) (xy 200.66 90.17) (xy 200.66 91.44)
        (xy 193.04 95.25) (xy 186.69 95.25) (xy 180.34 91.44) (xy 180.34 86.36) (xy 178.435 85.09)
      )
    )
    (filled_polygon
      (pts
        (xy 202.490001 86.145028) (xy 200.383298 89.305084) (xy 200.392072 89.216) (xy 200.392072 87.916) (xy 200.379812 87.791518)
        (xy 200.343502 87.67182) (xy 200.286939 87.566) (xy 200.343502 87.46018) (xy 200.379812 87.340482) (xy 200.392072 87.216)
        (xy 200.392072 85.916) (xy 200.379812 85.791518) (xy 200.343502 85.67182) (xy 200.286939 85.566) (xy 200.343502 85.46018)
        (xy 200.379812 85.340482) (xy 200.392072 85.216) (xy 200.392072 83.916) (xy 200.379812 83.791518) (xy 200.343502 83.67182)
        (xy 200.286939 83.566) (xy 200.343502 83.46018) (xy 200.379812 83.340482) (xy 200.392072 83.216) (xy 200.392072 81.916)
        (xy 200.379812 81.791518) (xy 200.343502 81.67182) (xy 200.286939 81.566) (xy 200.343502 81.46018) (xy 200.379812 81.340482)
        (xy 200.392072 81.216) (xy 200.392072 79.916) (xy 200.379812 79.791518) (xy 200.343502 79.67182) (xy 200.286939 79.566)
        (xy 200.343502 79.46018) (xy 200.379812 79.340482) (xy 200.392072 79.216) (xy 200.392072 77.916) (xy 200.379812 77.791518)
        (xy 200.343502 77.67182) (xy 200.286939 77.566) (xy 200.343502 77.46018) (xy 200.379812 77.340482) (xy 200.392072 77.216)
        (xy 200.392072 75.916) (xy 200.379812 75.791518) (xy 200.343502 75.67182) (xy 200.284537 75.561506) (xy 200.205185 75.464815)
        (xy 200.108494 75.385463) (xy 199.99818 75.326498) (xy 199.878482 75.290188) (xy 199.754 75.277928) (xy 196.754 75.277928)
        (xy 196.629518 75.290188) (xy 196.50982 75.326498) (xy 196.399506 75.385463) (xy 196.302815 75.464815) (xy 196.223463 75.561506)
        (xy 196.164498 75.67182) (xy 196.128188 75.791518) (xy 196.115928 75.916) (xy 196.115928 77.216) (xy 196.128188 77.340482)
        (xy 196.164498 77.46018) (xy 196.221061 77.566) (xy 196.164498 77.67182) (xy 196.128188 77.791518) (xy 196.115928 77.916)
        (xy 196.115928 79.216) (xy 196.128188 79.340482) (xy 196.164498 79.46018) (xy 196.221061 79.566) (xy 196.164498 79.67182)
        (xy 196.128188 79.791518) (xy 196.115928 79.916) (xy 196.115928 81.216) (xy 196.128188 81.340482) (xy 196.164498 81.46018)
        (xy 196.221061 81.566) (xy 196.164498 81.67182) (xy 196.128188 81.791518) (xy 196.115928 81.916) (xy 196.115928 83.216)
        (xy 196.128188 83.340482) (xy 196.164498 83.46018) (xy 196.221061 83.566) (xy 196.164498 83.67182) (xy 196.128188 83.791518)
        (xy 196.115928 83.916) (xy 196.115928 85.216) (xy 196.128188 85.340482) (xy 196.164498 85.46018) (xy 196.221061 85.566)
        (xy 196.164498 85.67182) (xy 196.128188 85.791518) (xy 196.115928 85.916) (xy 196.115928 87.216) (xy 196.128188 87.340482)
        (xy 196.164498 87.46018) (xy 196.221061 87.566) (xy 196.164498 87.67182) (xy 196.128188 87.791518) (xy 196.115928 87.916)
        (xy 196.115928 89.216) (xy 196.128188 89.340482) (xy 196.164498 89.46018) (xy 196.221061 89.566) (xy 196.164498 89.67182)
        (xy 196.128188 89.791518) (xy 196.115928 89.916) (xy 196.115928 91.216) (xy 196.128188 91.340482) (xy 196.164498 91.46018)
        (xy 196.223463 91.570494) (xy 196.302815 91.667185) (xy 196.399506 91.746537) (xy 196.50982 91.805502) (xy 196.629518 91.841812)
        (xy 196.754 91.854072) (xy 199.547876 91.854072) (xy 193.01002 95.123) (xy 186.725178 95.123) (xy 181.05 91.717893)
        (xy 181.05 86.394497) (xy 181.053434 86.359254) (xy 181.046615 86.290758) (xy 181.039727 86.220816) (xy 181.039617 86.220453)
        (xy 181.03958 86.220083) (xy 181.01939 86.153774) (xy 180.999128 86.08698) (xy 180.998952 86.08665) (xy 180.998842 86.08629)
        (xy 180.966062 86.025118) (xy 180.9332 85.963637) (xy 180.93296 85.963345) (xy 180.932784 85.963016) (xy 180.894117 85.916)
        (xy 181.115928 85.916) (xy 181.115928 87.216) (xy 181.128188 87.340482) (xy 181.164498 87.46018) (xy 181.221061 87.566)
        (xy 181.164498 87.67182) (xy 181.128188 87.791518) (xy 181.115928 87.916) (xy 181.115928 89.216) (xy 181.128188 89.340482)
        (xy 181.164498 89.46018) (xy 181.221061 89.566) (xy 181.164498 89.67182) (xy 181.128188 89.791518) (xy 181.115928 89.916)
        (xy 181.115928 91.216) (xy 181.128188 91.340482) (xy 181.164498 91.46018) (xy 181.223463 91.570494) (xy 181.302815 91.667185)
        (xy 181.399506 91.746537) (xy 181.50982 91.805502) (xy 181.629518 91.841812) (xy 181.754 91.854072) (xy 184.754 91.854072)
        (xy 184.878482 91.841812) (xy 184.99818 91.805502) (xy 185.108494 91.746537) (xy 185.205185 91.667185) (xy 185.284537 91.570494)
        (xy 185.343502 91.46018) (xy 185.379812 91.340482) (xy 185.392072 91.216) (xy 185.392072 89.916) (xy 185.379812 89.791518)
        (xy 185.343502 89.67182) (xy 185.286939 89.566) (xy 185.343502 89.46018) (xy 185.379812 89.340482) (xy 185.392072 89.216)
        (xy 185.392072 87.916) (xy 185.379812 87.791518) (xy 185.343502 87.67182) (xy 185.286939 87.566) (xy 185.343502 87.46018)
        (xy 185.379812 87.340482) (xy 185.392072 87.216) (xy 185.392072 85.916) (xy 185.379812 85.791518) (xy 185.343502 85.67182)
        (xy 185.285564 85.563428) (xy 185.31673 85.516785) (xy 185.364597 85.401223) (xy 185.389 85.278542) (xy 185.389 85.115061)
        (xy 191.243 85.115061) (xy 191.243 85.318939) (xy 191.282774 85.518898) (xy 191.360795 85.707256) (xy 191.474063 85.876774)
        (xy 191.618226 86.020937) (xy 191.787744 86.134205) (xy 191.976102 86.212226) (xy 192.176061 86.252) (xy 192.379939 86.252)
        (xy 192.579898 86.212226) (xy 192.768256 86.134205) (xy 192.937774 86.020937) (xy 193.081937 85.876774) (xy 193.195205 85.707256)
        (xy 193.273226 85.518898) (xy 193.313 85.318939) (xy 193.313 85.115061) (xy 193.273226 84.915102) (xy 193.195205 84.726744)
        (xy 193.081937 84.557226) (xy 192.937774 84.413063) (xy 192.768256 84.299795) (xy 192.579898 84.221774) (xy 192.379939 84.182)
        (xy 192.176061 84.182) (xy 191.976102 84.221774) (xy 191.787744 84.299795) (xy 191.618226 84.413063) (xy 191.474063 84.557226)
        (xy 191.360795 84.726744) (xy 191.282774 84.915102) (xy 191.243 85.115061) (xy 185.389 85.115061) (xy 185.389 84.85175)
        (xy 185.23025 84.693) (xy 183.381 84.693) (xy 183.381 84.713) (xy 183.127 84.713) (xy 183.127 84.693)
        (xy 181.27775 84.693) (xy 181.119 84.85175) (xy 181.119 85.278542) (xy 181.143403 85.401223) (xy 181.19127 85.516785)
        (xy 181.222436 85.563428) (xy 181.164498 85.67182) (xy 181.128188 85.791518) (xy 181.115928 85.916) (xy 180.894117 85.916)
        (xy 180.888844 85.909589) (xy 180.844475 85.855525) (xy 180.844183 85.855286) (xy 180.843946 85.854997) (xy 180.790222 85.811001)
        (xy 180.736363 85.7668) (xy 180.705127 85.750104) (xy 179.145 84.710021) (xy 179.145 80.670061) (xy 179.305 80.670061)
        (xy 179.305 80.873939) (xy 179.344774 81.073898) (xy 179.422795 81.262256) (xy 179.536063 81.431774) (xy 179.680226 81.575937)
        (xy 179.849744 81.689205) (xy 180.038102 81.767226) (xy 180.238061 81.807) (xy 180.441939 81.807) (xy 180.641898 81.767226)
        (xy 180.830256 81.689205) (xy 180.999774 81.575937) (xy 181.143937 81.431774) (xy 181.152152 81.41948) (xy 181.164498 81.46018)
        (xy 181.221061 81.566) (xy 181.164498 81.67182) (xy 181.128188 81.791518) (xy 181.115928 81.916) (xy 181.115928 83.216)
        (xy 181.128188 83.340482) (xy 181.164498 83.46018) (xy 181.222436 83.568572) (xy 181.19127 83.615215) (xy 181.143403 83.730777)
        (xy 181.119 83.853458) (xy 181.119 84.28025) (xy 181.27775 84.439) (xy 183.127 84.439) (xy 183.127 84.419)
        (xy 183.381 84.419) (xy 183.381 84.439) (xy 185.23025 84.439) (xy 185.389 84.28025) (xy 185.389 83.853458)
        (xy 185.364597 83.730777) (xy 185.31673 83.615215) (xy 185.285564 83.568572) (xy 185.343502 83.46018) (xy 185.379812 83.340482)
        (xy 185.392072 83.216) (xy 185.392072 81.916) (xy 185.379812 81.791518) (xy 185.343502 81.67182) (xy 185.286939 81.566)
        (xy 185.343502 81.46018) (xy 185.379812 81.340482) (xy 185.392072 81.216) (xy 185.392072 79.916) (xy 185.379812 79.791518)
        (xy 185.343502 79.67182) (xy 185.286939 79.566) (xy 185.343502 79.46018) (xy 185.379812 79.340482) (xy 185.392072 79.216)
        (xy 185.392072 77.916) (xy 185.379812 77.791518) (xy 185.343502 77.67182) (xy 185.284537 77.561506) (xy 185.205185 77.464815)
        (xy 185.108494 77.385463) (xy 185.022986 77.339757) (xy 185.06999 77.269411) (xy 185.181932 76.999158) (xy 185.239 76.71226)
        (xy 185.239 76.41974) (xy 185.181932 76.132842) (xy 185.06999 75.862589) (xy 184.907475 75.619368) (xy 184.700632 75.412525)
        (xy 184.457411 75.25001) (xy 184.187158 75.138068) (xy 183.90026 75.081) (xy 183.60774 75.081) (xy 183.320842 75.138068)
        (xy 183.050589 75.25001) (xy 182.807368 75.412525) (xy 182.600525 75.619368) (xy 182.43801 75.862589) (xy 182.326068 76.132842)
        (xy 182.269 76.41974) (xy 182.269 76.71226) (xy 182.326068 76.999158) (xy 182.43801 77.269411) (xy 182.443701 77.277928)
        (xy 181.754 77.277928) (xy 181.629518 77.290188) (xy 181.50982 77.326498) (xy 181.399506 77.385463) (xy 181.302815 77.464815)
        (xy 181.223463 77.561506) (xy 181.164498 77.67182) (xy 181.128188 77.791518) (xy 181.115928 77.916) (xy 181.115928 79.216)
        (xy 181.128188 79.340482) (xy 181.164498 79.46018) (xy 181.221061 79.566) (xy 181.164498 79.67182) (xy 181.128188 79.791518)
        (xy 181.115928 79.916) (xy 181.115928 80.084217) (xy 180.999774 79.968063) (xy 180.830256 79.854795) (xy 180.641898 79.776774)
        (xy 180.441939 79.737) (xy 180.238061 79.737) (xy 180.038102 79.776774) (xy 179.849744 79.854795) (xy 179.680226 79.968063)
        (xy 179.536063 80.112226) (xy 179.422795 80.281744) (xy 179.344774 80.470102) (xy 179.305 80.670061) (xy 179.145 80.670061)
        (xy 179.145 78.070123) (xy 179.134727 77.965816) (xy 179.094128 77.83198) (xy 179.038657 77.7282) (xy 179.451537 77.646073)
        (xy 180.085766 77.383367) (xy 180.656558 77.001976) (xy 181.141976 76.516558) (xy 181.523367 75.945766) (xy 181.786073 75.311537)
        (xy 181.92 74.638242) (xy 181.92 73.951758) (xy 181.786073 73.278463) (xy 181.69707 73.063589) (xy 183.115 73.063589)
        (xy 183.115 73.336411) (xy 183.168225 73.603989) (xy 183.272629 73.856043) (xy 183.424201 74.082886) (xy 183.617114 74.275799)
        (xy 183.843957 74.427371) (xy 184.096011 74.531775) (xy 184.363589 74.585) (xy 184.636411 74.585) (xy 184.903989 74.531775)
        (xy 185.156043 74.427371) (xy 185.382886 74.275799) (xy 185.5 74.158685) (xy 185.617114 74.275799) (xy 185.843957 74.427371)
        (xy 186.096011 74.531775) (xy 186.363589 74.585) (xy 186.636411 74.585) (xy 186.903989 74.531775) (xy 187.156043 74.427371)
        (xy 187.382886 74.275799) (xy 187.5 74.158685) (xy 187.617114 74.275799) (xy 187.843957 74.427371) (xy 188.096011 74.531775)
        (xy 188.363589 74.585) (xy 188.636411 74.585) (xy 188.903989 74.531775) (xy 189.156043 74.427371) (xy 189.382886 74.275799)
        (xy 189.5 74.158685) (xy 189.617114 74.275799) (xy 189.843957 74.427371) (xy 190.096011 74.531775) (xy 190.363589 74.585)
        (xy 190.636411 74.585) (xy 190.903989 74.531775) (xy 191.156043 74.427371) (xy 191.382886 74.275799) (xy 191.5 74.158685)
        (xy 191.617114 74.275799) (xy 191.843957 74.427371) (xy 192.096011 74.531775) (xy 192.363589 74.585) (xy 192.636411 74.585)
        (xy 192.903989 74.531775) (xy 193.156043 74.427371) (xy 193.382886 74.275799) (xy 193.5 74.158685) (xy 193.617114 74.275799)
        (xy 193.843957 74.427371) (xy 194.096011 74.531775) (xy 194.363589 74.585) (xy 194.636411 74.585) (xy 194.903989 74.531775)
        (xy 195.156043 74.427371) (xy 195.382886 74.275799) (xy 195.5 74.158685) (xy 195.617114 74.275799) (xy 195.843957 74.427371)
        (xy 196.096011 74.531775) (xy 196.363589 74.585) (xy 196.636411 74.585) (xy 196.903989 74.531775) (xy 197.156043 74.427371)
        (xy 197.382886 74.275799) (xy 197.575799 74.082886) (xy 197.727371 73.856043) (xy 197.831775 73.603989) (xy 197.885 73.336411)
        (xy 197.885 73.063589) (xy 197.831775 72.796011) (xy 197.727371 72.543957) (xy 197.575799 72.317114) (xy 197.458685 72.2)
        (xy 197.575799 72.082886) (xy 197.727371 71.856043) (xy 197.831775 71.603989) (xy 197.885 71.336411) (xy 197.885 71.063589)
        (xy 197.831775 70.796011) (xy 197.727371 70.543957) (xy 197.575799 70.317114) (xy 197.382886 70.124201) (xy 197.156043 69.972629)
        (xy 196.903989 69.868225) (xy 196.636411 69.815) (xy 196.363589 69.815) (xy 196.096011 69.868225) (xy 195.843957 69.972629)
        (xy 195.617114 70.124201) (xy 195.5 70.241315) (xy 195.382886 70.124201) (xy 195.156043 69.972629) (xy 194.903989 69.868225)
        (xy 194.636411 69.815) (xy 194.363589 69.815) (xy 194.096011 69.868225) (xy 193.843957 69.972629) (xy 193.617114 70.124201)
        (xy 193.5 70.241315) (xy 193.382886 70.124201) (xy 193.156043 69.972629) (xy 192.903989 69.868225) (xy 192.636411 69.815)
        (xy 192.363589 69.815) (xy 192.096011 69.868225) (xy 191.843957 69.972629) (xy 191.617114 70.124201) (xy 191.5 70.241315)
        (xy 191.382886 70.124201) (xy 191.156043 69.972629) (xy 190.903989 69.868225) (xy 190.636411 69.815) (xy 190.363589 69.815)
        (xy 190.096011 69.868225) (xy 189.843957 69.972629) (xy 189.617114 70.124201) (xy 189.5 70.241315) (xy 189.382886 70.124201)
        (xy 189.156043 69.972629) (xy 188.903989 69.868225) (xy 188.636411 69.815) (xy 188.363589 69.815) (xy 188.096011 69.868225)
        (xy 187.843957 69.972629) (xy 187.617114 70.124201) (xy 187.5 70.241315) (xy 187.382886 70.124201) (xy 187.156043 69.972629)
        (xy 186.903989 69.868225) (xy 186.636411 69.815) (xy 186.363589 69.815) (xy 186.096011 69.868225) (xy 185.843957 69.972629)
        (xy 185.617114 70.124201) (xy 185.424201 70.317114) (xy 185.272629 70.543957) (xy 185.228068 70.651537) (xy 184.679605 71.2)
        (xy 185.228068 71.748463) (xy 185.272629 71.856043) (xy 185.424201 72.082886) (xy 185.541315 72.2) (xy 185.5 72.241315)
        (xy 185.382886 72.124201) (xy 185.156043 71.972629) (xy 185.048463 71.928068) (xy 184.5 71.379605) (xy 183.951537 71.928068)
        (xy 183.843957 71.972629) (xy 183.617114 72.124201) (xy 183.424201 72.317114) (xy 183.272629 72.543957) (xy 183.168225 72.796011)
        (xy 183.115 73.063589) (xy 181.69707 73.063589) (xy 181.523367 72.644234) (xy 181.141976 72.073442) (xy 180.656558 71.588024)
        (xy 180.184331 71.272492) (xy 183.110188 71.272492) (xy 183.151035 71.542238) (xy 183.243723 71.798832) (xy 183.30414 71.911863)
        (xy 183.543007 71.977388) (xy 184.320395 71.2) (xy 183.543007 70.422612) (xy 183.30414 70.488137) (xy 183.18824 70.735116)
        (xy 183.12275 70.99996) (xy 183.110188 71.272492) (xy 180.184331 71.272492) (xy 180.085766 71.206633) (xy 179.451537 70.943927)
        (xy 179.038657 70.8618) (xy 179.094128 70.75802) (xy 179.134727 70.624184) (xy 179.145 70.519877) (xy 179.145 70.243007)
        (xy 183.722612 70.243007) (xy 184.5 71.020395) (xy 185.277388 70.243007) (xy 185.211863 70.00414) (xy 184.964884 69.88824)
        (xy 184.70004 69.82275) (xy 184.427508 69.810188) (xy 184.157762 69.851035) (xy 183.901168 69.943723) (xy 183.788137 70.00414)
        (xy 183.722612 70.243007) (xy 179.145 70.243007) (xy 179.145 66.115) (xy 202.49 66.115)
      )
    )
  )
  (zone (net 2) (net_name GND) (layer In2.Cu) (tstamp 5C61E11F) (hatch edge 0.508)
    (connect_pads (clearance 0.508))
    (min_thickness 0.254)
    (fill yes (arc_segments 32) (thermal_gap 0.508) (thermal_bridge_width 0.508))
    (polygon
      (pts
        (xy 178.435 65.405) (xy 203.2 65.405) (xy 203.2 86.36) (xy 200.66 90.17) (xy 200.66 91.44)
        (xy 193.04 95.25) (xy 186.69 95.25) (xy 180.34 91.44) (xy 180.34 86.36) (xy 178.435 85.09)
      )
    )
    (filled_polygon
      (pts
        (xy 202.490001 86.145028) (xy 200.383298 89.305084) (xy 200.392072 89.216) (xy 200.392072 87.916) (xy 200.379812 87.791518)
        (xy 200.343502 87.67182) (xy 200.286939 87.566) (xy 200.343502 87.46018) (xy 200.379812 87.340482) (xy 200.392072 87.216)
        (xy 200.392072 85.916) (xy 200.379812 85.791518) (xy 200.343502 85.67182) (xy 200.286939 85.566) (xy 200.343502 85.46018)
        (xy 200.379812 85.340482) (xy 200.392072 85.216) (xy 200.392072 83.916) (xy 200.379812 83.791518) (xy 200.343502 83.67182)
        (xy 200.286939 83.566) (xy 200.343502 83.46018) (xy 200.379812 83.340482) (xy 200.392072 83.216) (xy 200.392072 81.916)
        (xy 200.379812 81.791518) (xy 200.343502 81.67182) (xy 200.286939 81.566) (xy 200.343502 81.46018) (xy 200.379812 81.340482)
        (xy 200.392072 81.216) (xy 200.392072 79.916) (xy 200.379812 79.791518) (xy 200.343502 79.67182) (xy 200.286939 79.566)
        (xy 200.343502 79.46018) (xy 200.379812 79.340482) (xy 200.392072 79.216) (xy 200.392072 77.916) (xy 200.379812 77.791518)
        (xy 200.343502 77.67182) (xy 200.285564 77.563428) (xy 200.31673 77.516785) (xy 200.364597 77.401223) (xy 200.389 77.278542)
        (xy 200.389 76.85175) (xy 200.23025 76.693) (xy 198.381 76.693) (xy 198.381 76.713) (xy 198.127 76.713)
        (xy 198.127 76.693) (xy 196.27775 76.693) (xy 196.119 76.85175) (xy 196.119 77.278542) (xy 196.143403 77.401223)
        (xy 196.19127 77.516785) (xy 196.222436 77.563428) (xy 196.164498 77.67182) (xy 196.128188 77.791518) (xy 196.115928 77.916)
        (xy 196.115928 79.216) (xy 196.128188 79.340482) (xy 196.164498 79.46018) (xy 196.221061 79.566) (xy 196.164498 79.67182)
        (xy 196.128188 79.791518) (xy 196.115928 79.916) (xy 196.115928 81.216) (xy 196.128188 81.340482) (xy 196.164498 81.46018)
        (xy 196.221061 81.566) (xy 196.164498 81.67182) (xy 196.128188 81.791518) (xy 196.115928 81.916) (xy 196.115928 83.216)
        (xy 196.128188 83.340482) (xy 196.164498 83.46018) (xy 196.221061 83.566) (xy 196.164498 83.67182) (xy 196.128188 83.791518)
        (xy 196.115928 83.916) (xy 196.115928 85.216) (xy 196.128188 85.340482) (xy 196.164498 85.46018) (xy 196.221061 85.566)
        (xy 196.164498 85.67182) (xy 196.128188 85.791518) (xy 196.115928 85.916) (xy 196.115928 87.216) (xy 196.128188 87.340482)
        (xy 196.164498 87.46018) (xy 196.221061 87.566) (xy 196.164498 87.67182) (xy 196.128188 87.791518) (xy 196.115928 87.916)
        (xy 196.115928 89.216) (xy 196.128188 89.340482) (xy 196.164498 89.46018) (xy 196.222436 89.568572) (xy 196.19127 89.615215)
        (xy 196.143403 89.730777) (xy 196.119 89.853458) (xy 196.119 90.28025) (xy 196.27775 90.439) (xy 198.127 90.439)
        (xy 198.127 90.419) (xy 198.381 90.419) (xy 198.381 90.439) (xy 198.401 90.439) (xy 198.401 90.693)
        (xy 198.381 90.693) (xy 198.381 91.69225) (xy 198.53975 91.851) (xy 199.55402 91.851) (xy 193.01002 95.123)
        (xy 186.725178 95.123) (xy 181.05 91.717893) (xy 181.05 86.394497) (xy 181.053434 86.359254) (xy 181.046615 86.290758)
        (xy 181.039727 86.220816) (xy 181.039617 86.220453) (xy 181.03958 86.220083) (xy 181.01939 86.153774) (xy 180.999128 86.08698)
        (xy 180.998952 86.08665) (xy 180.998842 86.08629) (xy 180.966062 86.025118) (xy 180.9332 85.963637) (xy 180.93296 85.963345)
        (xy 180.932784 85.963016) (xy 180.888844 85.909589) (xy 180.85252 85.865328) (xy 180.999774 85.766937) (xy 181.143937 85.622774)
        (xy 181.203644 85.533416) (xy 181.221061 85.566) (xy 181.164498 85.67182) (xy 181.128188 85.791518) (xy 181.115928 85.916)
        (xy 181.115928 87.216) (xy 181.128188 87.340482) (xy 181.164498 87.46018) (xy 181.221061 87.566) (xy 181.164498 87.67182)
        (xy 181.128188 87.791518) (xy 181.115928 87.916) (xy 181.115928 89.216) (xy 181.128188 89.340482) (xy 181.164498 89.46018)
        (xy 181.221061 89.566) (xy 181.164498 89.67182) (xy 181.128188 89.791518) (xy 181.115928 89.916) (xy 181.115928 91.216)
        (xy 181.128188 91.340482) (xy 181.164498 91.46018) (xy 181.223463 91.570494) (xy 181.302815 91.667185) (xy 181.399506 91.746537)
        (xy 181.50982 91.805502) (xy 181.629518 91.841812) (xy 181.754 91.854072) (xy 184.754 91.854072) (xy 184.878482 91.841812)
        (xy 184.99818 91.805502) (xy 185.108494 91.746537) (xy 185.205185 91.667185) (xy 185.284537 91.570494) (xy 185.343502 91.46018)
        (xy 185.379812 91.340482) (xy 185.392072 91.216) (xy 185.392072 90.85175) (xy 196.119 90.85175) (xy 196.119 91.278542)
        (xy 196.143403 91.401223) (xy 196.19127 91.516785) (xy 196.260763 91.620789) (xy 196.349211 91.709237) (xy 196.453215 91.77873)
        (xy 196.568777 91.826597) (xy 196.691458 91.851) (xy 197.96825 91.851) (xy 198.127 91.69225) (xy 198.127 90.693)
        (xy 196.27775 90.693) (xy 196.119 90.85175) (xy 185.392072 90.85175) (xy 185.392072 89.916) (xy 185.379812 89.791518)
        (xy 185.343502 89.67182) (xy 185.286939 89.566) (xy 185.343502 89.46018) (xy 185.379812 89.340482) (xy 185.392072 89.216)
        (xy 185.392072 87.916) (xy 185.379812 87.791518) (xy 185.343502 87.67182) (xy 185.286939 87.566) (xy 185.343502 87.46018)
        (xy 185.379812 87.340482) (xy 185.392072 87.216) (xy 185.392072 85.916) (xy 185.379812 85.791518) (xy 185.343502 85.67182)
        (xy 185.286939 85.566) (xy 185.343502 85.46018) (xy 185.379812 85.340482) (xy 185.392072 85.216) (xy 185.392072 83.916)
        (xy 185.379812 83.791518) (xy 185.343502 83.67182) (xy 185.286939 83.566) (xy 185.343502 83.46018) (xy 185.379812 83.340482)
        (xy 185.392072 83.216) (xy 185.392072 81.916) (xy 185.379812 81.791518) (xy 185.343502 81.67182) (xy 185.286939 81.566)
        (xy 185.343502 81.46018) (xy 185.379812 81.340482) (xy 185.392072 81.216) (xy 185.392072 79.916) (xy 185.379812 79.791518)
        (xy 185.343502 79.67182) (xy 185.285564 79.563428) (xy 185.31673 79.516785) (xy 185.364597 79.401223) (xy 185.389 79.278542)
        (xy 185.389 78.85175) (xy 185.23025 78.693) (xy 183.381 78.693) (xy 183.381 78.713) (xy 183.127 78.713)
        (xy 183.127 78.693) (xy 181.27775 78.693) (xy 181.119 78.85175) (xy 181.119 79.278542) (xy 181.143403 79.401223)
        (xy 181.19127 79.516785) (xy 181.222436 79.563428) (xy 181.164498 79.67182) (xy 181.128188 79.791518) (xy 181.115928 79.916)
        (xy 181.115928 81.216) (xy 181.128188 81.340482) (xy 181.164498 81.46018) (xy 181.221061 81.566) (xy 181.164498 81.67182)
        (xy 181.128188 81.791518) (xy 181.115928 81.916) (xy 181.115928 83.216) (xy 181.128188 83.340482) (xy 181.164498 83.46018)
        (xy 181.221061 83.566) (xy 181.164498 83.67182) (xy 181.128188 83.791518) (xy 181.115928 83.916) (xy 181.115928 84.275217)
        (xy 180.999774 84.159063) (xy 180.830256 84.045795) (xy 180.641898 83.967774) (xy 180.441939 83.928) (xy 180.238061 83.928)
        (xy 180.038102 83.967774) (xy 179.849744 84.045795) (xy 179.680226 84.159063) (xy 179.536063 84.303226) (xy 179.422795 84.472744)
        (xy 179.344774 84.661102) (xy 179.312793 84.821883) (xy 179.145 84.710021) (xy 179.145 78.070123) (xy 179.134727 77.965816)
        (xy 179.100644 77.853458) (xy 181.119 77.853458) (xy 181.119 78.28025) (xy 181.27775 78.439) (xy 183.127 78.439)
        (xy 183.127 78.419) (xy 183.381 78.419) (xy 183.381 78.439) (xy 185.23025 78.439) (xy 185.389 78.28025)
        (xy 185.389 77.853458) (xy 185.364597 77.730777) (xy 185.31673 77.615215) (xy 185.247237 77.511211) (xy 185.158789 77.422763)
        (xy 185.054785 77.35327) (xy 185.022808 77.340025) (xy 185.06999 77.269411) (xy 185.181932 76.999158) (xy 185.239 76.71226)
        (xy 185.239 76.41974) (xy 185.181932 76.132842) (xy 185.06999 75.862589) (xy 185.063889 75.853458) (xy 196.119 75.853458)
        (xy 196.119 76.28025) (xy 196.27775 76.439) (xy 198.127 76.439) (xy 198.127 75.43975) (xy 198.381 75.43975)
        (xy 198.381 76.439) (xy 200.23025 76.439) (xy 200.389 76.28025) (xy 200.389 75.853458) (xy 200.364597 75.730777)
        (xy 200.31673 75.615215) (xy 200.247237 75.511211) (xy 200.158789 75.422763) (xy 200.054785 75.35327) (xy 199.939223 75.305403)
        (xy 199.816542 75.281) (xy 198.53975 75.281) (xy 198.381 75.43975) (xy 198.127 75.43975) (xy 197.96825 75.281)
        (xy 196.691458 75.281) (xy 196.568777 75.305403) (xy 196.453215 75.35327) (xy 196.349211 75.422763) (xy 196.260763 75.511211)
        (xy 196.19127 75.615215) (xy 196.143403 75.730777) (xy 196.119 75.853458) (xy 185.063889 75.853458) (xy 184.907475 75.619368)
        (xy 184.700632 75.412525) (xy 184.457411 75.25001) (xy 184.187158 75.138068) (xy 183.90026 75.081) (xy 183.60774 75.081)
        (xy 183.320842 75.138068) (xy 183.050589 75.25001) (xy 182.807368 75.412525) (xy 182.600525 75.619368) (xy 182.43801 75.862589)
        (xy 182.326068 76.132842) (xy 182.269 76.41974) (xy 182.269 76.71226) (xy 182.326068 76.999158) (xy 182.43801 77.269411)
        (xy 182.445754 77.281) (xy 181.691458 77.281) (xy 181.568777 77.305403) (xy 181.453215 77.35327) (xy 181.349211 77.422763)
        (xy 181.260763 77.511211) (xy 181.19127 77.615215) (xy 181.143403 77.730777) (xy 181.119 77.853458) (xy 179.100644 77.853458)
        (xy 179.094128 77.83198) (xy 179.038657 77.7282) (xy 179.451537 77.646073) (xy 180.085766 77.383367) (xy 180.656558 77.001976)
        (xy 181.141976 76.516558) (xy 181.523367 75.945766) (xy 181.786073 75.311537) (xy 181.92 74.638242) (xy 181.92 74.156993)
        (xy 183.722612 74.156993) (xy 183.788137 74.39586) (xy 184.035116 74.51176) (xy 184.29996 74.57725) (xy 184.572492 74.589812)
        (xy 184.842238 74.548965) (xy 185.098832 74.456277) (xy 185.211863 74.39586) (xy 185.277388 74.156993) (xy 184.5 73.379605)
        (xy 183.722612 74.156993) (xy 181.92 74.156993) (xy 181.92 73.951758) (xy 181.786073 73.278463) (xy 181.7836 73.272492)
        (xy 183.110188 73.272492) (xy 183.151035 73.542238) (xy 183.243723 73.798832) (xy 183.30414 73.911863) (xy 183.543007 73.977388)
        (xy 184.320395 73.2) (xy 184.679605 73.2) (xy 185.228068 73.748463) (xy 185.272629 73.856043) (xy 185.424201 74.082886)
        (xy 185.617114 74.275799) (xy 185.843957 74.427371) (xy 186.096011 74.531775) (xy 186.363589 74.585) (xy 186.636411 74.585)
        (xy 186.903989 74.531775) (xy 187.156043 74.427371) (xy 187.382886 74.275799) (xy 187.5 74.158685) (xy 187.617114 74.275799)
        (xy 187.843957 74.427371) (xy 188.096011 74.531775) (xy 188.363589 74.585) (xy 188.636411 74.585) (xy 188.903989 74.531775)
        (xy 189.156043 74.427371) (xy 189.382886 74.275799) (xy 189.5 74.158685) (xy 189.617114 74.275799) (xy 189.843957 74.427371)
        (xy 190.096011 74.531775) (xy 190.363589 74.585) (xy 190.636411 74.585) (xy 190.903989 74.531775) (xy 191.156043 74.427371)
        (xy 191.382886 74.275799) (xy 191.5 74.158685) (xy 191.617114 74.275799) (xy 191.843957 74.427371) (xy 192.096011 74.531775)
        (xy 192.363589 74.585) (xy 192.636411 74.585) (xy 192.903989 74.531775) (xy 193.156043 74.427371) (xy 193.382886 74.275799)
        (xy 193.5 74.158685) (xy 193.617114 74.275799) (xy 193.843957 74.427371) (xy 194.096011 74.531775) (xy 194.363589 74.585)
        (xy 194.636411 74.585) (xy 194.903989 74.531775) (xy 195.156043 74.427371) (xy 195.382886 74.275799) (xy 195.5 74.158685)
        (xy 195.617114 74.275799) (xy 195.843957 74.427371) (xy 196.096011 74.531775) (xy 196.363589 74.585) (xy 196.636411 74.585)
        (xy 196.903989 74.531775) (xy 197.156043 74.427371) (xy 197.382886 74.275799) (xy 197.575799 74.082886) (xy 197.727371 73.856043)
        (xy 197.831775 73.603989) (xy 197.885 73.336411) (xy 197.885 73.063589) (xy 197.831775 72.796011) (xy 197.727371 72.543957)
        (xy 197.575799 72.317114) (xy 197.458685 72.2) (xy 197.575799 72.082886) (xy 197.727371 71.856043) (xy 197.831775 71.603989)
        (xy 197.885 71.336411) (xy 197.885 71.063589) (xy 197.831775 70.796011) (xy 197.727371 70.543957) (xy 197.575799 70.317114)
        (xy 197.382886 70.124201) (xy 197.156043 69.972629) (xy 196.903989 69.868225) (xy 196.636411 69.815) (xy 196.363589 69.815)
        (xy 196.096011 69.868225) (xy 195.843957 69.972629) (xy 195.617114 70.124201) (xy 195.5 70.241315) (xy 195.382886 70.124201)
        (xy 195.156043 69.972629) (xy 194.903989 69.868225) (xy 194.636411 69.815) (xy 194.363589 69.815) (xy 194.096011 69.868225)
        (xy 193.843957 69.972629) (xy 193.617114 70.124201) (xy 193.5 70.241315) (xy 193.382886 70.124201) (xy 193.156043 69.972629)
        (xy 192.903989 69.868225) (xy 192.636411 69.815) (xy 192.363589 69.815) (xy 192.096011 69.868225) (xy 191.843957 69.972629)
        (xy 191.617114 70.124201) (xy 191.5 70.241315) (xy 191.382886 70.124201) (xy 191.156043 69.972629) (xy 190.903989 69.868225)
        (xy 190.636411 69.815) (xy 190.363589 69.815) (xy 190.096011 69.868225) (xy 189.843957 69.972629) (xy 189.617114 70.124201)
        (xy 189.5 70.241315) (xy 189.382886 70.124201) (xy 189.156043 69.972629) (xy 188.903989 69.868225) (xy 188.636411 69.815)
        (xy 188.363589 69.815) (xy 188.096011 69.868225) (xy 187.843957 69.972629) (xy 187.617114 70.124201) (xy 187.424201 70.317114)
        (xy 187.272629 70.543957) (xy 187.228068 70.651537) (xy 186.679605 71.2) (xy 187.228068 71.748463) (xy 187.272629 71.856043)
        (xy 187.424201 72.082886) (xy 187.541315 72.2) (xy 187.5 72.241315) (xy 187.382886 72.124201) (xy 187.156043 71.972629)
        (xy 187.048463 71.928068) (xy 186.5 71.379605) (xy 185.951537 71.928068) (xy 185.843957 71.972629) (xy 185.617114 72.124201)
        (xy 185.424201 72.317114) (xy 185.272629 72.543957) (xy 185.228068 72.651537) (xy 184.679605 73.2) (xy 184.320395 73.2)
        (xy 183.543007 72.422612) (xy 183.30414 72.488137) (xy 183.18824 72.735116) (xy 183.12275 72.99996) (xy 183.110188 73.272492)
        (xy 181.7836 73.272492) (xy 181.523367 72.644234) (xy 181.141976 72.073442) (xy 180.656558 71.588024) (xy 180.085766 71.206633)
        (xy 179.740427 71.063589) (xy 183.115 71.063589) (xy 183.115 71.336411) (xy 183.168225 71.603989) (xy 183.272629 71.856043)
        (xy 183.424201 72.082886) (xy 183.617114 72.275799) (xy 183.843957 72.427371) (xy 183.951537 72.471932) (xy 184.5 73.020395)
        (xy 185.048463 72.471932) (xy 185.156043 72.427371) (xy 185.382886 72.275799) (xy 185.575799 72.082886) (xy 185.727371 71.856043)
        (xy 185.771932 71.748463) (xy 186.320395 71.2) (xy 185.771932 70.651537) (xy 185.727371 70.543957) (xy 185.575799 70.317114)
        (xy 185.501692 70.243007) (xy 185.722612 70.243007) (xy 186.5 71.020395) (xy 187.277388 70.243007) (xy 187.211863 70.00414)
        (xy 186.964884 69.88824) (xy 186.70004 69.82275) (xy 186.427508 69.810188) (xy 186.157762 69.851035) (xy 185.901168 69.943723)
        (xy 185.788137 70.00414) (xy 185.722612 70.243007) (xy 185.501692 70.243007) (xy 185.382886 70.124201) (xy 185.156043 69.972629)
        (xy 184.903989 69.868225) (xy 184.636411 69.815) (xy 184.363589 69.815) (xy 184.096011 69.868225) (xy 183.843957 69.972629)
        (xy 183.617114 70.124201) (xy 183.424201 70.317114) (xy 183.272629 70.543957) (xy 183.168225 70.796011) (xy 183.115 71.063589)
        (xy 179.740427 71.063589) (xy 179.451537 70.943927) (xy 179.038657 70.8618) (xy 179.094128 70.75802) (xy 179.134727 70.624184)
        (xy 179.145 70.519877) (xy 179.145 66.115) (xy 202.49 66.115)
      )
    )
  )
)
