EESchema Schematic File Version 4
LIBS:final-main-cca-rev0-cache
EELAYER 26 0
EELAYER END
$Descr USLetter 11000 8500
encoding utf-8
Sheet 4 4
Title "400000-Node Main CCA"
Date "2019-01-19"
Rev "A"
Comp "HMS"
Comment1 "Drawn: A. Mercik, C. Swinoga"
Comment2 "Check: C. Swinoga"
Comment3 ""
Comment4 ""
$EndDescr
Text HLabel 1600 3600 0    50   Input ~ 0
V_PRECONDITIONED
Text HLabel 8800 3050 2    50   Input ~ 0
P3V3
Text HLabel 8200 5050 2    50   Input ~ 0
P5V
$Comp
L Amplifier_Current:INA181 U9
U 1 1 5C3E605F
P 4850 1600
F 0 "U9" H 5050 1950 50  0000 L CNN
F 1 "INA181" H 4950 1850 50  0000 L CNN
F 2 "Package_TO_SOT_SMD:SOT-23-6" H 4900 1650 50  0001 C CNN
F 3 "http://www.ti.com/lit/ds/symlink/ina181.pdf" H 5000 1750 50  0001 C CNN
F 4 "‎INA181A3IDBVR‎" H 0   0   50  0001 C CNN "Vendor"
	1    4850 1600
	1    0    0    -1  
$EndComp
$Comp
L Device:R_Small_US R37
U 1 1 5C3E6270
P 4150 3050
F 0 "R37" V 4250 3050 50  0000 C CNN
F 1 "0.1R" V 4350 3050 50  0000 C CNN
F 2 "Resistor_SMD:R_0805_2012Metric_Pad1.15x1.40mm_HandSolder" H 4150 3050 50  0001 C CNN
F 3 "~" H 4150 3050 50  0001 C CNN
F 4 "" H 0   0   50  0001 C CNN "PN"
F 5 "‎RUT2012FR100CS‎" H 0   0   50  0001 C CNN "Vendor"
	1    4150 3050
	0    1    1    0   
$EndComp
Text GLabel 3500 1150 1    50   Input ~ 0
P3V3
$Comp
L Device:C_Small C?
U 1 1 5C3E6547
P 3500 1300
AR Path="/5C3CB78C/5C3E6547" Ref="C?"  Part="1" 
AR Path="/5C3B8F3D/5C3E6547" Ref="C29"  Part="1" 
F 0 "C29" H 3592 1346 50  0000 L CNN
F 1 "0.1uF" H 3592 1255 50  0000 L CNN
F 2 "Capacitor_SMD:C_0603_1608Metric_Pad1.05x0.95mm_HandSolder" H 3500 1300 50  0001 C CNN
F 3 "~" H 3500 1300 50  0001 C CNN
F 4 "" H 0   0   50  0001 C CNN "PN"
F 5 "CL10A104KA8NNNC‎ " H 0   0   50  0001 C CNN "Vendor"
	1    3500 1300
	1    0    0    -1  
$EndComp
Text GLabel 4750 1300 1    50   Input ~ 0
P3V3
Wire Wire Line
	4000 1500 4550 1500
Wire Wire Line
	4300 1700 4550 1700
$Comp
L power:GND #PWR?
U 1 1 5C3EBFEB
P 4750 1900
AR Path="/5C3CB78C/5C3EBFEB" Ref="#PWR?"  Part="1" 
AR Path="/5C3B8F3D/5C3EBFEB" Ref="#PWR033"  Part="1" 
F 0 "#PWR033" H 4750 1650 50  0001 C CNN
F 1 "GND" H 4755 1727 50  0000 C CNN
F 2 "" H 4750 1900 50  0001 C CNN
F 3 "" H 4750 1900 50  0001 C CNN
	1    4750 1900
	-1   0    0    -1  
$EndComp
NoConn ~ 4950 1900
Text Notes 1800 3050 0    50   ~ 0
RPP
Text HLabel 1600 2500 0    50   Input ~ 0
V_SERVICE
$Comp
L Device:Q_PMOS_DGS Q1
U 1 1 5C3ED06A
P 2350 2600
F 0 "Q1" V 2693 2600 50  0000 C CNN
F 1 "DMP3099L" V 2602 2600 50  0000 C CNN
F 2 "Diode_SMD:D_SOT-23_ANK" H 2550 2700 50  0001 C CNN
F 3 "~" H 2350 2600 50  0001 C CNN
F 4 "DMP3099L-7" H 0   0   50  0001 C CNN "Vendor"
	1    2350 2600
	0    -1   -1   0   
$EndComp
Wire Wire Line
	1600 2500 2150 2500
Wire Wire Line
	2550 2500 2850 2500
$Comp
L power:GND #PWR?
U 1 1 5C3ED3BF
P 2350 2800
AR Path="/5C3CB78C/5C3ED3BF" Ref="#PWR?"  Part="1" 
AR Path="/5C3B8F3D/5C3ED3BF" Ref="#PWR028"  Part="1" 
F 0 "#PWR028" H 2350 2550 50  0001 C CNN
F 1 "GND" H 2355 2627 50  0000 C CNN
F 2 "" H 2350 2800 50  0001 C CNN
F 3 "" H 2350 2800 50  0001 C CNN
	1    2350 2800
	-1   0    0    -1  
$EndComp
$Comp
L Device:Jumper_NC_Dual JP1
U 1 1 5C3ED94F
P 2850 3050
F 0 "JP1" V 2896 3152 50  0000 L CNN
F 1 "V_SEL" V 2805 3152 50  0000 L CNN
F 2 "Connector_PinHeader_2.54mm:PinHeader_1x03_P2.54mm_Vertical" H 2850 3050 50  0001 C CNN
F 3 "~" H 2850 3050 50  0001 C CNN
	1    2850 3050
	0    -1   -1   0   
$EndComp
Wire Wire Line
	2850 2800 2850 2500
Wire Wire Line
	2850 3300 2850 3600
$Comp
L Regulator_Linear:TPS73133DBV U10
U 1 1 5C3EFE64
P 7000 3150
F 0 "U10" H 7000 3492 50  0000 C CNN
F 1 "TPS782" H 7000 3401 50  0000 C CNN
F 2 "Package_TO_SOT_SMD:SOT-23-5" H 7000 3475 50  0001 C CIN
F 3 "http://www.ti.com/lit/ds/symlink/tps782.pdf" H 7000 3100 50  0001 C CNN
F 4 "TPS78233DDCT" H 0   0   50  0001 C CNN "Vendor"
	1    7000 3150
	1    0    0    -1  
$EndComp
Wire Wire Line
	7400 3150 7500 3150
Wire Wire Line
	7500 3500 7000 3500
Wire Wire Line
	7000 3500 7000 3450
Wire Wire Line
	7500 3150 7500 3500
Wire Wire Line
	6600 3150 6500 3150
Wire Wire Line
	6500 3150 6500 3050
$Comp
L power:GND #PWR?
U 1 1 5C3F0536
P 7000 3500
AR Path="/5C3CB78C/5C3F0536" Ref="#PWR?"  Part="1" 
AR Path="/5C3B8F3D/5C3F0536" Ref="#PWR034"  Part="1" 
F 0 "#PWR034" H 7000 3250 50  0001 C CNN
F 1 "GND" H 7005 3327 50  0000 C CNN
F 2 "" H 7000 3500 50  0001 C CNN
F 3 "" H 7000 3500 50  0001 C CNN
	1    7000 3500
	-1   0    0    -1  
$EndComp
Connection ~ 7000 3500
Wire Wire Line
	7400 3050 7750 3050
$Comp
L Device:C_Small C?
U 1 1 5C3F0A2A
P 7750 3300
AR Path="/5C3CB78C/5C3F0A2A" Ref="C?"  Part="1" 
AR Path="/5C3B8F3D/5C3F0A2A" Ref="C39"  Part="1" 
F 0 "C39" H 7842 3346 50  0000 L CNN
F 1 "1uF" H 7842 3255 50  0000 L CNN
F 2 "Capacitor_SMD:C_0603_1608Metric_Pad1.05x0.95mm_HandSolder" H 7750 3300 50  0001 C CNN
F 3 "~" H 7750 3300 50  0001 C CNN
F 4 "" H 0   0   50  0001 C CNN "PN"
F 5 "CL10B105KA8NFNC" H 0   0   50  0001 C CNN "Vendor"
	1    7750 3300
	1    0    0    1   
$EndComp
Wire Wire Line
	7750 3200 7750 3050
Connection ~ 7750 3050
Wire Wire Line
	7500 3500 7750 3500
Wire Wire Line
	7750 3500 7750 3400
Connection ~ 7500 3500
$Comp
L Device:CP1_Small C42
U 1 1 5C3F13A2
P 8500 3300
F 0 "C42" H 8591 3346 50  0000 L CNN
F 1 "47mF" H 8591 3255 50  0000 L CNN
F 2 "Capacitor_SMD:CP_Elec_10x10.5" H 8500 3300 50  0001 C CNN
F 3 "~" H 8500 3300 50  0001 C CNN
F 4 "" H 0   0   50  0001 C CNN "PN"
F 5 "FC0H473ZFTBR24" H 0   0   50  0001 C CNN "Vendor"
	1    8500 3300
	1    0    0    -1  
$EndComp
Wire Wire Line
	8500 3200 8500 3050
Wire Wire Line
	8500 3500 8500 3400
$Comp
L Device:C_Small C?
U 1 1 5C3F218E
P 6200 3300
AR Path="/5C3CB78C/5C3F218E" Ref="C?"  Part="1" 
AR Path="/5C3B8F3D/5C3F218E" Ref="C36"  Part="1" 
F 0 "C36" H 6292 3346 50  0000 L CNN
F 1 "0.1uF" H 6292 3255 50  0000 L CNN
F 2 "Capacitor_SMD:C_0603_1608Metric_Pad1.05x0.95mm_HandSolder" H 6200 3300 50  0001 C CNN
F 3 "~" H 6200 3300 50  0001 C CNN
F 4 "" H 0   0   50  0001 C CNN "PN"
F 5 "CL10A104KA8NNNC‎ " H 0   0   50  0001 C CNN "Vendor"
	1    6200 3300
	1    0    0    1   
$EndComp
Wire Wire Line
	6200 3200 6200 3050
Wire Wire Line
	6200 3050 6500 3050
Wire Wire Line
	6200 3400 6200 3500
Wire Wire Line
	6200 3500 7000 3500
$Comp
L capstone_library:TPS613222A U8
U 1 1 5C3F4EBF
P 4300 5100
F 0 "U8" H 4300 5415 50  0000 C CNN
F 1 "TPS613222A DNP" H 4300 5324 50  0000 C CNN
F 2 "Package_TO_SOT_SMD:SOT-23-5_HandSoldering" H 3850 5200 50  0001 C CNN
F 3 "" H 3850 5200 50  0001 C CNN
	1    4300 5100
	1    0    0    -1  
$EndComp
$Comp
L Device:L_Small L2
U 1 1 5C3F50F8
P 3400 5050
F 0 "L2" V 3585 5050 50  0000 C CNN
F 1 "10uH DNP" V 3494 5050 50  0000 C CNN
F 2 "Inductor_SMD:L_Taiyo-Yuden_NR-40xx_HandSoldering" H 3400 5050 50  0001 C CNN
F 3 "~" H 3400 5050 50  0001 C CNN
	1    3400 5050
	0    -1   -1   0   
$EndComp
NoConn ~ 3850 5250
NoConn ~ 4750 5250
Wire Wire Line
	4300 5450 4300 5500
$Comp
L Device:C_Small C?
U 1 1 5C3F66C9
P 5400 5300
AR Path="/5C3CB78C/5C3F66C9" Ref="C?"  Part="1" 
AR Path="/5C3B8F3D/5C3F66C9" Ref="C33"  Part="1" 
F 0 "C33" H 5492 5346 50  0000 L CNN
F 1 "22uF DNP" H 5492 5255 50  0000 L CNN
F 2 "Capacitor_SMD:C_0805_2012Metric_Pad1.15x1.40mm_HandSolder" H 5400 5300 50  0001 C CNN
F 3 "~" H 5400 5300 50  0001 C CNN
	1    5400 5300
	1    0    0    1   
$EndComp
$Comp
L Device:C_Small C?
U 1 1 5C3F67CF
P 3050 5300
AR Path="/5C3CB78C/5C3F67CF" Ref="C?"  Part="1" 
AR Path="/5C3B8F3D/5C3F67CF" Ref="C28"  Part="1" 
F 0 "C28" H 3142 5346 50  0000 L CNN
F 1 "2.2uF DNP" H 3142 5255 50  0000 L CNN
F 2 "Capacitor_SMD:C_0603_1608Metric_Pad1.05x0.95mm_HandSolder" H 3050 5300 50  0001 C CNN
F 3 "~" H 3050 5300 50  0001 C CNN
	1    3050 5300
	1    0    0    1   
$EndComp
Wire Wire Line
	3050 5200 3050 5050
Wire Wire Line
	3050 5050 3300 5050
Wire Wire Line
	3050 5400 3050 5500
Wire Wire Line
	3050 5500 4300 5500
Connection ~ 4300 5500
Wire Wire Line
	5400 5050 5400 5200
Wire Wire Line
	5400 5500 5400 5400
$Comp
L Device:CP1_Small C40
U 1 1 5C3FA1E1
P 7900 5300
F 0 "C40" H 7991 5346 50  0000 L CNN
F 1 "47mF DNP" H 7991 5255 50  0000 L CNN
F 2 "Capacitor_SMD:CP_Elec_10x10.5" H 7900 5300 50  0001 C CNN
F 3 "~" H 7900 5300 50  0001 C CNN
	1    7900 5300
	1    0    0    -1  
$EndComp
Wire Wire Line
	6200 3050 5400 3050
Connection ~ 6200 3050
$Comp
L Device:C_Small C?
U 1 1 5C40042F
P 3650 3400
AR Path="/5C3CB78C/5C40042F" Ref="C?"  Part="1" 
AR Path="/5C3B8F3D/5C40042F" Ref="C30"  Part="1" 
F 0 "C30" H 3742 3446 50  0000 L CNN
F 1 "10uF" H 3742 3355 50  0000 L CNN
F 2 "Capacitor_SMD:C_0805_2012Metric_Pad1.15x1.40mm_HandSolder" H 3650 3400 50  0001 C CNN
F 3 "~" H 3650 3400 50  0001 C CNN
	1    3650 3400
	1    0    0    -1  
$EndComp
Wire Wire Line
	3650 3650 3650 3500
Wire Wire Line
	3650 3300 3650 3050
Text HLabel 5350 1600 2    50   Input ~ 0
V_CM
Wire Wire Line
	5350 1600 5150 1600
$Comp
L Device:C_Small C?
U 1 1 5C408400
P 4650 3400
AR Path="/5C3CB78C/5C408400" Ref="C?"  Part="1" 
AR Path="/5C3B8F3D/5C408400" Ref="C31"  Part="1" 
F 0 "C31" H 4742 3446 50  0000 L CNN
F 1 "10uF" H 4742 3355 50  0000 L CNN
F 2 "Capacitor_SMD:C_0805_2012Metric_Pad1.15x1.40mm_HandSolder" H 4650 3400 50  0001 C CNN
F 3 "~" H 4650 3400 50  0001 C CNN
	1    4650 3400
	1    0    0    -1  
$EndComp
$Comp
L power:GND #PWR?
U 1 1 5C408407
P 4650 3650
AR Path="/5C3CB78C/5C408407" Ref="#PWR?"  Part="1" 
AR Path="/5C3B8F3D/5C408407" Ref="#PWR032"  Part="1" 
F 0 "#PWR032" H 4650 3400 50  0001 C CNN
F 1 "GND" H 4655 3477 50  0000 C CNN
F 2 "" H 4650 3650 50  0001 C CNN
F 3 "" H 4650 3650 50  0001 C CNN
	1    4650 3650
	-1   0    0    -1  
$EndComp
Wire Wire Line
	4650 3650 4650 3500
Wire Wire Line
	4650 3300 4650 3050
Wire Wire Line
	4750 5050 5000 5050
Wire Wire Line
	4300 5500 5000 5500
$Comp
L Device:C_Small C?
U 1 1 5C411A5C
P 5000 5300
AR Path="/5C3CB78C/5C411A5C" Ref="C?"  Part="1" 
AR Path="/5C3B8F3D/5C411A5C" Ref="C32"  Part="1" 
F 0 "C32" H 5092 5346 50  0000 L CNN
F 1 "1uF DNP" H 5092 5255 50  0000 L CNN
F 2 "Capacitor_SMD:C_0603_1608Metric_Pad1.05x0.95mm_HandSolder" H 5000 5300 50  0001 C CNN
F 3 "~" H 5000 5300 50  0001 C CNN
F 4 "CL10B105KA8NFNC" H 0   0   50  0001 C CNN "Vendor"
	1    5000 5300
	1    0    0    1   
$EndComp
Wire Wire Line
	5000 5050 5000 5200
Wire Wire Line
	5000 5500 5000 5400
Connection ~ 5000 5050
Wire Wire Line
	5000 5050 5400 5050
Connection ~ 5000 5500
Wire Wire Line
	5000 5500 5400 5500
$Comp
L Device:C_Small C?
U 1 1 5C417280
P 5750 5300
AR Path="/5C3CB78C/5C417280" Ref="C?"  Part="1" 
AR Path="/5C3B8F3D/5C417280" Ref="C34"  Part="1" 
F 0 "C34" H 5842 5346 50  0000 L CNN
F 1 "22uF DNP" H 5842 5255 50  0000 L CNN
F 2 "Capacitor_SMD:C_0805_2012Metric_Pad1.15x1.40mm_HandSolder" H 5750 5300 50  0001 C CNN
F 3 "~" H 5750 5300 50  0001 C CNN
	1    5750 5300
	1    0    0    1   
$EndComp
Wire Wire Line
	5750 5050 5750 5200
Wire Wire Line
	5750 5500 5750 5400
Connection ~ 5400 5050
Connection ~ 5400 5500
Wire Wire Line
	5400 5500 5750 5500
Wire Wire Line
	5400 5050 5750 5050
$Comp
L Device:C_Small C?
U 1 1 5C41F5EF
P 6150 5300
AR Path="/5C3CB78C/5C41F5EF" Ref="C?"  Part="1" 
AR Path="/5C3B8F3D/5C41F5EF" Ref="C35"  Part="1" 
F 0 "C35" H 6242 5346 50  0000 L CNN
F 1 "22uF DNP" H 6242 5255 50  0000 L CNN
F 2 "Capacitor_SMD:C_0805_2012Metric_Pad1.15x1.40mm_HandSolder" H 6150 5300 50  0001 C CNN
F 3 "~" H 6150 5300 50  0001 C CNN
	1    6150 5300
	1    0    0    1   
$EndComp
Wire Wire Line
	6150 5050 6150 5200
Wire Wire Line
	6150 5500 6150 5400
Connection ~ 5750 5050
Wire Wire Line
	5750 5500 6150 5500
Connection ~ 5750 5500
Wire Notes Line
	6050 5100 6050 5450
Wire Notes Line
	6050 5450 6450 5450
Wire Notes Line
	6450 5450 6450 5100
Wire Notes Line
	6450 5100 6050 5100
Wire Wire Line
	7900 5400 7900 5500
Wire Wire Line
	7900 5050 8200 5050
Connection ~ 7900 5050
Wire Wire Line
	7900 5200 7900 5050
$Comp
L Device:L_Small L3
U 1 1 5C42ED21
P 7050 5050
F 0 "L3" V 7235 5050 50  0000 C CNN
F 1 "1uH DNP" V 7144 5050 50  0000 C CNN
F 2 "Inductor_SMD:L_0805_2012Metric_Pad1.15x1.40mm_HandSolder" H 7050 5050 50  0001 C CNN
F 3 "~" H 7050 5050 50  0001 C CNN
	1    7050 5050
	0    -1   -1   0   
$EndComp
$Comp
L Device:C_Small C?
U 1 1 5C42EFD2
P 6700 5300
AR Path="/5C3CB78C/5C42EFD2" Ref="C?"  Part="1" 
AR Path="/5C3B8F3D/5C42EFD2" Ref="C37"  Part="1" 
F 0 "C37" H 6792 5346 50  0000 L CNN
F 1 "10uF DNP" H 6792 5255 50  0000 L CNN
F 2 "Capacitor_SMD:C_0805_2012Metric_Pad1.15x1.40mm_HandSolder" H 6700 5300 50  0001 C CNN
F 3 "~" H 6700 5300 50  0001 C CNN
	1    6700 5300
	1    0    0    1   
$EndComp
$Comp
L Device:C_Small C?
U 1 1 5C42F101
P 7350 5300
AR Path="/5C3CB78C/5C42F101" Ref="C?"  Part="1" 
AR Path="/5C3B8F3D/5C42F101" Ref="C38"  Part="1" 
F 0 "C38" H 7442 5346 50  0000 L CNN
F 1 "10uF DNP" H 7442 5255 50  0000 L CNN
F 2 "Capacitor_SMD:C_0805_2012Metric_Pad1.15x1.40mm_HandSolder" H 7350 5300 50  0001 C CNN
F 3 "~" H 7350 5300 50  0001 C CNN
	1    7350 5300
	1    0    0    1   
$EndComp
Wire Wire Line
	6700 5050 6700 5200
Wire Wire Line
	6700 5050 6950 5050
Wire Wire Line
	7150 5050 7350 5050
Wire Wire Line
	7350 5200 7350 5050
Connection ~ 7350 5050
Wire Wire Line
	7350 5050 7900 5050
Wire Wire Line
	6700 5500 6700 5400
Wire Wire Line
	6700 5500 7350 5500
Wire Wire Line
	7350 5400 7350 5500
Connection ~ 7350 5500
Wire Wire Line
	7350 5500 7900 5500
Connection ~ 5400 3050
Wire Wire Line
	4250 3050 4300 3050
Wire Wire Line
	4300 1700 4300 3050
Connection ~ 4300 3050
Wire Wire Line
	4300 3050 4650 3050
Wire Wire Line
	4000 1500 4000 3050
Connection ~ 4000 3050
Wire Wire Line
	4000 3050 4050 3050
Wire Wire Line
	6150 5500 6700 5500
Connection ~ 6700 5500
Connection ~ 6150 5500
Wire Wire Line
	5750 5050 6150 5050
Connection ~ 6700 5050
Connection ~ 6150 5050
Wire Wire Line
	6150 5050 6700 5050
Wire Wire Line
	5400 3050 5400 4450
Wire Wire Line
	3050 5050 2750 5050
Wire Wire Line
	2750 5050 2750 4450
Wire Wire Line
	2750 4450 5400 4450
Connection ~ 3050 5050
Text Notes 6250 5200 0    50   ~ 0
DNP\n
Wire Notes Line
	2900 4650 8600 4650
Wire Notes Line
	8600 4650 8600 5900
Wire Notes Line
	8600 5900 2900 5900
Wire Notes Line
	2900 5900 2900 4650
Text Notes 2950 4750 0    50   ~ 0
DNP\n
$Comp
L Device:C_Small C?
U 1 1 5C4053FE
P 8100 3300
AR Path="/5C3CB78C/5C4053FE" Ref="C?"  Part="1" 
AR Path="/5C3B8F3D/5C4053FE" Ref="C41"  Part="1" 
F 0 "C41" H 8192 3346 50  0000 L CNN
F 1 "10uF" H 8192 3255 50  0000 L CNN
F 2 "Capacitor_SMD:C_0805_2012Metric_Pad1.15x1.40mm_HandSolder" H 8100 3300 50  0001 C CNN
F 3 "~" H 8100 3300 50  0001 C CNN
	1    8100 3300
	1    0    0    1   
$EndComp
Connection ~ 8500 3050
Wire Wire Line
	8500 3050 8800 3050
Wire Wire Line
	7750 3050 8100 3050
Wire Wire Line
	8100 3200 8100 3050
Connection ~ 8100 3050
Wire Wire Line
	8100 3050 8500 3050
Wire Wire Line
	8100 3400 8100 3500
Connection ~ 8100 3500
Wire Wire Line
	8100 3500 8500 3500
Wire Wire Line
	7750 3500 8100 3500
Connection ~ 7750 3500
Text Notes 8700 3500 0    50   ~ 0
47mF
Connection ~ 3650 3050
Wire Wire Line
	3650 3050 4000 3050
Connection ~ 4650 3050
Wire Wire Line
	4650 3050 5400 3050
Wire Wire Line
	1600 3600 2850 3600
Wire Wire Line
	3500 1150 3500 1200
$Comp
L power:GND #PWR?
U 1 1 5C62945F
P 3500 1450
AR Path="/5C3CB78C/5C62945F" Ref="#PWR?"  Part="1" 
AR Path="/5C3B8F3D/5C62945F" Ref="#PWR0102"  Part="1" 
F 0 "#PWR0102" H 3500 1200 50  0001 C CNN
F 1 "GND" H 3505 1277 50  0000 C CNN
F 2 "" H 3500 1450 50  0001 C CNN
F 3 "" H 3500 1450 50  0001 C CNN
	1    3500 1450
	-1   0    0    -1  
$EndComp
Wire Wire Line
	3500 1400 3500 1450
$Comp
L power:GND #PWR?
U 1 1 5C62B747
P 3650 3650
AR Path="/5C3CB78C/5C62B747" Ref="#PWR?"  Part="1" 
AR Path="/5C3B8F3D/5C62B747" Ref="#PWR0103"  Part="1" 
F 0 "#PWR0103" H 3650 3400 50  0001 C CNN
F 1 "GND" H 3655 3477 50  0000 C CNN
F 2 "" H 3650 3650 50  0001 C CNN
F 3 "" H 3650 3650 50  0001 C CNN
	1    3650 3650
	-1   0    0    -1  
$EndComp
Wire Wire Line
	3500 5050 3850 5050
$Comp
L power:GND #PWR?
U 1 1 5C62E556
P 4300 5500
AR Path="/5C3CB78C/5C62E556" Ref="#PWR?"  Part="1" 
AR Path="/5C3B8F3D/5C62E556" Ref="#PWR0104"  Part="1" 
F 0 "#PWR0104" H 4300 5250 50  0001 C CNN
F 1 "GND" H 4305 5327 50  0000 C CNN
F 2 "" H 4300 5500 50  0001 C CNN
F 3 "" H 4300 5500 50  0001 C CNN
	1    4300 5500
	-1   0    0    -1  
$EndComp
Wire Wire Line
	6600 3050 6500 3050
Connection ~ 6500 3050
Text Label 1700 2500 0    50   ~ 0
V_SERVICE
Text Label 1700 3600 0    50   ~ 0
V_PRECONDITIONED
Text Label 3000 3050 0    50   ~ 0
PWR_IN
Text Label 3650 3050 0    50   ~ 0
PWR_IN1
Text Label 4650 3050 0    50   ~ 0
PWR_IN2
Text Label 2850 2500 0    50   ~ 0
V_SERVICE1
Wire Wire Line
	2950 3050 3400 3050
Wire Wire Line
	3500 3050 3650 3050
$Comp
L Connector:Conn_01x02_Male J7
U 1 1 5C44A13A
P 3400 2850
F 0 "J7" V 3100 2850 50  0000 R CNN
F 1 "PW_SWITCH" V 3200 3000 50  0000 R CNN
F 2 "Connector_PinHeader_2.54mm:PinHeader_1x02_P2.54mm_Vertical" H 3400 2850 50  0001 C CNN
F 3 "~" H 3400 2850 50  0001 C CNN
F 4 "" H 100 0   50  0001 C CNN "PN"
F 5 "‎KRE2ANA1BBD‎" H 100 0   50  0001 C CNN "Vendor"
	1    3400 2850
	0    -1   1    0   
$EndComp
$EndSCHEMATC
