[gd_resource type="TileSet" load_steps=6 format=2]

[ext_resource path="res://textures/tileset_network_icons.png" type="Texture" id=1]

[sub_resource type="ConvexPolygonShape2D" id=1]
points = PoolVector2Array( 0, 96, 64, 64, 128, 96, 64, 128 )

[sub_resource type="ConvexPolygonShape2D" id=2]
points = PoolVector2Array( 0, 96, 64, 64, 128, 96, 64, 128 )

[sub_resource type="ConvexPolygonShape2D" id=3]
points = PoolVector2Array( 0, 96, 64, 64, 128, 96, 64, 128 )

[sub_resource type="ConvexPolygonShape2D" id=4]
points = PoolVector2Array( 0, 96, 64, 64, 128, 96, 64, 128 )

[resource]
6/name = "tileset_network_icons.png 6"
6/texture = ExtResource( 1 )
6/tex_offset = Vector2( 0, -64 )
6/modulate = Color( 1, 1, 1, 1 )
6/region = Rect2( 0, 0, 128, 128 )
6/tile_mode = 0
6/occluder_offset = Vector2( 0, 0 )
6/navigation_offset = Vector2( 0, 0 )
6/shape_offset = Vector2( 0, 0 )
6/shape_transform = Transform2D( 1, 0, 0, 1, 0, 0 )
6/shape = SubResource( 1 )
6/shape_one_way = false
6/shape_one_way_margin = 1.0
6/shapes = [ {
"autotile_coord": Vector2( 0, 0 ),
"one_way": false,
"one_way_margin": 1.0,
"shape": SubResource( 1 ),
"shape_transform": Transform2D( 1, 0, 0, 1, 0, 0 )
} ]
6/z_index = 2
7/name = "tileset_network_icons.png 7"
7/texture = ExtResource( 1 )
7/tex_offset = Vector2( 0, -64 )
7/modulate = Color( 1, 1, 1, 1 )
7/region = Rect2( 128, 0, 128, 128 )
7/tile_mode = 0
7/occluder_offset = Vector2( 0, 0 )
7/navigation_offset = Vector2( 0, 0 )
7/shape_offset = Vector2( 0, 0 )
7/shape_transform = Transform2D( 1, 0, 0, 1, 0, 0 )
7/shape = SubResource( 2 )
7/shape_one_way = false
7/shape_one_way_margin = 1.0
7/shapes = [ {
"autotile_coord": Vector2( 0, 0 ),
"one_way": false,
"one_way_margin": 1.0,
"shape": SubResource( 2 ),
"shape_transform": Transform2D( 1, 0, 0, 1, 0, 0 )
} ]
7/z_index = 1
8/name = "tileset_network_icons.png 8"
8/texture = ExtResource( 1 )
8/tex_offset = Vector2( 0, -64 )
8/modulate = Color( 1, 1, 1, 1 )
8/region = Rect2( 256, 0, 128, 128 )
8/tile_mode = 0
8/occluder_offset = Vector2( 0, 0 )
8/navigation_offset = Vector2( 0, 0 )
8/shape_offset = Vector2( 0, 0 )
8/shape_transform = Transform2D( 1, 0, 0, 1, 0, 0 )
8/shape = SubResource( 3 )
8/shape_one_way = false
8/shape_one_way_margin = 1.0
8/shapes = [ {
"autotile_coord": Vector2( 0, 0 ),
"one_way": false,
"one_way_margin": 1.0,
"shape": SubResource( 3 ),
"shape_transform": Transform2D( 1, 0, 0, 1, 0, 0 )
} ]
8/z_index = 1
9/name = "tileset_network_icons.png 9"
9/texture = ExtResource( 1 )
9/tex_offset = Vector2( 0, -64 )
9/modulate = Color( 1, 1, 1, 1 )
9/region = Rect2( 384, 0, 128, 128 )
9/tile_mode = 0
9/occluder_offset = Vector2( 0, 0 )
9/navigation_offset = Vector2( 0, 0 )
9/shape_offset = Vector2( 0, 0 )
9/shape_transform = Transform2D( 1, 0, 0, 1, 0, 0 )
9/shape = SubResource( 4 )
9/shape_one_way = false
9/shape_one_way_margin = 1.0
9/shapes = [ {
"autotile_coord": Vector2( 0, 0 ),
"one_way": false,
"one_way_margin": 1.0,
"shape": SubResource( 4 ),
"shape_transform": Transform2D( 1, 0, 0, 1, 0, 0 )
} ]
9/z_index = 1
10/name = "tileset_network_icons.png 10"
10/texture = ExtResource( 1 )
10/tex_offset = Vector2( 0, -64 )
10/modulate = Color( 1, 1, 1, 1 )
10/region = Rect2( 0, 128, 512, 256 )
10/tile_mode = 1
10/autotile/bitmask_mode = 1
10/autotile/bitmask_flags = [ Vector2( 0, 0 ), 56, Vector2( 0, 1 ), 26, Vector2( 1, 0 ), 146, Vector2( 1, 1 ), 50, Vector2( 2, 0 ), 176, Vector2( 3, 0 ), 152 ]
10/autotile/icon_coordinate = Vector2( 0, 0 )
10/autotile/tile_size = Vector2( 128, 128 )
10/autotile/spacing = 0
10/autotile/occluder_map = [  ]
10/autotile/navpoly_map = [  ]
10/autotile/priority_map = [  ]
10/autotile/z_index_map = [  ]
10/occluder_offset = Vector2( 0, 0 )
10/navigation_offset = Vector2( 0, 0 )
10/shape_offset = Vector2( 0, 0 )
10/shape_transform = Transform2D( 1, 0, 0, 1, 0, 0 )
10/shape_one_way = false
10/shape_one_way_margin = 0.0
10/shapes = [  ]
10/z_index = 0
