{
    "ignore": [
        ".git",
        "config",
        "dist",
        "log",
        "node_modules"
    ],
    "watch": [
        "./src"
    ],
    "exec": "npm run start:server",
    "ext": "ts"
}
