[
    {
        "name": "Jack Fruit",
        "price": "1$",
        "code": "001",
        "color": "Brown",
        "path": "./img/jf.jpg",
        "infav": "true"
    },
    {
        "name": "Pitaya",
        "price": "2$",
        "code": "002",
        "color": "Pink",
        "path": "./img/pitaya.jpg",
        "infav": "true"
    },
    {
        "name": "Mango",
        "price": "3$",
        "code": "003",
        "color": "Orange",
        "path": "./img/mango.jpg",
        "infav": "true"
    },
    {
        "name": "Mellon",
        "price": "4$",
        "code": "004",
        "color": "Brown",
        "path": "./img/mellon.jpg",
        "infav": "true"
    },
    {
        "name": "Watermelon",
        "price": "5$",
        "code": "005",
        "color": "Green",
        "path": "./img/wm.jpg",
        "infav": "true"
    },
    {
        "name": "Lime",
        "price": "6$",
        "code": "006",
        "color": "Green",
        "path": "./img/lime.jpg",
        "infav": "true"
    },
    {
        "name": "Lemon",
        "price": "7$",
        "code": "007",
        "color": "Yellow",
        "path": "./img/lemon.jpg",
        "infav": "true"
    },
    {
        "name": "Orange",
        "price": "8$",
        "code": "008",
        "color": "Orange",
        "path": "./img/orange.jpg",
        "infav": "true"
    },
    {
        "name": "Banana",
        "price": "9$",
        "code": "009",
        "color": "Yellow",
        "path": "./img/banana.jpg",
        "infav": "true"
    },
    {
        "name": "Pineapple",
        "price": "10$",
        "code": "010",
        "color": "Brown",
        "path": "./img/pa.jpg",
        "infav": "true"
    }
]