[
  {
    "name" : "Name One",
    "nickname" : "Nickname_1",
    "avatar" : "./img/UsersAvatars/ava1.jpg"
  },
  {
    "name" : "Name Two",
    "nickname" : "Nickname_2",
    "avatar" : "./img/UsersAvatars/ava2.jpg"
  },
  {
    "name" : "Name Three",
    "nickname" : "Nickname_3",
    "avatar" : "./img/UsersAvatars/ava3.jpg"
  },
  {
    "name" : "Name Four",
    "nickname" : "Nickname_4",
    "avatar" : "./img/UsersAvatars/ava4.jpg"
  },
  {
    "name" : "Name Five",
    "nickname" : "Nickname_5",
    "avatar" : "./img/UsersAvatars/ava5.jpg"
  },
  {
    "name" : "Name Six",
    "nickname" : "Nickname_6",
    "avatar" : "./img/UsersAvatars/ava6.jpg"
  }
]