[
  {
    "id" : "1",
    "avatar" : "./img/Post/pin.png",
    "img" : "./img/Post/bigpin.jpeg",
    "name" : "John 1"
  },
  {
    "id" : "2",
    "avatar" : "./img/Post/pin.png",
    "img" : "./img/Post/bigpin.jpeg",
    "name" : "John 2"
  },
  {
    "id" : "3",
    "avatar" : "./img/Post/pin.png",
    "img" : "./img/Post/bigpin.jpeg",
    "name" : "John 3"
  },
  {
    "id" : "4",
    "avatar" : "./img/Post/pin.png",
    "img" : "./img/Post/bigpin.jpeg",
    "name" : "John 4"
  },
  {
    "id" : "5",
    "avatar" : "./img/Post/pin.png",
    "img" : "./img/Post/bigpin.jpeg",
    "name" : "John 5"
  }
]