[
  {
    "operation": "modify-overwrite-beta",
    "spec": {
      "split_id": "=split('urn:ngsi',@(1,id))",
      "last_element_id": "=lastElement(@(1,split_id))",
      "id": "=concat(urn:ngsi-ld,'',@(1,last_element_id))"
    }
  },
  {
    "operation": "remove",
    "spec": {
      "*": {
        "metadata": ""
      }
    }
  },
  {
    "operation": "shift",
    "spec": {
      "id": "id",
      "type": "type",
      "*": {
        "value": "&1.value"
      }
    }
  },
  {
    "operation": "default",
    "spec": {
      "location": {
        "type": "GeoProperty"
      },
      "@context": [
        "https://uri.etsi.org/ngsi-ld/v1/ngsi-ld-core-context.jsonld",
        "https://raw.githubusercontent.com/smart-data-models/dataModel.Environment/master/context.jsonld"
      ],
      "*": {
        "type": "Property"
      }
    }
  }
]
