{
  "id": "urn:ngsi:WaterQualityObserved:HOP00d7eb941ace",
  "type": "WaterQualityObserved",
  "TimeInstant": {
    "value": "2023-03-09T11:30:44.00Z",
    "type": "Property"
  },
  "O2": {
    "value": 0,
    "type": "Property"
  },
  "bod": {
    "value": 0,
    "type": "Property"
  },
  "conductivity": {
    "value": 0,
    "type": "Property"
  },
  "location": {
    "type": "GeoProperty",
    "value": {
      "type": "Point",
      "coordinates": [
        -1.271313,
        38.077034
      ]
    }
  },
  "name": {
    "value": "Libelium Murcia - Calidad del Agua",
    "type": "Property"
  },
  "operationalStatus": {
    "value": "CONNECTED",
    "type": "Property"
  },
  "orp": {
    "value": 0,
    "type": "Property"
  },
  "pH": {
    "value": 0,
    "type": "Property"
  },
  "salinity": {
    "value": 0,
    "type": "Property"
  },
  "saturatedOxygen": {
    "value": 0,
    "type": "Property"
  },
  "state": {
    "value": "OK",
    "type": "Property"
  },
  "tds": {
    "value": 0,
    "type": "Property"
  },
  "temperature": {
    "value": 0,
    "type": "Property"
  },
  "turbidity": {
    "value": 0,
    "type": "Property"
  },
  "waterQualityAttrs": {
    "value": [
      "O2",
      "bod",
      "conductivity",
      "orp",
      "pH",
      "salinity",
      "saturatedOxygen",
      "tds",
      "temperature",
      "turbidity"
    ],
    "type": "Property"
  },
  "dateModified": {
    "value": "2023-04-20T06:44:15.00Z",
    "type": "Property"
  },
  "@context": [
      "https://smartdatamodels.org/context.jsonld",
      "https://uri.etsi.org/ngsi-ld/v1/ngsi-ld-core-context.jsonld"
  ]
}
