{
    "id": "urn:ngsi-ld:OffStreetParking:LasRozas_Parking_avdadelaconstitucion",
    "type": "OffStreetParking",
    "TimeInstant": {
        "type": "Property",
        "value": "2023-11-24T10:41:01Z"
    },
    "areaServed": {
        "type": "Property",
        "value": "redparking"
    },
    "dataProvider": {
        "type": "Property",
        "value": "www.libelium.com"
    },
    "source": {
        "type": "Property",
        "value": "www.libelium.com"
    },
    "name": {
        "type": "Property",
        "value": "APARCAMIENTO CONSTITUCION"
    },
    "location": {
        "type": "Property",
        "value": {
            "type": "Point",
            "coordinates": [
                -3.878189,
                40.491566
            ]
        }
    },
    "totalSpotNumber": {
        "type": "Property",
        "value": 550
    },
    "availableSpotNumber": {
        "type": "Property",
        "value": 237
    },
    "occupiedSpotNumber": {
        "type": "Property",
        "value": 313
    },
    "occupancyModified": {
        "type": "Property",
        "value": "2023-11-24T10:21:01Z"
    },
    "occupancy": {
        "type": "Property",
        "value": 0.57
    },
    "vehicleEntranceCount": {
        "type": "Property",
        "value": 149
    },
    "vehicleExitCount": {
        "type": "Property",
        "value": 151
    },
    "address": {
        "type": "Property",
        "value": "AVDA. DE LA CONSTITUCION"
    },
    "municipality": {
        "type": "Property",
        "value": "lasrozas"
    },
    "description": {
        "type": "Property",
        "value": "LAS ROZAS INNOVA"
    },
    "operationalStatus": {
        "type": "Property",
        "value": "CONNECTED"
    },
    "state": {
        "type": "Property",
        "value": "OK"
    },
    "status": {
        "type": "Property",
        "value": "spacesAvailable"
    },
    "dataModified": {
        "type": "Property",
        "value": "2023-11-24T10:41:01Z"
    },
    "@context": [
        "https://uri.etsi.org/ngsi-ld/v1/ngsi-ld-core-context.jsonld",
        "https://raw.githubusercontent.com/smart-data-models/dataModel.Parking/master/context.jsonld"
    ]
}
