{
  "id": "urn:ngsi:CrowdFlowObserved:HOPc44f33227adf",
  "type": "CrowdFlowObserved",
  "TimeInstant": "2023-05-10T11:41:52.00Z",
  "dataProvider": "www.hopu.eu",
  "location": {
    "type": "Point",
    "coordinates": [
      39.679222,
      -0.222898
    ]
  },
  "name" : "Plaza de la Constitución",
  "operationalStatus" : "CONNECTED",
  "peopleCount": 126,
  "period": 5,
  "source": "www.hopu.eu",
  "state": "OK",
  "dateModified": "2021-02-12T10:05:21.00Z"
}