{
  "annotations": {
    "list": [
      {
        "builtIn": 1,
        "datasource": {
          "type": "datasource",
          "uid": "grafana"
        },
        "enable": true,
        "hide": true,
        "iconColor": "rgba(0, 211, 255, 1)",
        "name": "Annotations & Alerts",
        "target": {
          "limit": 100,
          "matchAny": false,
          "tags": [],
          "type": "dashboard"
        },
        "type": "dashboard"
      }
    ]
  },
  "editable": true,
  "fiscalYearStartMonth": 0,
  "graphTooltip": 1,
  "id": 22,
  "links": [],
  "liveNow": false,
  "panels": [
    {
      "datasource": {
        "type": "influxdb",
        "uid": "a1c683ff-94ee-4cad-8f41-0194977e65c3"
      },
      "fieldConfig": {
        "defaults": {
          "color": {
            "mode": "thresholds"
          },
          "mappings": [],
          "min": 0,
          "thresholds": {
            "mode": "absolute",
            "steps": [
              {
                "color": "green",
                "value": null
              }
            ]
          },
          "unit": "ms"
        },
        "overrides": []
      },
      "gridPos": {
        "h": 4,
        "w": 5,
        "x": 0,
        "y": 0
      },
      "id": 14,
      "options": {
        "colorMode": "value",
        "graphMode": "none",
        "justifyMode": "center",
        "orientation": "auto",
        "reduceOptions": {
          "calcs": [],
          "fields": "",
          "values": false
        },
        "text": {},
        "textMode": "auto"
      },
      "pluginVersion": "10.1.1",
      "targets": [
        {
          "datasource": {
            "type": "influxdb",
            "uid": "a1c683ff-94ee-4cad-8f41-0194977e65c3"
          },
          "query": "from(bucket: v.defaultBucket)\n  |> range(start: v.timeRangeStart, stop:v.timeRangeStop)\n  |> filter(fn: (r) => r._measurement == \"http_req_duration\")\n  |> filter(fn: (r) => r[\"testid\"] =~ /${testid:regex}/)\n  |> filter(fn: (r) => r._field == \"value\")\n  |> group()\n  |> quantile(q: 0.95, method: \"exact_mean\")",
          "refId": "A"
        }
      ],
      "title": "P95 Response Time",
      "type": "stat"
    },
    {
      "datasource": {
        "type": "influxdb",
        "uid": "a1c683ff-94ee-4cad-8f41-0194977e65c3"
      },
      "fieldConfig": {
        "defaults": {
          "color": {
            "mode": "thresholds"
          },
          "mappings": [],
          "min": 0,
          "thresholds": {
            "mode": "absolute",
            "steps": [
              {
                "color": "green",
                "value": null
              }
            ]
          },
          "unit": "short"
        },
        "overrides": []
      },
      "gridPos": {
        "h": 4,
        "w": 6,
        "x": 5,
        "y": 0
      },
      "id": 13,
      "options": {
        "colorMode": "value",
        "graphMode": "none",
        "justifyMode": "center",
        "orientation": "auto",
        "reduceOptions": {
          "calcs": [
            "max"
          ],
          "fields": "",
          "values": false
        },
        "text": {},
        "textMode": "auto"
      },
      "pluginVersion": "10.1.1",
      "targets": [
        {
          "datasource": {
            "type": "influxdb",
            "uid": "a1c683ff-94ee-4cad-8f41-0194977e65c3"
          },
          "query": "from(bucket: v.defaultBucket)\n  |> range(start: v.timeRangeStart, stop: v.timeRangeStop)\n  |> filter(fn: (r) => r[\"_measurement\"] == \"http_reqs\")\n  |> filter(fn: (r) => r[\"_field\"] == \"value\")\n  |> filter(fn: (r) => r[\"testid\"] =~ /${testid:regex}/)\n  |> group()\n  |> aggregateWindow(every: v.windowPeriod, fn: sum, createEmpty: false)",
          "refId": "A"
        }
      ],
      "title": "Peak RPS",
      "type": "stat"
    },
    {
      "datasource": {
        "type": "influxdb",
        "uid": "a1c683ff-94ee-4cad-8f41-0194977e65c3"
      },
      "fieldConfig": {
        "defaults": {
          "color": {
            "mode": "thresholds"
          },
          "mappings": [],
          "min": 0,
          "thresholds": {
            "mode": "absolute",
            "steps": [
              {
                "color": "green",
                "value": null
              }
            ]
          },
          "unit": "decbytes"
        },
        "overrides": []
      },
      "gridPos": {
        "h": 4,
        "w": 6,
        "x": 11,
        "y": 0
      },
      "id": 15,
      "options": {
        "colorMode": "value",
        "graphMode": "none",
        "justifyMode": "center",
        "orientation": "auto",
        "reduceOptions": {
          "calcs": [],
          "fields": "",
          "values": false
        },
        "text": {},
        "textMode": "auto"
      },
      "pluginVersion": "10.1.1",
      "targets": [
        {
          "datasource": {
            "type": "influxdb",
            "uid": "a1c683ff-94ee-4cad-8f41-0194977e65c3"
          },
          "query": "from(bucket: v.defaultBucket)\n  |> range(start: v.timeRangeStart, stop:v.timeRangeStop)\n  |> filter(fn: (r) => r._measurement == \"data_received\")\n  |> filter(fn: (r) => r[\"testid\"] =~ /${testid:regex}/)\n  |> filter(fn: (r) => r._field == \"value\")\n  |> group()\n  |> sum()",
          "refId": "A"
        }
      ],
      "title": "Data Received",
      "type": "stat"
    },
    {
      "datasource": {
        "type": "influxdb",
        "uid": "a1c683ff-94ee-4cad-8f41-0194977e65c3"
      },
      "fieldConfig": {
        "defaults": {
          "color": {
            "mode": "thresholds"
          },
          "mappings": [],
          "min": 0,
          "thresholds": {
            "mode": "absolute",
            "steps": [
              {
                "color": "green",
                "value": null
              }
            ]
          },
          "unit": "decbytes"
        },
        "overrides": []
      },
      "gridPos": {
        "h": 4,
        "w": 6,
        "x": 17,
        "y": 0
      },
      "id": 16,
      "options": {
        "colorMode": "value",
        "graphMode": "none",
        "justifyMode": "center",
        "orientation": "auto",
        "reduceOptions": {
          "calcs": [],
          "fields": "",
          "values": false
        },
        "text": {},
        "textMode": "auto"
      },
      "pluginVersion": "10.1.1",
      "targets": [
        {
          "datasource": {
            "type": "influxdb",
            "uid": "a1c683ff-94ee-4cad-8f41-0194977e65c3"
          },
          "query": "from(bucket: v.defaultBucket)\n  |> range(start: v.timeRangeStart, stop:v.timeRangeStop)\n  |> filter(fn: (r) => r._measurement == \"data_sent\")\n  |> filter(fn: (r) => r[\"testid\"] =~ /${testid:regex}/)\n  |> filter(fn: (r) => r._field == \"value\")\n  |> group()\n  |> sum()",
          "refId": "A"
        }
      ],
      "title": "Data Sent",
      "type": "stat"
    },
    {
      "datasource": {
        "type": "influxdb",
        "uid": "a1c683ff-94ee-4cad-8f41-0194977e65c3"
      },
      "description": "",
      "fieldConfig": {
        "defaults": {
          "color": {
            "fixedColor": "dark-red",
            "mode": "fixed"
          },
          "custom": {
            "axisCenteredZero": false,
            "axisColorMode": "text",
            "axisLabel": "",
            "axisPlacement": "auto",
            "fillOpacity": 80,
            "gradientMode": "none",
            "hideFrom": {
              "legend": false,
              "tooltip": false,
              "viz": false
            },
            "lineWidth": 1,
            "scaleDistribution": {
              "type": "linear"
            },
            "thresholdsStyle": {
              "mode": "off"
            }
          },
          "mappings": [],
          "thresholds": {
            "mode": "absolute",
            "steps": [
              {
                "color": "green",
                "value": null
              },
              {
                "color": "red",
                "value": 80
              }
            ]
          },
          "unit": "short"
        },
        "overrides": []
      },
      "gridPos": {
        "h": 10,
        "w": 13,
        "x": 0,
        "y": 4
      },
      "id": 17,
      "options": {
        "barRadius": 0,
        "barWidth": 0.97,
        "fullHighlight": false,
        "groupWidth": 0.7,
        "legend": {
          "calcs": [],
          "displayMode": "list",
          "placement": "right",
          "showLegend": true
        },
        "orientation": "auto",
        "showValue": "never",
        "stacking": "none",
        "tooltip": {
          "mode": "single",
          "sort": "none"
        },
        "xTickLabelRotation": 0,
        "xTickLabelSpacing": 0
      },
      "pluginVersion": "10.1.1",
      "targets": [
        {
          "datasource": {
            "type": "influxdb",
            "uid": "a1c683ff-94ee-4cad-8f41-0194977e65c3"
          },
          "query": "from(bucket: \"trydome\")\n  |> range(start: v.timeRangeStart, stop: v.timeRangeStop)\n  |> filter(fn: (r) => r[\"_measurement\"] == \"checks\")\n  |> filter(fn: (r) => r[\"_value\"] == 0)\n  |> group(columns: [\"check_tag\"])\n  |> count()\n  |> yield(name:\"check_tag\")",
          "refId": "A"
        }
      ],
      "title": "APIs reponse verify fail",
      "transformations": [
        {
          "id": "labelsToFields",
          "options": {
            "valueLabel": "check_tag"
          }
        }
      ],
      "type": "barchart"
    },
    {
      "datasource": {
        "type": "influxdb",
        "uid": "a1c683ff-94ee-4cad-8f41-0194977e65c3"
      },
      "fieldConfig": {
        "defaults": {
          "color": {
            "fixedColor": "dark-red",
            "mode": "fixed"
          },
          "custom": {
            "axisCenteredZero": false,
            "axisColorMode": "text",
            "axisLabel": "",
            "axisPlacement": "auto",
            "fillOpacity": 80,
            "gradientMode": "none",
            "hideFrom": {
              "legend": false,
              "tooltip": false,
              "viz": false
            },
            "lineWidth": 1,
            "scaleDistribution": {
              "type": "linear"
            },
            "thresholdsStyle": {
              "mode": "off"
            }
          },
          "mappings": [],
          "thresholds": {
            "mode": "absolute",
            "steps": [
              {
                "color": "green",
                "value": null
              },
              {
                "color": "red",
                "value": 80
              }
            ]
          },
          "unit": "short"
        },
        "overrides": []
      },
      "gridPos": {
        "h": 10,
        "w": 11,
        "x": 13,
        "y": 4
      },
      "id": 12,
      "options": {
        "barRadius": 0,
        "barWidth": 0.97,
        "fullHighlight": false,
        "groupWidth": 0.7,
        "legend": {
          "calcs": [],
          "displayMode": "list",
          "placement": "right",
          "showLegend": true
        },
        "orientation": "vertical",
        "showValue": "auto",
        "stacking": "none",
        "tooltip": {
          "mode": "single",
          "sort": "none"
        },
        "xTickLabelRotation": 0,
        "xTickLabelSpacing": 0
      },
      "pluginVersion": "10.1.1",
      "targets": [
        {
          "datasource": {
            "type": "influxdb",
            "uid": "a1c683ff-94ee-4cad-8f41-0194977e65c3"
          },
          "query": "from(bucket: v.defaultBucket)\n  |> range(start: v.timeRangeStart, stop: v.timeRangeStop)\n  |> filter(fn: (r) => r[\"_measurement\"] == \"http_req_failed\")\n  |> filter(fn: (r) => r[\"_value\"] == 1)\n  |> group(columns: [\"my_tag\"])\n  |> count()\n  |> yield(name:\"my_tag\")",
          "refId": "A"
        }
      ],
      "title": "Count HTTP Failures",
      "transformations": [
        {
          "id": "labelsToFields",
          "options": {
            "valueLabel": "my_tag"
          }
        },
        {
          "id": "merge",
          "options": {}
        }
      ],
      "type": "barchart"
    },
    {
      "datasource": {
        "type": "influxdb",
        "uid": "a1c683ff-94ee-4cad-8f41-0194977e65c3"
      },
      "fieldConfig": {
        "defaults": {
          "color": {
            "mode": "palette-classic"
          },
          "custom": {
            "axisCenteredZero": false,
            "axisColorMode": "text",
            "axisLabel": "",
            "axisPlacement": "left",
            "barAlignment": 0,
            "drawStyle": "line",
            "fillOpacity": 0,
            "gradientMode": "none",
            "hideFrom": {
              "legend": false,
              "tooltip": false,
              "viz": false
            },
            "insertNulls": false,
            "lineInterpolation": "linear",
            "lineStyle": {
              "fill": "solid"
            },
            "lineWidth": 2,
            "pointSize": 5,
            "scaleDistribution": {
              "type": "linear"
            },
            "showPoints": "auto",
            "spanNulls": false,
            "stacking": {
              "group": "A",
              "mode": "none"
            },
            "thresholdsStyle": {
              "mode": "off"
            }
          },
          "mappings": [],
          "thresholds": {
            "mode": "absolute",
            "steps": [
              {
                "color": "green",
                "value": null
              },
              {
                "color": "red",
                "value": 80
              }
            ]
          }
        },
        "overrides": []
      },
      "gridPos": {
        "h": 10,
        "w": 8,
        "x": 0,
        "y": 14
      },
      "id": 2,
      "options": {
        "legend": {
          "calcs": [],
          "displayMode": "list",
          "placement": "right",
          "showLegend": true
        },
        "tooltip": {
          "mode": "single",
          "sort": "none"
        }
      },
      "targets": [
        {
          "datasource": {
            "type": "influxdb",
            "uid": "a1c683ff-94ee-4cad-8f41-0194977e65c3"
          },
          "query": "from(bucket: v.defaultBucket)\n  |> range(start: v.timeRangeStart, stop: v.timeRangeStop)\n  |> filter(fn: (r) => r[\"_measurement\"] == \"http_reqs\")\n  |> filter(fn: (r) => r[\"_field\"] == \"value\")\n  |> group(columns:[\"my_tag\"])\n  |> aggregateWindow(every: v.windowPeriod, fn: sum, createEmpty: false)\n  |> yield(name: \"sum\")",
          "refId": "A"
        }
      ],
      "title": "http_reqs",
      "transformations": [
        {
          "id": "labelsToFields",
          "options": {
            "valueLabel": "my_tag"
          }
        }
      ],
      "transparent": true,
      "type": "timeseries"
    },
    {
      "datasource": {
        "type": "influxdb",
        "uid": "a1c683ff-94ee-4cad-8f41-0194977e65c3"
      },
      "fieldConfig": {
        "defaults": {
          "color": {
            "mode": "palette-classic"
          },
          "custom": {
            "axisCenteredZero": false,
            "axisColorMode": "text",
            "axisLabel": "",
            "axisPlacement": "auto",
            "barAlignment": 0,
            "drawStyle": "line",
            "fillOpacity": 0,
            "gradientMode": "none",
            "hideFrom": {
              "legend": false,
              "tooltip": false,
              "viz": false
            },
            "insertNulls": false,
            "lineInterpolation": "linear",
            "lineWidth": 1,
            "pointSize": 5,
            "scaleDistribution": {
              "type": "linear"
            },
            "showPoints": "auto",
            "spanNulls": false,
            "stacking": {
              "group": "A",
              "mode": "none"
            },
            "thresholdsStyle": {
              "mode": "off"
            }
          },
          "mappings": [],
          "thresholds": {
            "mode": "absolute",
            "steps": [
              {
                "color": "green",
                "value": null
              },
              {
                "color": "red",
                "value": 80
              }
            ]
          },
          "unit": "ms"
        },
        "overrides": []
      },
      "gridPos": {
        "h": 10,
        "w": 8,
        "x": 8,
        "y": 14
      },
      "id": 4,
      "options": {
        "legend": {
          "calcs": [],
          "displayMode": "list",
          "placement": "right",
          "showLegend": true
        },
        "tooltip": {
          "mode": "single",
          "sort": "none"
        }
      },
      "targets": [
        {
          "datasource": {
            "type": "influxdb",
            "uid": "a1c683ff-94ee-4cad-8f41-0194977e65c3"
          },
          "query": "from(bucket: v.defaultBucket)\n  |> range(start: v.timeRangeStart, stop: v.timeRangeStop)\n  |> filter(fn: (r) => r[\"_measurement\"] == \"http_req_duration\")\n  |> filter(fn: (r) => r[\"_field\"] == \"value\")\n  |> aggregateWindow(every: 1m, fn: mean, createEmpty: false)\n  |> yield(name: \"mean\")",
          "refId": "A"
        }
      ],
      "title": "http_req_duration",
      "transformations": [
        {
          "id": "labelsToFields",
          "options": {
            "valueLabel": "my_tag"
          }
        },
        {
          "id": "merge",
          "options": {}
        }
      ],
      "type": "timeseries"
    },
    {
      "datasource": {
        "type": "influxdb",
        "uid": "a1c683ff-94ee-4cad-8f41-0194977e65c3"
      },
      "fieldConfig": {
        "defaults": {
          "color": {
            "mode": "palette-classic"
          },
          "custom": {
            "axisCenteredZero": false,
            "axisColorMode": "text",
            "axisLabel": "",
            "axisPlacement": "left",
            "barAlignment": 0,
            "drawStyle": "line",
            "fillOpacity": 0,
            "gradientMode": "none",
            "hideFrom": {
              "legend": false,
              "tooltip": false,
              "viz": false
            },
            "insertNulls": false,
            "lineInterpolation": "linear",
            "lineWidth": 1,
            "pointSize": 5,
            "scaleDistribution": {
              "type": "linear"
            },
            "showPoints": "auto",
            "spanNulls": false,
            "stacking": {
              "group": "A",
              "mode": "none"
            },
            "thresholdsStyle": {
              "mode": "off"
            }
          },
          "displayName": "Avg Response - ${__field.labels.testid}",
          "mappings": [],
          "min": 0,
          "thresholds": {
            "mode": "absolute",
            "steps": [
              {
                "color": "green",
                "value": null
              },
              {
                "color": "red",
                "value": 80
              }
            ]
          },
          "unit": "short"
        },
        "overrides": [
          {
            "matcher": {
              "id": "byFrameRefID",
              "options": "B"
            },
            "properties": [
              {
                "id": "displayName",
                "value": "Active VUs"
              },
              {
                "id": "custom.lineStyle",
                "value": {
                  "dash": [
                    10,
                    10
                  ],
                  "fill": "dash"
                }
              },
              {
                "id": "color",
                "value": {
                  "fixedColor": "orange",
                  "mode": "fixed"
                }
              }
            ]
          },
          {
            "matcher": {
              "id": "byFrameRefID",
              "options": "C"
            },
            "properties": [
              {
                "id": "displayName",
                "value": "RPS"
              }
            ]
          },
          {
            "matcher": {
              "id": "byFrameRefID",
              "options": "A"
            },
            "properties": [
              {
                "id": "unit",
                "value": "ms"
              },
              {
                "id": "custom.axisPlacement",
                "value": "right"
              }
            ]
          }
        ]
      },
      "gridPos": {
        "h": 10,
        "w": 8,
        "x": 16,
        "y": 14
      },
      "id": 11,
      "options": {
        "legend": {
          "calcs": [
            "min",
            "mean",
            "max"
          ],
          "displayMode": "table",
          "placement": "right",
          "showLegend": true
        },
        "tooltip": {
          "mode": "multi",
          "sort": "none"
        }
      },
      "pluginVersion": "8.3.1",
      "targets": [
        {
          "datasource": {
            "type": "influxdb",
            "uid": "a1c683ff-94ee-4cad-8f41-0194977e65c3"
          },
          "hide": false,
          "query": "from(bucket: v.defaultBucket)\n  |> range(start: v.timeRangeStart, stop:v.timeRangeStop)\n  |> filter(fn: (r) => r[\"_measurement\"] == \"http_req_duration\")\n  |> filter(fn: (r) => r[\"_field\"] == \"value\")\n  |> filter(fn: (r) => r[\"status\"] == \"200\")\n  |> group(columns: [\"host\", \"_measurement\"], mode:\"by\")  \n  |> aggregateWindow(every: v.windowPeriod, fn: sum, createEmpty: false)\n  |> yield(name: \"sum\")",
          "refId": "A"
        },
        {
          "datasource": {
            "type": "influxdb",
            "uid": "a1c683ff-94ee-4cad-8f41-0194977e65c3"
          },
          "hide": false,
          "query": "from(bucket: v.defaultBucket)\n  |> range(start: v.timeRangeStart, stop:v.timeRangeStop)\n  |> filter(fn: (r) => r[\"_measurement\"] == \"vus\")",
          "refId": "B"
        },
        {
          "datasource": {
            "type": "influxdb",
            "uid": "a1c683ff-94ee-4cad-8f41-0194977e65c3"
          },
          "hide": false,
          "query": "from(bucket: v.defaultBucket)\n  |> range(start: v.timeRangeStart, stop: v.timeRangeStop)\n  |> filter(fn: (r) => r[\"_measurement\"] == \"http_reqs\")\n  |> filter(fn: (r) => r[\"testid\"] =~ /${testid:regex}/)\n  |> filter(fn: (r) => r[\"_field\"] == \"value\")\n  |> group(columns: [\"_measurement\"])\n  |> aggregateWindow(every: 1s, fn: sum, createEmpty: false)\n  |> yield(name: \"sum\")",
          "refId": "C"
        }
      ],
      "title": "Other",
      "transformations": [
        {
          "id": "labelsToFields",
          "options": {
            "valueLabel": "name"
          }
        }
      ],
      "type": "timeseries"
    },
    {
      "datasource": {
        "type": "influxdb",
        "uid": "a1c683ff-94ee-4cad-8f41-0194977e65c3"
      },
      "fieldConfig": {
        "defaults": {
          "color": {
            "mode": "palette-classic"
          },
          "custom": {
            "axisCenteredZero": false,
            "axisColorMode": "text",
            "axisLabel": "",
            "axisPlacement": "auto",
            "barAlignment": 0,
            "drawStyle": "line",
            "fillOpacity": 0,
            "gradientMode": "none",
            "hideFrom": {
              "legend": false,
              "tooltip": false,
              "viz": false
            },
            "insertNulls": false,
            "lineInterpolation": "linear",
            "lineWidth": 1,
            "pointSize": 5,
            "scaleDistribution": {
              "type": "linear"
            },
            "showPoints": "auto",
            "spanNulls": false,
            "stacking": {
              "group": "A",
              "mode": "none"
            },
            "thresholdsStyle": {
              "mode": "off"
            }
          },
          "mappings": [],
          "thresholds": {
            "mode": "absolute",
            "steps": [
              {
                "color": "green"
              },
              {
                "color": "red",
                "value": 80
              }
            ]
          }
        },
        "overrides": []
      },
      "gridPos": {
        "h": 8,
        "w": 12,
        "x": 0,
        "y": 24
      },
      "id": 6,
      "options": {
        "legend": {
          "calcs": [],
          "displayMode": "list",
          "placement": "bottom",
          "showLegend": false
        },
        "tooltip": {
          "mode": "single",
          "sort": "none"
        }
      },
      "targets": [
        {
          "datasource": {
            "type": "influxdb",
            "uid": "a1c683ff-94ee-4cad-8f41-0194977e65c3"
          },
          "query": "from(bucket: v.defaultBucket)\n  |> range(start: v.timeRangeStart, stop: v.timeRangeStop)\n  |> filter(fn: (r) => r[\"_measurement\"] == \"iterations\")\n  |> filter(fn: (r) => r[\"_field\"] == \"value\")\n  |> aggregateWindow(every: 1m, fn: sum, createEmpty: false)\n  |> yield(name: \"sum\")",
          "refId": "A"
        }
      ],
      "title": "iterations",
      "type": "timeseries"
    },
    {
      "datasource": {
        "type": "influxdb",
        "uid": "a1c683ff-94ee-4cad-8f41-0194977e65c3"
      },
      "fieldConfig": {
        "defaults": {
          "color": {
            "mode": "palette-classic"
          },
          "custom": {
            "axisCenteredZero": false,
            "axisColorMode": "text",
            "axisLabel": "",
            "axisPlacement": "auto",
            "barAlignment": 0,
            "drawStyle": "line",
            "fillOpacity": 0,
            "gradientMode": "none",
            "hideFrom": {
              "legend": false,
              "tooltip": false,
              "viz": false
            },
            "insertNulls": false,
            "lineInterpolation": "linear",
            "lineWidth": 1,
            "pointSize": 5,
            "scaleDistribution": {
              "type": "linear"
            },
            "showPoints": "auto",
            "spanNulls": false,
            "stacking": {
              "group": "A",
              "mode": "none"
            },
            "thresholdsStyle": {
              "mode": "off"
            }
          },
          "mappings": [],
          "thresholds": {
            "mode": "absolute",
            "steps": [
              {
                "color": "green"
              },
              {
                "color": "red",
                "value": 80
              }
            ]
          }
        },
        "overrides": []
      },
      "gridPos": {
        "h": 8,
        "w": 12,
        "x": 12,
        "y": 24
      },
      "id": 8,
      "options": {
        "legend": {
          "calcs": [],
          "displayMode": "list",
          "placement": "bottom",
          "showLegend": false
        },
        "tooltip": {
          "mode": "single",
          "sort": "none"
        }
      },
      "targets": [
        {
          "datasource": {
            "type": "influxdb",
            "uid": "a1c683ff-94ee-4cad-8f41-0194977e65c3"
          },
          "query": "from(bucket: v.defaultBucket)\n  |> range(start: v.timeRangeStart, stop: v.timeRangeStop)\n  |> filter(fn: (r) => r[\"_measurement\"] == \"vus\")\n  |> filter(fn: (r) => r[\"_field\"] == \"value\")",
          "refId": "A"
        }
      ],
      "title": "vus",
      "type": "timeseries"
    }
  ],
  "refresh": "",
  "schemaVersion": 38,
  "style": "dark",
  "tags": [],
  "templating": {
    "list": [
      {
        "current": {
          "selected": false,
          "text": "All",
          "value": "$__all"
        },
        "datasource": {
          "type": "influxdb",
          "uid": "a1c683ff-94ee-4cad-8f41-0194977e65c3"
        },
        "definition": "import \"influxdata/influxdb/schema\"\nschema.tagValues(bucket: v.defaultBucket, tag: \"testid\")",
        "hide": 0,
        "includeAll": true,
        "multi": false,
        "name": "testid",
        "options": [],
        "query": "import \"influxdata/influxdb/schema\"\nschema.tagValues(bucket: v.defaultBucket, tag: \"testid\")",
        "refresh": 1,
        "regex": "",
        "skipUrlSync": false,
        "sort": 0,
        "type": "query"
      }
    ]
  },
  "time": {
    "from": "now-30m",
    "to": "now"
  },
  "timepicker": {},
  "timezone": "",
  "title": "K6 Test Results",
  "uid": "4sk8QaJVx",
  "version": 42,
  "weekStart": ""
}