{
	"info": {
		"_postman_id": "59f80835-4fce-45a2-900d-5dc8b2b8e023",
		"name": "HoneyDue",
		"schema": "https://schema.getpostman.com/json/collection/v2.1.0/collection.json"
	},
	"item": [
		{
			"name": "Get All Users",
			"protocolProfileBehavior": {
				"strictSSL": false
			},
			"request": {
				"method": "GET",
				"header": [],
				"url": {
					"raw": "http://localhost:8080/api/v1/users/jediknight",
					"protocol": "http",
					"host": [
						"localhost"
					],
					"port": "8080",
					"path": [
						"api",
						"v1",
						"users",
						"jediknight"
					]
				}
			},
			"response": []
		},
		{
			"name": "Get User By Nickname",
			"request": {
				"method": "GET",
				"header": [],
				"url": {
					"raw": ""
				}
			},
			"response": []
		},
		{
			"name": "Get Chores By User",
			"request": {
				"method": "GET",
				"header": [],
				"url": {
					"raw": ""
				}
			},
			"response": []
		},
		{
			"name": "Create Chore For User",
			"request": {
				"method": "POST",
				"body": {
					"mode": "raw",
					"raw": "{\n    \"title\":\"take the trash out\",\n    \"description\": \"trash pickup every thursday\",\n    \"dueDate\": \"2021-05-21\",\n    \"completed\": false\n}",
					"options": {
						"raw": {
							"language": "json"
						}
					}
				},
				"url": {
					"raw": "http://localhost:8080/api/v1/chores",
					"protocol": "http",
					"host": [
						"localhost"
					],
					"port": "8080",
					"path": [
						"api",
						"v1",
						"chores"
					]
				}
			},
			"response": []
		}
	]
}