<svg width="12" height="20" viewBox="0 0 12 20" fill="none" xmlns="http://www.w3.org/2000/svg">
<path d="M11 1.92969H8.50004C7.39497 1.92969 6.33516 2.36867 5.55376 3.15008C4.77236 3.93148 4.33337 4.99129 4.33337 6.09635V8.59635H1.83337V11.9297H4.33337V18.5964H7.66671V11.9297H10.1667L11 8.59635H7.66671V6.09635C7.66671 5.87534 7.7545 5.66338 7.91078 5.5071C8.06706 5.35082 8.27903 5.26302 8.50004 5.26302H11V1.92969Z" stroke="white" stroke-width="2" stroke-linecap="round" stroke-linejoin="round"/>
</svg>
