<svg width="1216" height="187" viewBox="0 0 1216 187" fill="none" xmlns="http://www.w3.org/2000/svg">
<path fill-rule="evenodd" clip-rule="evenodd" d="M1216 0.0791016V279H0V120.844C26.6735 124.264 53.3471 126.918 80.0206 128.287C197.976 134.339 310.366 117.545 425.594 100.326C462.996 94.7373 500.696 89.1037 538.983 84.1923C601.48 77.7785 663.977 73.9303 726.474 70.0821C820.22 64.3097 913.965 58.5373 1007.71 44.1064C1048.47 36.7871 1088.56 27.8312 1128.33 18.9464C1157.68 12.3899 1186.86 5.87211 1216 0.0791016Z" fill="#4640BE"/>
</svg>
