<svg width="9" height="15" viewBox="0 0 9 15" fill="none" xmlns="http://www.w3.org/2000/svg">
<path d="M1.5 13.4966L7.5 7.49658L1.5 1.49658" stroke="#4640BE" stroke-width="2" stroke-linecap="round" stroke-linejoin="round"/>
</svg>
