<svg width="1216" height="148" viewBox="0 0 1216 148" fill="none" xmlns="http://www.w3.org/2000/svg">
<path opacity="0.6" fill-rule="evenodd" clip-rule="evenodd" d="M1216 239.986V240H0V0.884269C75.8085 14.7682 151.617 41.9305 227.426 69.0929C292.078 92.2578 356.73 115.423 421.382 130.351C514.888 149.543 608.395 151.507 699.808 153.426C761.14 154.714 821.529 155.982 880.344 162.42C1005.67 178.497 1130.99 212.627 1216 239.986Z" fill="#4640BE"/>
</svg>
