<svg width="1216" height="208" viewBox="0 0 1216 208" fill="none" xmlns="http://www.w3.org/2000/svg">
<path opacity="0.8" fill-rule="evenodd" clip-rule="evenodd" d="M1216 0.795895V300H0V150.145C89.6367 147.714 177.081 134.647 266.224 121.326C303.625 115.737 341.326 110.104 379.613 105.192C442.11 98.7785 504.607 94.9302 567.104 91.082C660.849 85.3096 754.595 79.5372 848.34 65.1063C889.095 57.787 929.186 48.8311 968.959 39.9463C1051.64 21.476 1132.95 3.3125 1216 0.795895Z" fill="#FFCE71"/>
</svg>
