-rw-r--r--  1 0  0     1707 Oct 16 22:41:37 2018 SHA256
-rw-r--r--  1 0  0     1857 Oct 16 22:41:37 2018 SHA256.sig
-rw-r--r--  1 0  0   132269 Oct 16 22:41:35 2018 acx-firmware-1.4p5.tgz
-rw-r--r--  1 0  0   175991 Oct 16 22:41:35 2018 athn-firmware-1.1p4.tgz
-rw-r--r--  1 0  0  9464409 Oct 16 22:41:36 2018 bwfm-firmware-20171125.tgz
-rw-r--r--  1 0  0    39394 Oct 16 22:41:36 2018 bwi-firmware-1.4p4.tgz
-rw-r--r--  1 0  0  1586910 Oct 16 22:41:36 2018 intel-firmware-20180807p0v0.tgz
-rw-r--r--  1 0  0   250278 Oct 16 22:41:36 2018 ipw-firmware-1.3p2.tgz
-rw-r--r--  1 0  0   272109 Oct 16 22:41:36 2018 iwi-firmware-3.1p2.tgz
-rw-r--r--  1 0  0  4139154 Oct 16 22:41:36 2018 iwm-firmware-0.20170105.tgz
-rw-r--r--  1 0  0  3233866 Oct 16 22:41:36 2018 iwn-firmware-5.11p1.tgz
-rw-r--r--  1 0  0   140369 Oct 16 22:41:36 2018 malo-firmware-1.4p4.tgz
-rw-r--r--  1 0  0    49935 Oct 16 22:41:36 2018 otus-firmware-1.0p1.tgz
-rw-r--r--  1 0  0   162130 Oct 16 22:41:37 2018 pgt-firmware-1.2p4.tgz
-rw-r--r--  1 0  0  5218724 Oct 16 22:41:37 2018 radeondrm-firmware-20170119.tgz
-rw-r--r--  1 0  0    65551 Oct 16 22:41:37 2018 rsu-firmware-1.2p1.tgz
-rw-r--r--  1 0  0    75328 Oct 16 22:41:37 2018 rtwn-firmware-20180103.tgz
-rw-r--r--  1 0  0    73476 Oct 16 22:41:37 2018 uath-firmware-2.0p1.tgz
-rw-r--r--  1 0  0    24371 Oct 16 22:41:37 2018 upgt-firmware-1.1p4.tgz
-rw-r--r--  1 0  0    63587 Oct 16 22:41:37 2018 urtwn-firmware-20180103.tgz
-rw-r--r--  1 0  0    68204 Oct 16 22:41:37 2018 uvideo-firmware-1.2p2.tgz
-rw-r--r--  1 0  0    45960 Oct 16 22:41:37 2018 vmm-firmware-1.11.0p0.tgz
-rw-r--r--  1 0  0    66182 Oct 16 22:41:37 2018 wpi-firmware-3.2p1.tgz
