{
    "env": {
        "MONGO_DB_URL": "localhost:27017/nodejs-tutorial",
        "MONGO_PW": "447411",
        "MONGO_USER": "REST-app",
        "MONGO_DB_MLAB_URL": "ds137862.mlab.com:37862/mean-auth-local",
        "MONGO_DB_MLAB_PW": "447411abcd",
        "MONGO_DB_MLAB_USER": "home.dante",
        "SERVER_URL": "http://localhost:3000/",
        "JWT_KEY": "secret"

    }
}