(kicad_symbol_lib (version 20201005) (generator kicad_symbol_editor)
  (symbol "pwr:LD39200PU33R" (in_bom yes) (on_board yes)
    (property "Reference" "U" (id 0) (at 0 -6.985 0)
      (effects (font (size 1.27 1.27)))
    )
    (property "Value" "LD39200PU33R" (id 1) (at 0 6.985 0)
      (effects (font (size 1.27 1.27)))
    )
    (property "Footprint" "" (id 2) (at 0 -3.175 0)
      (effects (font (size 1.27 1.27)) hide)
    )
    (property "Datasheet" "" (id 3) (at 0 -3.175 0)
      (effects (font (size 1.27 1.27)) hide)
    )
    (symbol "LD39200PU33R_0_1"
      (rectangle (start -11.43 5.715) (end 12.065 -5.715)
        (stroke (width 0.0006)) (fill (type none))
      )
    )
    (symbol "LD39200PU33R_1_1"
      (pin power_in line (at -13.97 3.81 0) (length 2.54)
        (name "In" (effects (font (size 1.27 1.27))))
        (number "6" (effects (font (size 1.27 1.27))))
      )
      (pin passive line (at 14.605 1.27 180) (length 2.54)
        (name "Adj/sense" (effects (font (size 1.27 1.27))))
        (number "2" (effects (font (size 1.27 1.27))))
      )
      (pin power_in line (at -13.97 -1.27 0) (length 2.54)
        (name "GND" (effects (font (size 1.27 1.27))))
        (number "3" (effects (font (size 1.27 1.27))))
      )
      (pin output line (at 14.605 -1.27 180) (length 2.54)
        (name "PGood" (effects (font (size 1.27 1.27))))
        (number "4" (effects (font (size 1.27 1.27))))
      )
      (pin input line (at -13.97 1.27 0) (length 2.54)
        (name "Enable" (effects (font (size 1.27 1.27))))
        (number "5" (effects (font (size 1.27 1.27))))
      )
      (pin power_out line (at 14.605 3.81 180) (length 2.54)
        (name "Out" (effects (font (size 1.27 1.27))))
        (number "1" (effects (font (size 1.27 1.27))))
      )
      (pin power_in line (at -13.97 -3.81 0) (length 2.54)
        (name "BotPad" (effects (font (size 1.27 1.27))))
        (number "7" (effects (font (size 1.27 1.27))))
      )
    )
  )
)
