{
	"$schema" : "https://json-schema.org/draft-04/schema#",
	"name" : "home-labs/phpath-resolver",
	"homepage" : "https://gitlab.com/home-labs/php/phpath-resolver",
	"description" : "A library to facilitate a path inclusion.",
	"type" : "library",
	"license" : "MPL-2.0",
	"authors" : [{
			"name" : "Rafael Laurindo",
			"email" : "rafaelplaurindo@gmail.com"
		}
	],
	"require" : {
		"php" : ">= 8.1"
	},
	"autoload" : {
		"psr-4" : {
			"PhPathIncluder\\" : "src/lib/PhPathIncluder"
		}
	},
	"minimum-stability" : "dev",
	"repositories" : [{
			"type" : "composer",
			"url" : "https://packagist.org",
			"name" : "Packagist"
		}
	],
	"scripts" : {
		"test1": [
			"@putenv PH_PATH_INCLUDER_DIRECTORY=settings/test",
			"PhPathIncluder\\PathIncluder::printRootDirectoryOfProject"
		]
	},
	"autoload-dev" : {
		"psr-4" : {
			"PhPathIncluder\\" : "src/lib/PhPathIncluder"
		}
	}
}