{
  "$schema": "../../node_modules/ng-packagr/ng-package.schema.json",
  "dest": "../../lib-dist",
  "lib": {
    "entryFile": "src/public-api.ts"
  },
  "allowedNonPeerDependencies": [
    "@cyberjs.on/coolaction-fit"
  ]
}
