<svg xmlns="http://www.w3.org/2000/svg" xmlns:xlink="http://www.w3.org/1999/xlink" width="96.572" height="40" viewBox="0 0 96.572 40">
  <defs>
    <clipPath id="clip-path">
      <rect id="Rectangle_153" data-name="Rectangle 153" width="96.572" height="40" fill="#fff"/>
    </clipPath>
  </defs>
  <g id="Group_73" data-name="Group 73" clip-path="url(#clip-path)">
    <path id="Path_27" data-name="Path 27" d="M79.136,30.941c2.7-1.56,5.519-1.724,6.3-.364s-.766,3.718-3.465,5.272-5.52,1.72-6.3.368.766-3.72,3.465-5.277" transform="translate(-39.027 -15.336)" fill="#fff"/>
    <path id="Path_28" data-name="Path 28" d="M53.8,34.32c2.7-1.566,5.519-1.728,6.3-.368s-.768,3.719-3.464,5.277-5.519,1.71-6.306.361S51.1,35.873,53.8,34.32" transform="translate(-25.924 -17.081)" fill="#fff"/>
    <path id="Path_29" data-name="Path 29" d="M28.261,52.449c4.5-2.593,9.2-2.864,10.5-.606s-1.274,6.2-5.774,8.8-9.2,2.859-10.5.6,1.277-6.2,5.774-8.794" transform="translate(-11.454 -26.018)" fill="#fff"/>
    <path id="Path_30" data-name="Path 30" d="M6.113,32.727c4.5-2.591,9.2-2.864,10.507-.6s-1.279,6.2-5.775,8.795-9.2,2.868-10.507.6,1.279-6.192,5.775-8.79" transform="translate(0 -15.82)" fill="#fff"/>
    <path id="Path_31" data-name="Path 31" d="M88.811,2.14c4.5-2.594,9.2-2.87,10.506-.6s-1.278,6.195-5.769,8.8-9.209,2.862-10.509.6,1.277-6.2,5.773-8.793" transform="translate(-42.767 0)" fill="#fff"/>
    <path id="Path_32" data-name="Path 32" d="M32.87,13.509c2.7-1.553,5.519-1.723,6.306-.362s-.767,3.719-3.465,5.274-5.519,1.717-6.3.365.766-3.717,3.462-5.277" transform="translate(-15.102 -6.323)" fill="#fff"/>
    <path id="Path_33" data-name="Path 33" d="M66.823,11.152c1.674-.971,3.42-1.067,3.907-.226s-.473,2.3-2.143,3.262-3.42,1.07-3.909.233.475-2.306,2.145-3.269" transform="translate(-33.383 -5.354)" fill="#fff"/>
    <path id="Path_34" data-name="Path 34" d="M44.839,26.551c1.672-.963,3.417-1.068,3.9-.226s-.476,2.3-2.145,3.269-3.421,1.066-3.905.226.472-2.3,2.146-3.269" transform="translate(-22.012 -13.319)" fill="#fff"/>
    <path id="Path_35" data-name="Path 35" d="M8.037,60.066c1.674-.966,3.42-1.066,3.907-.227s-.472,2.306-2.146,3.269-3.423,1.07-3.91.228.479-2.312,2.149-3.27" transform="translate(-2.98 -30.651)" fill="#fff"/>
    <path id="Path_36" data-name="Path 36" d="M138.424,48.226,122.518,64.935h-5.192l2.947-16.708h5.419L123.829,58.82l10.136-10.593Z" transform="translate(-60.674 -24.939)" fill="#fff" fill-rule="evenodd"/>
    <path id="Path_37" data-name="Path 37" d="M85.453,48.23h5.422L87.929,64.941H82.506Z" transform="translate(-42.667 -24.941)" fill="#fff" fill-rule="evenodd"/>
    <path id="Path_38" data-name="Path 38" d="M172.944,54.749h7.144l-.53,3.018h-7.147l-.742,4.14h8.522l-.539,3.034H165.745l2.919-16.712h13.621l-.535,3.036h-8.191Z" transform="translate(-85.713 -24.941)" fill="#fff" fill-rule="evenodd"/>
  </g>
</svg>
