<svg xmlns="http://www.w3.org/2000/svg" xmlns:xlink="http://www.w3.org/1999/xlink" width="14" height="14" viewBox="0 0 14 14">
  <defs>
    <clipPath id="clip-path">
      <rect id="Rectangle_4773" data-name="Rectangle 4773" width="12" height="10.295" fill="#fff"/>
    </clipPath>
    <clipPath id="clip-reader">
      <rect width="14" height="14"/>
    </clipPath>
  </defs>
  <g id="reader" clip-path="url(#clip-reader)">
    <g id="Group_14550" data-name="Group 14550" transform="translate(1 2)">
      <g id="Group_14549" data-name="Group 14549" clip-path="url(#clip-path)">
        <path id="Path_35019" data-name="Path 35019" d="M111.57,4.719h-2.219c-.182,0-.231-.037-.29-.213q-.648-1.942-1.295-3.883a.433.433,0,0,1,.44-.621q2.619,0,5.239,0a2.394,2.394,0,0,1,2.354,1.79,2.28,2.28,0,0,1-.688,2.294c-.035.034-.074.065-.111.1a.9.9,0,0,0-.3.965c.273,1.072.539,2.145.806,3.219a1.468,1.468,0,1,1-2.825.792c-.166-.6-.307-1.21-.458-1.816l-.656-2.625" transform="translate(-103.873 0)" fill="#fff"/>
        <rect id="Rectangle_4767" data-name="Rectangle 4767" width="0.842" height="3.415" transform="translate(0 5.583)" fill="#fff"/>
        <rect id="Rectangle_4768" data-name="Rectangle 4768" width="0.842" height="3.415" transform="translate(5.144 5.588)" fill="#fff"/>
        <rect id="Rectangle_4769" data-name="Rectangle 4769" width="0.841" height="2.128" transform="translate(1.714 5.588)" fill="#fff"/>
        <rect id="Rectangle_4770" data-name="Rectangle 4770" width="0.842" height="2.131" transform="translate(3.428 5.583)" fill="#fff"/>
        <rect id="Rectangle_4771" data-name="Rectangle 4771" width="0.843" height="0.84" transform="translate(1.715 8.158)" fill="#fff"/>
        <rect id="Rectangle_4772" data-name="Rectangle 4772" width="0.841" height="0.841" transform="translate(3.429 8.162)" fill="#fff"/>
      </g>
    </g>
  </g>
</svg>
