<svg xmlns="http://www.w3.org/2000/svg" xmlns:xlink="http://www.w3.org/1999/xlink" width="14" height="14" viewBox="0 0 14 14">
  <defs>
    <clipPath id="clip-path">
      <rect id="Rectangle_5635" data-name="Rectangle 5635" width="12" height="11.998" transform="translate(0 0)" fill="#fff"/>
    </clipPath>
    <clipPath id="clip-operation">
      <rect width="14" height="14"/>
    </clipPath>
  </defs>
  <g id="operation" clip-path="url(#clip-operation)">
    <g id="Group_15604" data-name="Group 15604" transform="translate(1 1)">
      <g id="Group_15603" data-name="Group 15603" clip-path="url(#clip-path)">
        <path id="Path_35466" data-name="Path 35466" d="M0,6.8V5.2a.466.466,0,0,1,.41-.279c.239-.033.476-.08.716-.113A.125.125,0,0,0,1.253,4.7a4.514,4.514,0,0,1,.474-1.14.139.139,0,0,0-.014-.177c-.148-.2-.288-.4-.431-.6a.376.376,0,0,1,.044-.57c.3-.3.6-.6.894-.894a.374.374,0,0,1,.562-.048c.207.147.413.293.617.444a.124.124,0,0,0,.157.01,5.048,5.048,0,0,1,1.16-.487.148.148,0,0,0,.087-.1C4.855.872,4.9.594,4.946.318A.352.352,0,0,1,5.329,0Q6,0,6.665,0a.354.354,0,0,1,.389.324c.049.268.1.537.134.806a.126.126,0,0,0,.111.123,4.585,4.585,0,0,1,1.139.475A.133.133,0,0,0,8.6,1.717c.2-.148.405-.292.609-.437a.375.375,0,0,1,.569.049q.445.442.887.887a.376.376,0,0,1,.05.569c-.147.207-.3.411-.44.621a.162.162,0,0,0-.009.142,5.519,5.519,0,0,1,.486,1.173.15.15,0,0,0,.1.083c.27.051.545.092.816.141A.353.353,0,0,1,12,5.333Q12,6,12,6.657a.354.354,0,0,1-.329.4c-.267.049-.536.1-.805.135a.118.118,0,0,0-.117.1,4.679,4.679,0,0,1-.479,1.151.124.124,0,0,0,.009.157c.151.2.3.411.444.618a.372.372,0,0,1-.047.56q-.445.448-.9.895a.376.376,0,0,1-.57.044c-.2-.145-.4-.293-.611-.433a.168.168,0,0,0-.142-.017,5.479,5.479,0,0,1-1.184.491.127.127,0,0,0-.077.081c-.037.195-.065.391-.1.587-.037.224-.039.468-.3.573H5.2a.47.47,0,0,1-.278-.411c-.033-.239-.082-.476-.111-.715a.136.136,0,0,0-.119-.13,4.53,4.53,0,0,1-1.128-.469.14.14,0,0,0-.178.012c-.2.149-.4.293-.608.437a.374.374,0,0,1-.56-.049q-.45-.447-.895-.894a.372.372,0,0,1-.048-.561c.146-.207.3-.411.438-.62a.165.165,0,0,0,.018-.142,5.473,5.473,0,0,1-.492-1.184.126.126,0,0,0-.08-.076c-.2-.037-.393-.065-.588-.1C.348,7.061.106,7.059,0,6.8M5.984,9.865A3.863,3.863,0,1,0,2.139,5.98,3.859,3.859,0,0,0,5.984,9.865" fill="#fff"/>
        <path id="Path_35467" data-name="Path 35467" d="M4.372,6.979a2.1,2.1,0,0,0,3.251,0,1.806,1.806,0,0,1,.441.521,4.544,4.544,0,0,1,.252.538.124.124,0,0,1-.017.109,3.1,3.1,0,0,1-1.775.965,3.038,3.038,0,0,1-2.339-.541A5.088,5.088,0,0,1,3.7,8.152a.117.117,0,0,1-.023-.1,2.466,2.466,0,0,1,.694-1.075" fill="#fff"/>
        <path id="Path_35468" data-name="Path 35468" d="M7.406,5.655a1.406,1.406,0,1,1-1.4-1.413,1.4,1.4,0,0,1,1.4,1.413" fill="#fff"/>
      </g>
    </g>
  </g>
</svg>
