<svg xmlns="http://www.w3.org/2000/svg" xmlns:xlink="http://www.w3.org/1999/xlink" width="16" height="16" viewBox="0 0 16 16">
  <defs>
    <clipPath id="clip-path">
      <rect id="Rectangle_237" data-name="Rectangle 237" width="12.412" height="6.318" transform="translate(0 0)" fill="none"/>
    </clipPath>
    <clipPath id="clip-name">
      <rect width="16" height="16"/>
    </clipPath>
  </defs>
  <g id="name" clip-path="url(#clip-name)">
    <g id="Group_148" data-name="Group 148" transform="translate(2 4.84)">
      <g id="Group_147" data-name="Group 147" clip-path="url(#clip-path)">
        <path id="Path_100" data-name="Path 100" d="M11.061,0H1.351A1.35,1.35,0,0,0,0,1.35V4.967A1.351,1.351,0,0,0,1.351,6.318h9.71a1.35,1.35,0,0,0,1.35-1.351V1.35A1.349,1.349,0,0,0,11.061,0M2.746,3.959a.8.8,0,1,1,.8-.8.8.8,0,0,1-.8.8m2.307,0a.8.8,0,1,1,.8-.8.8.8,0,0,1-.8.8m2.306,0a.8.8,0,1,1,.8-.8.8.8,0,0,1-.8.8m2.308,0a.8.8,0,1,1,.8-.8.8.8,0,0,1-.8.8" fill="#757575"/>
      </g>
    </g>
  </g>
</svg>
