<svg xmlns="http://www.w3.org/2000/svg" xmlns:xlink="http://www.w3.org/1999/xlink" width="14" height="14" viewBox="0 0 14 14">
  <defs>
    <clipPath id="clip-path">
      <rect id="Rectangle_4790" data-name="Rectangle 4790" width="12" height="12" fill="#fff"/>
    </clipPath>
    <clipPath id="clip-gate-scheduler">
      <rect width="14" height="14"/>
    </clipPath>
  </defs>
  <g id="gate-scheduler" clip-path="url(#clip-gate-scheduler)">
    <g id="Group_14573" data-name="Group 14573" transform="translate(1 1)">
      <g id="Group_14572" data-name="Group 14572" clip-path="url(#clip-path)">
        <path id="Path_35024" data-name="Path 35024" d="M3.727,7.326A4.556,4.556,0,0,1,5.708,4.444a4.7,4.7,0,0,1,5.685.211c0-.042.006-.082.006-.123,0-.879-.01-1.758,0-2.637a.672.672,0,0,0-.706-.7c-.159.011-.32,0-.5,0,0-.078,0-.15,0-.222,0-.148,0-.3,0-.445A.543.543,0,0,0,9.8.029C9.776.021,9.752.01,9.727,0H9.469c-.043.017-.086.032-.128.051A.559.559,0,0,0,9,.592c0,.2,0,.4,0,.6H3c0-.157-.007-.309,0-.459A.632.632,0,0,0,2.531,0H2.273a1.719,1.719,0,0,0-.192.081.529.529,0,0,0-.276.472c-.006.21,0,.42,0,.644H1.514c-.254,0-.508.009-.762,0A.67.67,0,0,0,0,1.688v8.625a.606.606,0,0,0,.243.36.864.864,0,0,0,.369.124c1.2.009,2.4.005,3.6,0a.333.333,0,0,0,.042-.009,4.717,4.717,0,0,1-.525-3.467" fill="#fff"/>
        <path id="Path_35025" data-name="Path 35025" d="M167.214,163.609a3.6,3.6,0,1,0,3.591,3.6,3.61,3.61,0,0,0-3.591-3.6m1.694,3.942a.523.523,0,0,1-.464.252c-.426.006-.852.009-1.277,0a.544.544,0,0,1-.557-.571q-.009-.926,0-1.851a.6.6,0,0,1,1.191,0c.009.363,0,.726,0,1.09,0,.042,0,.084,0,.141.218,0,.417,0,.615,0a.536.536,0,0,1,.51.292.637.637,0,0,1-.022.648" transform="translate(-158.805 -158.806)" fill="#fff"/>
      </g>
    </g>
  </g>
</svg>
