<svg xmlns="http://www.w3.org/2000/svg" xmlns:xlink="http://www.w3.org/1999/xlink" width="14" height="14" viewBox="0 0 14 14">
  <defs>
    <clipPath id="clip-path">
      <rect id="Rectangle_5636" data-name="Rectangle 5636" width="12" height="9.426" transform="translate(0 0)" fill="#fff"/>
    </clipPath>
    <clipPath id="clip-data-synchronization_">
      <rect width="14" height="14"/>
    </clipPath>
  </defs>
  <g id="data-synchronization_" data-name="data-synchronization " clip-path="url(#clip-data-synchronization_)">
    <g id="Group_15606" data-name="Group 15606" transform="translate(1 2)">
      <g id="Group_15605" data-name="Group 15605" clip-path="url(#clip-path)">
        <path id="Path_35469" data-name="Path 35469" d="M6.2,9.426H3.454A3.422,3.422,0,0,1,2.173,2.818a.277.277,0,0,0,.178-.188A3.738,3.738,0,0,1,5.455.044,3.854,3.854,0,0,1,9.8,3.159a.494.494,0,0,1,.019.131c-.019.211.1.285.282.355a2.976,2.976,0,0,1,1.894,3.03A3.018,3.018,0,0,1,9.47,9.392a2.982,2.982,0,0,1-.453.032c-.94,0-1.881,0-2.821,0M4.357,6c.115,0,.222,0,.329,0a.429.429,0,0,0,.424-.268.419.419,0,0,0-.117-.486c-.268-.268-.535-.537-.8-.8a.426.426,0,0,0-.658,0c-.26.257-.516.518-.776.774a.435.435,0,0,0-.139.516A.444.444,0,0,0,3.082,6c.132,0,.264,0,.392,0a2.57,2.57,0,0,0,3.5,1.944.427.427,0,1,0-.317-.788,1.755,1.755,0,0,1-.969.1A1.7,1.7,0,0,1,4.357,6m4.174-.856A2.515,2.515,0,0,0,7.6,3.571,2.5,2.5,0,0,0,5,3.215a.413.413,0,0,0-.252.533.434.434,0,0,0,.616.233,1.7,1.7,0,0,1,1.878.41,1.588,1.588,0,0,1,.412.753c-.123,0-.23,0-.337,0a.423.423,0,0,0-.415.26.412.412,0,0,0,.108.487c.273.276.546.551.823.823a.418.418,0,0,0,.629,0c.277-.272.55-.547.823-.822a.415.415,0,0,0,.111-.477.428.428,0,0,0-.423-.27c-.142,0-.285,0-.438,0" fill="#fff"/>
      </g>
    </g>
  </g>
</svg>
