<?xml version="1.0" encoding="UTF-8" standalone="no"?>
<!-- Created with Inkscape (http://www.inkscape.org/) -->

<svg
   xmlns:dc="http://purl.org/dc/elements/1.1/"
   xmlns:cc="http://creativecommons.org/ns#"
   xmlns:rdf="http://www.w3.org/1999/02/22-rdf-syntax-ns#"
   xmlns:svg="http://www.w3.org/2000/svg"
   xmlns="http://www.w3.org/2000/svg"
   xmlns:sodipodi="http://sodipodi.sourceforge.net/DTD/sodipodi-0.dtd"
   xmlns:inkscape="http://www.inkscape.org/namespaces/inkscape"
   width="15px"
   height="20px"
   viewBox="0 0 210 297"
   version="1.1"
   id="svg102"
   inkscape:version="0.92.2 2405546, 2018-03-11"
   sodipodi:docname="glencairn_silhouette.svg">
  <defs
     id="defs96" />
  <sodipodi:namedview
     id="base"
     pagecolor="#ffffff"
     bordercolor="#666666"
     borderopacity="1.0"
     inkscape:pageopacity="0.0"
     inkscape:pageshadow="2"
     inkscape:zoom="0.35"
     inkscape:cx="400"
     inkscape:cy="560"
     inkscape:document-units="mm"
     inkscape:current-layer="layer1"
     showgrid="false"
     inkscape:window-width="1600"
     inkscape:window-height="885"
     inkscape:window-x="0"
     inkscape:window-y="15"
     inkscape:window-maximized="0" />
  <metadata
     id="metadata99">
    <rdf:RDF>
      <cc:Work
         rdf:about="">
        <dc:format>image/svg+xml</dc:format>
        <dc:type
           rdf:resource="http://purl.org/dc/dcmitype/StillImage" />
        <dc:title></dc:title>
      </cc:Work>
    </rdf:RDF>
  </metadata>
  <g
     inkscape:label="Layer 1"
     inkscape:groupmode="layer"
     id="layer1">
    <path
       inkscape:connector-curvature="0"
       d="m 50.252938,5.7182051 c 38.330266,0 76.659692,0 114.989952,0 0.39068,27.5316999 1.42826,52.5502169 6.76412,76.9421279 5.10163,23.324737 13.74386,45.606827 16.90986,66.795527 4.71011,31.51626 -8.80375,53.73747 -27.90207,66.79553 -4.95195,3.38671 -18.73049,8.89339 -19.44673,13.52823 -0.51245,3.32329 9.61386,17.99734 11.83784,22.82921 8.0985,17.59735 14.14637,30.51504 -5.07372,39.73907 -27.33806,0 -54.676112,0 -82.014162,0 -18.734712,-8.61433 -13.408151,-21.62842 -5.07372,-39.73907 1.573697,-3.41884 12.055159,-18.93851 11.837835,-21.98359 -0.396597,-5.54895 -14.164137,-10.7622 -19.447569,-14.37385 -18.38801,-12.57268 -32.58428,-33.46879 -27.902081,-65.94991 3.036622,-21.06101 11.452232,-42.75793 16.91071,-65.949906 5.619145,-23.877775 5.738378,-49.206632 6.764115,-76.0965087 -0.07188,-1.1999356 -0.139527,-2.394796 0.84562,-2.5368602 z"
       id="path58"
       style="stroke-width:0.84562004" />
  </g>
</svg>
