<svg width="16" height="16" viewBox="0 0 16 16" fill="none" xmlns="http://www.w3.org/2000/svg">
<path d="M13.024 7.26282H4.88853C4.51602 7.26282 4.21802 7.56083 4.21802 7.93333C4.21802 8.30583 4.51602 8.60384 4.88853 8.60384H13.024L11.3701 10.2727C11.1019 10.5409 11.1019 10.9581 11.3701 11.2263C11.6383 11.4945 12.0555 11.4945 12.3237 11.2263L15.1398 8.41014C15.259 8.29093 15.3335 8.11213 15.3335 7.93333C15.3335 7.75453 15.259 7.59063 15.1398 7.45652L12.3088 4.65529C12.1747 4.52119 12.0108 4.46159 11.832 4.46159C11.6532 4.46159 11.4893 4.52119 11.3701 4.65529C11.1019 4.92349 11.1019 5.3407 11.3701 5.6089L13.024 7.26282Z" fill="#878B96"/>
<path d="M1.83384 14.0126H8.67302C9.04552 14.0126 9.34352 13.7146 9.34352 13.3421V10.7346C9.34352 10.3621 9.04552 10.0641 8.67302 10.0641C8.30051 10.0641 8.00251 10.3621 8.00251 10.7346V12.6716H2.50435V3.19509H8.00251V5.13211C8.00251 5.50462 8.30051 5.80262 8.67302 5.80262C9.04552 5.80262 9.34352 5.50462 9.34352 5.13211V2.52458C9.34352 2.15208 9.04552 1.85408 8.67302 1.85408H1.83384C1.46133 1.85408 1.16333 2.15208 1.16333 2.52458V13.3272C1.16333 13.6997 1.46133 14.0126 1.83384 14.0126Z" fill="#878B96"/>
</svg>
