<svg width="24" height="24" viewBox="0 0 24 24" xmlns="http://www.w3.org/2000/svg">
<path fill-rule="evenodd" clip-rule="evenodd" d="M12 6.48C13.69 6.48 14.83 7.21 15.48 7.82L18.02 5.34C16.46 3.89 14.43 3 12 3C8.47996 3 5.43996 5.02 3.95996 7.96L6.86996 10.22C7.59996 8.05 9.61996 6.48 12 6.48Z" fill="currentColor"/>
<path fill-rule="evenodd" clip-rule="evenodd" d="M20.64 12.2C20.64 11.46 20.58 10.92 20.45 10.36H12V13.7H16.96C16.86 14.53 16.32 15.78 15.12 16.62L17.96 18.82C19.66 17.25 20.64 14.94 20.64 12.2Z" fill="currentColor"/>
<path fill-rule="evenodd" clip-rule="evenodd" d="M6.88 13.78C6.69 13.22 6.58 12.62 6.58 12C6.58 11.38 6.69 10.78 6.87 10.22L3.96 7.95999C3.35 9.17999 3 10.55 3 12C3 13.45 3.35 14.82 3.96 16.04L6.88 13.78Z" fill="currentColor"/>
<path fill-rule="evenodd" clip-rule="evenodd" d="M12.0002 21C14.4302 21 16.4702 20.2 17.9602 18.82L15.1202 16.62C14.3602 17.15 13.3402 17.52 12.0002 17.52C9.62022 17.52 7.60021 15.95 6.88021 13.78L3.97021 16.04C5.45021 18.98 8.48022 21 12.0002 21Z" fill="currentColor"/>
</svg>
