<svg width="16" height="16" viewBox="0 0 16 16" fill="none" xmlns="http://www.w3.org/2000/svg">
<path fill-rule="evenodd" clip-rule="evenodd" d="M13.3308 0H2.66675V5.328H7.99409L13.3308 0ZM7.99413 5.32811H2.66675V10.6641H7.99424L13.3308 16V0L7.99413 5.328V5.32811Z" fill="currentColor"/>
</svg>
