<svg width="24" height="24" viewBox="0 0 24 24" fill="none" xmlns="http://www.w3.org/2000/svg">
<path d="M15.54 11.29L9.87998 5.64004C9.78702 5.54631 9.67642 5.47191 9.55456 5.42115C9.4327 5.37038 9.30199 5.34424 9.16998 5.34424C9.03797 5.34424 8.90726 5.37038 8.78541 5.42115C8.66355 5.47191 8.55294 5.54631 8.45998 5.64004C8.27373 5.8274 8.16919 6.08085 8.16919 6.34504C8.16919 6.60922 8.27373 6.86267 8.45998 7.05004L13.41 12.05L8.45998 17C8.27373 17.1874 8.16919 17.4409 8.16919 17.705C8.16919 17.9692 8.27373 18.2227 8.45998 18.41C8.5526 18.5045 8.66304 18.5797 8.78492 18.6312C8.90679 18.6827 9.03767 18.7095 9.16998 18.71C9.30229 18.7095 9.43317 18.6827 9.55505 18.6312C9.67692 18.5797 9.78737 18.5045 9.87998 18.41L15.54 12.76C15.6415 12.6664 15.7225 12.5527 15.7779 12.4262C15.8333 12.2997 15.8619 12.1631 15.8619 12.025C15.8619 11.8869 15.8333 11.7503 15.7779 11.6238C15.7225 11.4973 15.6415 11.3837 15.54 11.29Z" fill="#171C27"/>
</svg>
