{
  "type" : "image",
  "data" : {
    "orientation" : 1,
    "alpha" : false,
    "width" : 1080,
    "resolution" : {
      "x" : 72,
      "y" : 72,
      "unit" : "dpi"
    },
    "height" : 1920
  }
}