{
    "name": "HandymanClientsay",
    "alias": "handymanclientsay",
    "description": "",
    "keywords": [],
    "order": 0,
    "providers": [
        "Modules\\HandymanClientsay\\Providers\\HandymanClientsayServiceProvider"
    ],
    "aliases": {},
    "files": [],
    "requires": []
}
