{
    "name": "ThemeSTBD",
    "alias": "themestbd",
    "description": "",
    "keywords": [],
    "order": 100,
    "providers": [
        "Modules\\ThemeSTBD\\Providers\\ThemeSTBDServiceProvider"
    ],
    "aliases": {},
    "files": [],
    "requires": []
}
