{
    "name": "JdesDashboard",
    "alias": "jdesdashboard",
    "description": "",
    "keywords": [],
    "order": 0,
    "providers": [
        "Modules\\JdesDashboard\\Providers\\JdesDashboardServiceProvider"
    ],
    "aliases": {},
    "files": [],
    "requires": []
}
