{
    "name": "A4iHerbicide",
    "alias": "a4iherbicide",
    "description": "",
    "keywords": [],
    "order": 0,
    "providers": [
        "Modules\\A4iHerbicide\\Providers\\A4iHerbicideServiceProvider"
    ],
    "aliases": {},
    "files": [],
    "requires": []
}
