{
    "name": "JdesSitemap",
    "alias": "jdessitemap",
    "description": "",
    "keywords": [],
    "order": 0,
    "providers": [
        "Modules\\JdesSitemap\\Providers\\JdesSitemapServiceProvider"
    ],
    "aliases": {},
    "files": [],
    "requires": []
}
