{
    "name": "EworkingInternalNotification",
    "alias": "eworkinginternalnotification",
    "description": "",
    "keywords": [],
    "order": 0,
    "providers": [
        "Modules\\EworkingInternalNotification\\Providers\\EworkingInternalNotificationServiceProvider"
    ],
    "aliases": {},
    "files": [],
    "requires": []
}
