{
    "name": "PaymentOnline",
    "alias": "paymentonline",
    "description": "",
    "keywords": [],
    "order": 0,
    "providers": [
        "Modules\\PaymentOnline\\Providers\\PaymentOnlineServiceProvider"
    ],
    "aliases": {},
    "files": [],
    "requires": []
}
