{
    "name": "HandymanServicesTheme",
    "alias": "handymanservicestheme",
    "description": "",
    "keywords": [],
    "order": 0,
    "providers": [
        "Modules\\HandymanServicesTheme\\Providers\\HandymanServicesThemeServiceProvider"
    ],
    "aliases": {},
    "files": [],
    "requires": []
}
