{
    "name": "HandymanServicesMenu",
    "alias": "handymanservicesmenu",
    "description": "",
    "keywords": [],
    "order": 0,
    "providers": [
        "Modules\\HandymanServicesMenu\\Providers\\HandymanServicesMenuServiceProvider"
    ],
    "aliases": {},
    "files": [],
    "requires": []
}
