{
    "name": "AppCoffeeSetting",
    "alias": "appcoffeesetting",
    "description": "",
    "keywords": [],
    "order": 0,
    "providers": [
        "Modules\\AppCoffeeSetting\\Providers\\AppCoffeeSettingServiceProvider"
    ],
    "aliases": {},
    "files": [],
    "requires": []
}
