{
    "name": "KitCareNotification",
    "alias": "kitcarenotification",
    "description": "",
    "keywords": [],
    "order": 0,
    "providers": [
        "Modules\\KitCareNotification\\Providers\\KitCareNotificationServiceProvider"
    ],
    "aliases": {},
    "files": [],
    "requires": []
}
