{
    "name": "EworkingAuth",
    "alias": "eworkingauth",
    "description": "",
    "keywords": [],
    "order": 0,
    "providers": [
        "Modules\\EworkingAuth\\Providers\\EworkingAuthServiceProvider"
    ],
    "aliases": {},
    "files": [],
    "requires": []
}
