{
    "name": "JdesSetting",
    "alias": "jdessetting",
    "description": "",
    "keywords": [],
    "order": 0,
    "providers": [
        "Modules\\JdesSetting\\Providers\\JdesSettingServiceProvider"
    ],
    "aliases": {},
    "files": [],
    "requires": []
}
