{
    "name": "Translate",
    "alias": "translate",
    "description": "",
    "keywords": [],
    "order": 0,
    "providers": [
        "Modules\\Translate\\Providers\\TranslateServiceProvider"
    ],
    "aliases": {},
    "files": [],
    "requires": []
}
