{
    "name": "AppCoffeeNotification",
    "alias": "appcoffeenotification",
    "description": "",
    "keywords": [],
    "order": 0,
    "providers": [
        "Modules\\AppCoffeeNotification\\Providers\\AppCoffeeNotificationServiceProvider"
    ],
    "aliases": {},
    "files": [],
    "requires": []
}
