{
    "name": "EduCourse",
    "alias": "educourse",
    "description": "",
    "keywords": [],
    "order": 0,
    "providers": [
        "Modules\\EduCourse\\Providers\\EduCourseServiceProvider"
    ],
    "aliases": {},
    "files": [],
    "requires": []
}
