{
    "name": "EworkingDashboard",
    "alias": "eworkingdashboard",
    "description": "",
    "keywords": [],
    "order": 0,
    "providers": [
        "Modules\\EworkingDashboard\\Providers\\EworkingDashboardServiceProvider"
    ],
    "aliases": {},
    "files": [],
    "requires": []
}
