{
    "name": "JdesBill",
    "alias": "jdesbill",
    "description": "",
    "keywords": [],
    "order": 0,
    "providers": [
        "Modules\\JdesBill\\Providers\\JdesBillServiceProvider"
    ],
    "aliases": {},
    "files": [],
    "requires": []
}
