{
    "name": "A4iFertilizerWarehouse",
    "alias": "a4ifertilizerwarehouse",
    "description": "",
    "keywords": [],
    "order": 0,
    "providers": [
        "Modules\\A4iFertilizerWarehouse\\Providers\\A4iFertilizerWarehouseServiceProvider"
    ],
    "aliases": {},
    "files": [],
    "requires": []
}
