
mode draw_3.png
size: 648,756
format: RGBA8888
filter: Linear,Linear
repeat: none
body
  rotate: false
  xy: 2, 184
  size: 389, 568
  orig: 389, 568
  offset: 0, 0
  index: -1
gongKinh
  rotate: true
  xy: 392, 321
  size: 431, 117
  orig: 431, 117
  offset: 0, 0
  index: -1
gongKinh2
  rotate: false
  xy: 2, 65
  size: 431, 117
  orig: 431, 117
  offset: 0, 0
  index: -1
kinh1
  rotate: true
  xy: 511, 249
  size: 172, 98
  orig: 172, 98
  offset: 0, 0
  index: -1
kinh2
  rotate: true
  xy: 511, 423
  size: 172, 98
  orig: 172, 98
  offset: 0, 0
  index: -1
mat1
  rotate: false
  xy: 2, 596
  size: 40, 77
  orig: 40, 77
  offset: 0, 0
  index: -1
mat2
  rotate: false
  xy: 2, 675
  size: 43, 77
  orig: 43, 77
  offset: 0, 0
  index: -1
matt
  rotate: false
  xy: 309, 737
  size: 76, 15
  orig: 76, 15
  offset: 0, 0
  index: -1
mỉng
  rotate: 270
  xy: 541, 586
  size: 166, 101
  orig: 166, 101
  offset: 0, 0
  index: -1
tay1
  rotate: false
  xy: 393, 104
  size: 154, 216
  orig: 154, 216
  offset: 0, 0
  index: -1
tay2
  rotate: 270
  xy: 411, 3
  size: 137, 190
  orig: 139, 191
  offset: 0, 1
  index: -1
