{
"skeleton": {
	"hash": "34mia+K7QzJ5tw1Pki4QzEnqmfE",
	"spine": "3.8.82",
	"x": -269.53,
	"y": -13.15,
	"width": 558.5,
	"height": 380,
	"images": "./images/",
	"audio": "D:/bach/Thanh Dao/char end/level-14"
},
"bones": [
	{ "name": "root", "scaleX": 0.5, "scaleY": 0.5 },
	{ "name": "bone2", "parent": "root", "x": -305.3, "y": 152.38 },
	{ "name": "bone", "parent": "bone2", "x": -14.9, "y": 124.79 },
	{ "name": "Layer 12", "parent": "bone", "length": 43.74, "rotation": 83.66, "x": 2.42, "y": 3.56 },
	{ "name": "Layer 13", "parent": "Layer 12", "length": 42.79, "rotation": -10.05, "x": 43.74 },
	{ "name": "Layer 14", "parent": "Layer 13", "length": 51.89, "rotation": -7.79, "x": 42.79 },
	{ "name": "tear-2-cry", "parent": "Layer 14", "length": 109.06, "rotation": -2.65, "x": 56.53, "y": -3.49 },
	{ "name": "leg-2cd", "parent": "bone", "length": 52.84, "rotation": -96.47, "x": 14.26, "y": 20.06 },
	{ "name": "leg-2cd2", "parent": "leg-2cd", "length": 52.12, "rotation": -20.27, "x": 52.84 },
	{ "name": "leg-2cd3", "parent": "leg-2cd2", "length": 34.52, "rotation": -9.12, "x": 52.12, "transform": "noRotationOrReflection" },
	{ "name": "leg-2cd4", "parent": "leg-2cd3", "length": 22.07, "rotation": 31.75, "x": 34.52 },
	{ "name": "leg-1a", "parent": "bone", "length": 56.97, "rotation": -105.32, "x": -35.77, "y": 44.98 },
	{ "name": "leg-1a2", "parent": "leg-1a", "length": 46.97, "rotation": -37.56, "x": 56.97 },
	{
		"name": "leg-1a3",
		"parent": "leg-1a2",
		"length": 28.82,
		"rotation": -9.74,
		"x": 47.25,
		"y": -0.21,
		"transform": "noRotationOrReflection"
	},
	{ "name": "leg-1a4", "parent": "leg-1a3", "length": 33.18, "rotation": 62.1, "x": 28.82 },
	{ "name": "1", "parent": "bone2", "x": -5.42, "y": 41.77, "color": "ff3f00ff" },
	{ "name": "2", "parent": "bone2", "x": -83.95, "y": 76.06, "color": "ff3f00ff" },
	{ "name": "diving-board-cut", "parent": "root", "length": 194.23, "rotation": 32.74, "x": -278.71, "y": 212.32 },
	{ "name": "hand-2c", "parent": "Layer 14", "length": 45.6, "rotation": 170.74, "x": 8.4, "y": -26.51 },
	{ "name": "hand-2c2", "parent": "hand-2c", "length": 29.27, "rotation": -0.06, "x": 45.6 },
	{ "name": "hand-2a", "parent": "hand-2c2", "length": 43.42, "rotation": -12.51, "x": 26.98, "y": -2.38 },
	{ "name": "hand-1b", "parent": "Layer 14", "length": 43.67, "rotation": 160.14, "x": 13.07, "y": 34.01 },
	{ "name": "hand-1b2", "parent": "hand-1b", "length": 34.38, "rotation": -14.5, "x": 43.67 },
	{ "name": "hand-1a", "parent": "hand-1b2", "length": 44.46, "rotation": -10.07, "x": 29.36, "y": 1.05 },
	{ "name": "tear-2-cry3", "parent": "tear-2-cry", "length": 51.73, "rotation": 117.37, "x": 75.25, "y": -42.36 },
	{ "name": "tear-1-cry", "parent": "tear-2-cry", "length": 56.67, "rotation": -107.09, "x": 88.47, "y": -132.33 },
	{ "name": "mouth-cry", "parent": "tear-2-cry", "x": 28.72, "y": -82.2 },
	{ "name": "iris-2b", "parent": "tear-2-cry", "x": 71.9, "y": -94.47 },
	{ "name": "iris-2", "parent": "tear-2-cry", "x": 84.54, "y": -116.18 },
	{ "name": "splash-1", "parent": "root", "length": 243.27, "rotation": 68.04, "x": 47.18, "y": 231.18 },
	{ "name": "splash-3", "parent": "splash-1", "length": 194.63, "rotation": 26.25, "x": 206.36, "y": 312.09 },
	{ "name": "splash-2", "parent": "root", "length": 192.19, "rotation": 125.5, "x": -220.89, "y": 456.8 }
],
"slots": [
	{ "name": "pool", "bone": "root", "attachment": "pool" },
	{ "name": "splash-1", "bone": "splash-1", "attachment": "splash-1" },
	{ "name": "splash-2", "bone": "splash-2", "attachment": "splash-2" },
	{ "name": "splash-3", "bone": "splash-3", "attachment": "splash-3" },
	{ "name": "diving-board-1", "bone": "root", "attachment": "diving-board-1" },
	{ "name": "diving-board-cut", "bone": "diving-board-cut" },
	{ "name": "hand-1b", "bone": "hand-1b", "attachment": "hand-1b" },
	{ "name": "hand-1a", "bone": "hand-1a", "attachment": "hand-1a" },
	{ "name": "leg-1a", "bone": "leg-1a", "attachment": "leg-1a" },
	{ "name": "leg-1b", "bone": "leg-1a3", "attachment": "leg-1b" },
	{ "name": "leg-1c", "bone": "leg-1a3" },
	{ "name": "Layer 11", "bone": "Layer 12", "attachment": "Layer 11" },
	{ "name": "leg-2b", "bone": "bone", "attachment": "leg-2b" },
	{ "name": "leg-2cd", "bone": "bone", "attachment": "leg-2cd" },
	{ "name": "hand-2b", "bone": "root" },
	{ "name": "leg-1c2", "bone": "leg-1a3", "attachment": "leg-1c" },
	{ "name": "leg-2c", "bone": "leg-2cd3", "attachment": "leg-2c" },
	{ "name": "hand-2c", "bone": "hand-2c", "attachment": "hand-2c" },
	{ "name": "hand-2a", "bone": "hand-2a", "attachment": "hand-2a" },
	{ "name": "face", "bone": "tear-2-cry", "attachment": "face" },
	{ "name": "eye-2", "bone": "tear-2-cry", "attachment": "eye-2" },
	{ "name": "iris-2", "bone": "iris-2", "attachment": "iris-2" },
	{ "name": "eye-2b", "bone": "tear-2-cry", "attachment": "eye-2b" },
	{ "name": "iris-2b", "bone": "iris-2b", "attachment": "iris-2b" },
	{ "name": "smile", "bone": "root" },
	{ "name": "tear-1-cry", "bone": "tear-1-cry", "attachment": "tear-1-cry" },
	{ "name": "tear-2-cry", "bone": "tear-2-cry3", "attachment": "tear-2-cry" },
	{ "name": "mouth-cry", "bone": "mouth-cry", "attachment": "mouth-cry" },
	{ "name": "brow-1-cry", "bone": "tear-2-cry", "attachment": "brow-1-cry" },
	{ "name": "brow-2-cry", "bone": "tear-2-cry", "attachment": "brow-2-cry" }
],
"ik": [
	{
		"name": "1",
		"bones": [ "leg-2cd", "leg-2cd2" ],
		"target": "1",
		"bendPositive": false
	},
	{
		"name": "2",
		"order": 1,
		"bones": [ "leg-1a", "leg-1a2" ],
		"target": "2",
		"bendPositive": false
	}
],
"skins": [
	{
		"name": "default",
		"attachments": {
			"Layer 11": {
				"Layer 11": {
					"type": "mesh",
					"uvs": [ 0.73152, 0.11686, 0.80209, 0.23386, 0.82252, 0.35248, 0.89332, 0.42297, 0.96724, 0.51999, 0.99276, 0.63847, 0.99116, 0.73004, 0.95642, 0.81225, 0.91014, 0.88305, 0.83608, 0.95415, 0.68709, 1, 0.53575, 1, 0.39696, 0.92864, 0.27237, 0.84584, 0.17301, 0.75476, 0.08181, 0.62734, 0, 0.48581, 0, 0.35411, 0.05924, 0.19811, 0.19481, 0.06648, 0.39166, 0, 0.59595, 0, 0.66966, 0.7395, 0.55578, 0.64174, 0.4505, 0.5139, 0.40968, 0.35034, 0.43117, 0.1849 ],
					"triangles": [ 26, 20, 21, 26, 21, 0, 19, 20, 26, 26, 18, 19, 1, 26, 0, 1, 25, 26, 25, 18, 26, 17, 18, 25, 16, 17, 25, 2, 25, 1, 24, 25, 2, 16, 25, 24, 15, 16, 24, 23, 24, 2, 23, 2, 3, 22, 23, 3, 4, 22, 3, 4, 5, 22, 6, 22, 5, 14, 24, 23, 7, 22, 6, 8, 22, 7, 14, 15, 24, 13, 14, 23, 12, 13, 23, 12, 23, 22, 9, 22, 8, 11, 12, 22, 22, 10, 11, 9, 10, 22 ],
					"vertices": [ 2, 4, 100.89, -34.78, 0.05576, 5, 62.27, -26.59, 0.94424, 3, 3, 115.11, -66.71, 2.9E-4, 4, 81.92, -53.23, 0.25936, 5, 45.98, -47.44, 0.74035, 3, 3, 91.93, -72.88, 0.02148, 4, 60.17, -63.36, 0.57229, 5, 25.8, -60.42, 0.40622, 3, 3, 79.28, -86.76, 0.07291, 4, 50.14, -79.22, 0.73152, 5, 18.02, -77.5, 0.19558, 3, 3, 61.43, -101.76, 0.15, 4, 35.17, -97.11, 0.76583, 5, 5.61, -97.24, 0.08417, 3, 3, 38.37, -108.81, 0.2465, 4, 13.7, -108.08, 0.72318, 5, -14.18, -111.02, 0.03032, 3, 3, 20.14, -110.55, 0.32524, 4, -3.95, -112.98, 0.66409, 5, -31, -118.27, 0.01067, 3, 3, 3.12, -106.33, 0.40401, 4, -21.44, -111.78, 0.59356, 5, -48.49, -119.46, 0.00243, 3, 3, -11.84, -99.84, 0.48061, 4, -37.31, -108.01, 0.51931, 5, -64.72, -117.87, 8.0E-5, 2, 3, -27.41, -88.53, 0.56412, 4, -54.6, -99.59, 0.43588, 2, 3, -39.4, -63.63, 0.69164, 4, -70.76, -77.16, 0.30836, 2, 3, -42.33, -37.31, 0.81449, 4, -78.23, -51.75, 0.18551, 2, 3, -30.82, -11.59, 0.93479, 4, -71.39, -24.43, 0.06521, 2, 3, -16.77, 11.91, 0.99948, 4, -61.66, 1.17, 5.2E-4, 2, 3, -0.59, 31.2, 0.98025, 4, -49.09, 22.99, 0.01975, 2, 3, 22.98, 49.88, 0.72799, 4, -29.14, 45.49, 0.27201, 3, 3, 49.53, 67.23, 0.36709, 4, -6.03, 67.21, 0.62246, 5, -57.48, 59.97, 0.01045, 3, 3, 75.71, 70.14, 0.17479, 4, 19.24, 74.64, 0.74457, 5, -33.45, 70.76, 0.08064, 3, 3, 107.86, 63.28, 0.03948, 4, 52.1, 73.5, 0.65339, 5, -0.74, 74.08, 0.30713, 3, 3, 136.65, 42.61, 8.9E-4, 4, 84.05, 58.17, 0.34351, 5, 32.99, 63.22, 0.6556, 2, 4, 106.52, 28.87, 0.06107, 5, 59.23, 37.24, 0.93893, 1, 5, 73.87, 4.63, 1, 3, 3, 12.04, -54.85, 0.50504, 4, -21.64, -59.53, 0.49352, 5, -55.77, -67.72, 0.00143, 3, 3, 29.27, -32.88, 0.43558, 4, -8.5, -34.9, 0.56297, 5, -46.09, -41.53, 0.00145, 2, 3, 52.65, -11.75, 0.00316, 4, 10.83, -10.01, 0.99684, 2, 4, 40.19, 6.07, 0.89976, 5, -3.4, 5.67, 0.10024, 2, 4, 73, 11.8, 0.05461, 5, 28.32, 15.79, 0.94539 ],
					"hull": 22,
					"edges": [ 34, 36, 36, 38, 38, 40, 40, 42, 42, 0, 0, 2, 2, 4, 32, 34, 32, 30, 30, 28, 28, 26, 26, 24, 24, 22, 20, 22, 20, 18, 18, 16, 16, 14, 14, 12, 12, 10, 10, 8, 8, 6, 6, 4 ],
					"width": 175,
					"height": 200
				}
			},
			"brow-1-cry": {
				"brow-1-cry": { "x": 126.62, "y": -52.66, "rotation": -63.18, "width": 55, "height": 11 }
			},
			"brow-2-cry": {
				"brow-2-cry": { "x": 125.85, "y": -128.69, "rotation": -63.18, "width": 20, "height": 55 }
			},
			"diving-board-1": {
				"diving-board-1": { "x": -354.05, "y": 152.2, "width": 238, "height": 215 }
			},
			"diving-board-cut": {
				"diving-board-cut": { "x": 100.35, "y": -15.67, "rotation": -32.74, "width": 259, "height": 180 }
			},
			"eye-2": {
				"eye-2": { "x": 95.31, "y": -100.43, "rotation": -63.18, "width": 58, "height": 72 }
			},
			"eye-2b": {
				"eye-2b": { "x": 86.27, "y": -79.23, "rotation": -63.18, "width": 58, "height": 71 }
			},
			"face": {
				"face": { "x": 46.92, "y": -20.44, "rotation": -63.18, "width": 184, "height": 187 }
			},
			"hand-1a": {
				"hand-1a": { "x": 30.16, "y": -3.89, "rotation": 158.61, "width": 88, "height": 82 }
			},
			"hand-1b": {
				"hand-1b": { "x": 47.15, "y": -7.07, "rotation": 134.04, "width": 89, "height": 72 }
			},
			"hand-2a": {
				"hand-2a": { "x": 23.16, "y": 4.33, "rotation": 136.01, "width": 98, "height": 93 }
			},
			"hand-2b": {
				"hand-2b": { "x": 516.5, "y": -566, "width": 61, "height": 62 }
			},
			"hand-2c": {
				"hand-2c": { "x": 40.67, "y": 0.9, "rotation": 123.44, "width": 52, "height": 77 }
			},
			"iris-2": {
				"iris-2": { "x": -1.23, "y": 0.71, "rotation": -63.18, "width": 20, "height": 25 }
			},
			"iris-2b": {
				"iris-2b": { "x": 1.91, "y": -0.02, "rotation": -63.18, "width": 20, "height": 25 }
			},
			"leg-1a": {
				"leg-1a": {
					"type": "mesh",
					"uvs": [ 0.90608, 0.05973, 0.98702, 0.17962, 0.9654, 0.30151, 0.91815, 0.43871, 0.85515, 0.55771, 0.74315, 0.67811, 0.59965, 0.77891, 0.44215, 0.88951, 0.2794, 1, 0.06415, 0.92731, 0, 0.75744, 0.15105, 0.65015, 0.30975, 0.54107, 0.43493, 0.44808, 0.5154, 0.37834, 0.58693, 0.28177, 0.62493, 0.16911, 0.62493, 0.04573, 0.76128, 0 ],
					"triangles": [ 6, 13, 5, 13, 14, 5, 5, 14, 4, 4, 14, 3, 3, 14, 15, 2, 3, 15, 2, 15, 16, 16, 18, 0, 1, 2, 16, 1, 16, 0, 16, 17, 18, 8, 9, 7, 9, 11, 7, 9, 10, 11, 11, 12, 7, 7, 12, 6, 12, 13, 6 ],
					"vertices": [ 1, 11, 4.21, 9.92, 1, 1, 11, 12.59, 17.92, 1, 1, 11, 22.97, 19.24, 1, 1, 11, 35.07, 19.22, 1, 1, 11, 45.95, 17.76, 1, 2, 12, -6.62, 11.36, 0.14936, 11, 57.84, 13.12, 0.85064, 2, 12, 6.37, 11.49, 0.91434, 11, 68.68, 5.97, 0.08566, 1, 12, 20.62, 11.63, 1, 1, 12, 35.13, 11.54, 1, 1, 12, 42.2, -2.69, 1, 1, 12, 36.09, -16.48, 1, 2, 12, 22.36, -16.7, 0.99782, 11, 66.18, -26.34, 0.00218, 2, 12, 8.13, -16.69, 0.78878, 11, 54.39, -18.38, 0.21122, 2, 12, -3.48, -17.13, 0.21616, 11, 44.51, -12.26, 0.78384, 2, 12, -11.49, -18.06, 0.01993, 11, 37.35, -8.55, 0.98007, 1, 11, 28.15, -6.03, 1, 1, 11, 18.23, -6.06, 1, 1, 11, 8.12, -8.83, 1, 1, 11, 1.92, -0.92, 1 ],
					"hull": 19,
					"edges": [ 20, 22, 22, 24, 24, 26, 26, 28, 28, 30, 30, 32, 32, 34, 34, 36, 36, 0, 0, 2, 20, 18, 18, 16, 16, 14, 14, 12, 12, 10, 10, 8, 8, 6, 6, 4, 4, 2 ],
					"width": 68,
					"height": 85
				}
			},
			"leg-1b": {
				"leg-1b": {
					"type": "mesh",
					"uvs": [ 0.85063, 0.05125, 0.96711, 0.21038, 1, 0.39763, 0.94525, 0.55676, 0.85656, 0.70636, 0.6156, 0.89676, 0.42786, 1, 0.25934, 0.94922, 0.12039, 0.80156, 0.07013, 0.60145, 0.10425, 0.40778, 0.12111, 0.14793, 0.32801, 0.05125, 0.47974, 0.04923, 0.51805, 0.10563, 0.65599, 0, 0.41274, 0.60972, 0.62913, 0.47652, 0.77156, 0.37932 ],
					"triangles": [ 5, 17, 4, 17, 18, 4, 4, 18, 3, 16, 14, 17, 3, 18, 2, 17, 14, 18, 18, 1, 2, 14, 15, 18, 18, 0, 1, 18, 15, 0, 5, 6, 16, 6, 7, 16, 7, 8, 16, 5, 16, 17, 8, 9, 16, 9, 10, 16, 16, 10, 12, 10, 11, 12, 14, 12, 13, 14, 16, 12 ],
					"vertices": [ 2, 12, -6.44, 27.24, 5.0E-5, 14, 39.92, -2.53, 0.99995, 1, 14, 37.65, -17.82, 1, 1, 14, 29.11, -28.22, 1, 2, 13, 64.3, 0.7, 1.3E-4, 14, 17.22, -31.03, 0.99987, 2, 13, 58.03, -11, 0.04604, 14, 3.94, -30.96, 0.95396, 2, 13, 38.44, -27.89, 0.66039, 14, -20.15, -21.55, 0.33961, 2, 13, 22.64, -37.94, 0.9436, 14, -36.42, -12.28, 0.0564, 2, 13, 6.75, -37.05, 0.99709, 14, -43.07, 2.17, 0.00291, 1, 13, -7.59, -29.03, 1, 1, 13, -14.52, -16.01, 1, 2, 12, 55.65, -11.26, 0.00608, 13, -13.72, -2.11, 0.99392, 2, 12, 40.4, -21.3, 0.42409, 13, -15.27, 16.08, 0.57591, 2, 12, 23.31, -10.53, 0.96233, 13, 2.35, 25.97, 0.03767, 1, 12, 14.56, 0.34, 1, 3, 12, 15.48, 5.56, 0.80474, 13, 20.22, 25.17, 0.0124, 14, 18.22, 19.38, 0.18286, 2, 12, 1.82, 10.95, 0.19241, 14, 31.83, 13.84, 0.80759, 2, 13, 16.64, -11.24, 0.9955, 14, -15.64, 5.5, 0.0045, 1, 14, 3.91, -4.57, 1, 1, 14, 17.3, -10.79, 1 ],
					"hull": 16,
					"edges": [ 20, 22, 22, 24, 24, 26, 26, 28, 28, 30, 30, 0, 0, 2, 2, 4, 20, 18, 18, 16, 16, 14, 14, 12, 12, 10, 10, 8, 8, 6, 6, 4 ],
					"width": 92,
					"height": 70
				}
			},
			"leg-1c2": {
				"leg-1c": {
					"type": "mesh",
					"uvs": [ 0.81262, 0.03793, 0.91652, 0.18962, 0.92788, 0.42417, 0.84184, 0.4663, 0.75093, 0.47613, 0.83731, 0.51751, 0.94432, 0.57414, 1, 0.72605, 0.95002, 0.88666, 0.82998, 1, 0.58687, 0.9708, 0.35135, 0.88141, 0.14622, 0.71314, 0.05201, 0.48965, 0.01816, 0.30884, 0.1012, 0.15275, 0.26429, 0.099, 0.41652, 0.07866, 0.49769, 0.08709, 0.59671, 0, 0.41574, 0.3827, 0.42234, 0.51969, 0.40254, 0.68807 ],
					"triangles": [ 20, 16, 17, 20, 17, 18, 19, 0, 18, 3, 1, 2, 18, 0, 1, 3, 4, 1, 4, 18, 1, 20, 18, 4, 21, 13, 14, 21, 20, 4, 15, 20, 21, 20, 15, 16, 15, 21, 14, 21, 12, 13, 22, 12, 21, 11, 12, 22, 6, 7, 5, 4, 22, 21, 5, 22, 4, 7, 10, 5, 8, 10, 7, 5, 10, 22, 11, 22, 10, 9, 10, 8 ],
					"vertices": [ 11.42, 23.68, 21.59, 11.73, 25.98, -8.7, 20.09, -13.51, 13.33, -15.56, 20.51, -18.07, 29.49, -21.64, 36, -34.24, 34.62, -48.98, 27.22, -60.48, 8.33, -61.09, -10.89, -56.32, -28.99, -44.23, -39.5, -25.85, -44.79, -10.43, -40.84, 4.34, -29.28, 11.18, -18.03, 14.95, -11.74, 15.27, -5.54, 24.19, -13.51, -11.73, -10.95, -23.66, -9.91, -38.69 ],
					"hull": 20,
					"edges": [ 28, 30, 30, 32, 32, 34, 34, 36, 36, 38, 38, 0, 0, 2, 2, 4, 8, 6, 6, 4, 8, 10, 10, 12, 12, 14, 28, 26, 26, 24, 24, 22, 22, 20, 20, 18, 18, 16, 16, 14 ],
					"width": 77,
					"height": 89
				}
			},
			"leg-2b": {
				"leg-2b": {
					"type": "mesh",
					"uvs": [ 0.58502, 0.07047, 0.63583, 0.18309, 0.79776, 0.15091, 0.9325, 0.31113, 1, 0.57146, 0.94535, 0.74743, 0.79763, 0.91083, 0.58683, 1, 0.33654, 1, 0.17932, 0.85852, 0.09632, 0.6671, 0.10389, 0.41792, 0.23257, 0.06587, 0.42467, 0, 0.33667, 0.64153, 0.54018, 0.65837, 0.70589, 0.54472 ],
					"triangles": [ 16, 1, 2, 16, 2, 3, 16, 3, 4, 5, 16, 4, 6, 16, 5, 15, 16, 6, 15, 14, 1, 16, 15, 1, 9, 10, 14, 8, 9, 14, 8, 14, 15, 7, 15, 6, 8, 15, 7, 14, 12, 13, 1, 14, 13, 1, 13, 0, 11, 12, 14, 10, 11, 14 ],
					"vertices": [ 3, 8, 12.22, 16.36, 0.80665, 9, 19.19, 38.61, 0.10281, 10, 7.29, 40.9, 0.09054, 3, 8, 18.47, 22.86, 0.52485, 9, 25.23, 31.92, 0.21032, 10, 8.9, 32.03, 0.26483, 3, 8, 12.83, 37.68, 0.16932, 9, 40.42, 36.48, 0.15163, 10, 24.21, 27.91, 0.67905, 3, 8, 20.34, 52.83, 0.04079, 9, 54.99, 27.89, 0.04337, 10, 32.08, 12.94, 0.91585, 1, 10, 31.34, -5.67, 1, 1, 10, 21.87, -14.48, 1, 2, 9, 48.26, -13.83, 0.07283, 10, 4.41, -19, 0.92717, 2, 9, 28.98, -22.89, 0.80506, 10, -16.75, -16.55, 0.19494, 2, 8, 78.33, 6.91, 0.004, 9, 5, -26.64, 0.996, 2, 8, 72.53, -10.09, 0.2519, 9, -11.53, -19.63, 0.7481, 2, 8, 61.85, -20.82, 0.6696, 9, -21.47, -8.2, 0.3304, 3, 8, 45.42, -23.87, 0.96598, 9, -23.32, 8.41, 0.03402, 10, -44.76, 37.58, 0, 3, 8, 19.63, -17.02, 1, 9, -14.63, 33.64, 0, 10, -24.09, 54.47, 0, 3, 8, 11.13, 0.14, 0.99981, 9, 3.1, 40.88, 1.1E-4, 10, -5.2, 51.29, 8.0E-5, 1, 9, 1.3, -2.91, 1, 1, 9, 20.98, -0.97, 1, 3, 8, 40.54, 34.94, 0.04069, 9, 35.68, 9.03, 0.33568, 10, 5.75, 7.06, 0.62363 ],
					"hull": 14,
					"edges": [ 24, 26, 26, 0, 0, 2, 2, 4, 4, 6, 6, 8, 22, 20, 20, 18, 18, 16, 14, 16, 14, 12, 12, 10, 10, 8, 22, 24 ],
					"width": 97,
					"height": 67
				}
			},
			"leg-2c": {
				"leg-2c": {
					"type": "mesh",
					"uvs": [ 0.91792, 0.22088, 0.90231, 0.43529, 0.72273, 0.48319, 0.91011, 0.53109, 1, 0.7318, 1, 1, 0, 1, 0, 0, 0.78519, 0 ],
					"triangles": [ 6, 2, 5, 5, 2, 4, 2, 3, 4, 6, 7, 2, 1, 2, 0, 2, 7, 8, 0, 2, 8 ],
					"vertices": [ 2, 8, 27.32, 13.54, 0.79997, 9, 15.29, 23.76, 0.20003, 1, 9, 17.03, 4.72, 1, 2, 8, 53.49, 3.96, 0.0466, 9, 3.85, -1.65, 0.9534, 1, 9, 18.95, -3.61, 1, 1, 9, 28.64, -20.18, 1, 1, 9, 32.32, -43.76, 1, 2, 8, 111.01, -40.6, 0.21856, 9, -44.74, -55.8, 0.78144, 2, 8, 24.3, -60.65, 0.98579, 9, -58.48, 32.13, 0.01421, 2, 8, 10.5, -0.98, 1, 9, 2.03, 41.59, 0 ],
					"hull": 9,
					"edges": [ 10, 12, 12, 14, 4, 2, 2, 0, 14, 16, 0, 16, 4, 6, 10, 8, 6, 8 ],
					"width": 78,
					"height": 89
				}
			},
			"leg-2cd": {
				"leg-2cd": {
					"type": "mesh",
					"uvs": [ 0.86142, 0.05726, 0.94378, 0.18534, 0.96178, 0.3278, 0.96617, 0.47322, 0.87833, 0.60249, 0.63115, 0.84641, 0.50317, 0.96272, 0.30342, 1, 0.09052, 0.94585, 0.02833, 0.81606, 0.1575, 0.69082, 0.29044, 0.55619, 0.3728, 0.4564, 0.43319, 0.36704, 0.45515, 0.23896, 0.36456, 0.07364, 0.5677, 0, 0.75915, 0.71476 ],
					"triangles": [ 5, 17, 4, 10, 11, 17, 17, 11, 4, 11, 12, 4, 4, 12, 3, 12, 13, 3, 13, 2, 3, 13, 14, 2, 14, 1, 2, 14, 0, 1, 14, 16, 0, 14, 15, 16, 6, 7, 9, 5, 6, 9, 9, 7, 8, 9, 10, 5, 5, 10, 17 ],
					"vertices": [ 1, 7, -9.73, 8.44, 1, 1, 7, 1.31, 14.83, 1, 1, 7, 14.29, 18.24, 1, 1, 7, 27.68, 21.03, 1, 2, 8, -18.35, 13.19, 0.0382, 7, 40.45, 18.91, 0.9618, 2, 8, 7.78, 14.6, 0.98196, 7, 65.34, 10.83, 0.01804, 1, 8, 20.51, 14.83, 1, 1, 8, 28.86, 8.03, 1, 1, 8, 30.28, -3.88, 1, 2, 8, 21.59, -13.01, 0.99895, 7, 68.31, -19.91, 0.00105, 2, 8, 8.12, -13.64, 0.80676, 7, 55.51, -15.65, 0.19324, 2, 8, -6.21, -14.57, 0.08581, 7, 41.81, -11.36, 0.91419, 1, 7, 31.8, -9, 1, 1, 7, 22.98, -7.55, 1, 1, 7, 10.94, -8.71, 1, 1, 7, -3.46, -16.16, 1, 1, 7, -12.2, -7.28, 1, 2, 8, -6.18, 13.6, 0.40276, 7, 51.96, 14.92, 0.59724 ],
					"hull": 17,
					"edges": [ 18, 16, 16, 14, 14, 12, 18, 20, 20, 22, 22, 24, 24, 26, 26, 28, 28, 30, 30, 32, 32, 0, 0, 2, 2, 4, 4, 6, 6, 8, 12, 10, 10, 34, 34, 8, 8, 10 ],
					"width": 51,
					"height": 94
				}
			},
			"mouth-cry": {
				"mouth-cry": { "x": -1.04, "y": 4.72, "rotation": -63.18, "width": 84, "height": 50 }
			},
			"pool": {
				"pool": { "x": 19.45, "y": 267.7, "width": 1117, "height": 588 }
			},
			"smile": {
				"smile": { "x": 611.5, "y": -495.5, "width": 55, "height": 45 }
			},
			"splash-1": {
				"splash-1": { "x": 159.28, "y": -40.65, "rotation": -68.04, "width": 219, "height": 344 }
			},
			"splash-2": {
				"splash-2": { "x": 103.64, "y": 8.58, "rotation": -125.5, "width": 150, "height": 177 }
			},
			"splash-3": {
				"splash-3": { "x": 89.85, "y": -4.27, "rotation": -94.29, "width": 79, "height": 209 }
			},
			"tear-1-cry": {
				"tear-1-cry": { "x": 27.26, "y": -2.9, "rotation": 43.92, "width": 56, "height": 55 }
			},
			"tear-2-cry": {
				"tear-2-cry": { "x": 33.33, "y": -2.42, "rotation": 179.46, "width": 80, "height": 40 }
			}
		}
	}
],
"animations": {
	"finish": {
		"slots": {
			"diving-board-cut": {
				"attachment": [
					{ "name": "diving-board-cut" }
				]
			}
		},
		"bones": {
			"splash-1": {
				"translate": [
					{ "x": -3.75, "y": -60 }
				],
				"scale": [
					{ "x": 0, "y": 0 }
				]
			},
			"splash-2": {
				"translate": [
					{ "x": 243.45, "y": -280.72 }
				],
				"scale": [
					{ "x": 0, "y": -0.02 }
				]
			},
			"splash-3": {
				"translate": [
					{ "x": -162.93, "y": 137.96 }
				],
				"scale": [
					{ "y": -0.02 }
				]
			},
			"iris-2b": {
				"translate": [
					{ "curve": 0.215, "c3": 0.815 },
					{ "time": 0.1667, "x": 18.37, "y": 6.43, "curve": 0.215, "c3": 0.815 },
					{ "time": 0.3333, "curve": 0.215, "c3": 0.815 },
					{ "time": 0.5, "x": 18.37, "y": 6.43, "curve": 0.215, "c3": 0.815 },
					{ "time": 0.6667, "curve": 0.215, "c3": 0.815 },
					{ "time": 0.8333, "x": 18.37, "y": 6.43, "curve": 0.215, "c3": 0.815 },
					{ "time": 1 }
				]
			},
			"tear-2-cry3": {
				"scale": [
					{ "curve": 0.215, "c3": 0.815 },
					{ "time": 0.0667, "x": 0.571, "y": 0.571, "curve": 0.215, "c3": 0.815 },
					{ "time": 0.1667, "curve": 0.215, "c3": 0.815 },
					{ "time": 0.2333, "x": 0.571, "y": 0.571, "curve": 0.215, "c3": 0.815 },
					{ "time": 0.3333, "curve": 0.215, "c3": 0.815 },
					{ "time": 0.4, "x": 0.571, "y": 0.571, "curve": 0.215, "c3": 0.815 },
					{ "time": 0.5, "curve": 0.215, "c3": 0.815 },
					{ "time": 0.5667, "x": 0.571, "y": 0.571, "curve": 0.215, "c3": 0.815 },
					{ "time": 0.6667, "curve": 0.215, "c3": 0.815 },
					{ "time": 0.7333, "x": 0.571, "y": 0.571, "curve": 0.215, "c3": 0.815 },
					{ "time": 0.8333, "curve": 0.215, "c3": 0.815 },
					{ "time": 0.9, "x": 0.571, "y": 0.571 }
				]
			},
			"tear-1-cry": {
				"scale": [
					{ "curve": 0.215, "c3": 0.815 },
					{ "time": 0.0667, "x": 0.571, "y": 0.571, "curve": 0.215, "c3": 0.815 },
					{ "time": 0.1667, "curve": 0.215, "c3": 0.815 },
					{ "time": 0.2333, "x": 0.571, "y": 0.571, "curve": 0.215, "c3": 0.815 },
					{ "time": 0.3333, "curve": 0.215, "c3": 0.815 },
					{ "time": 0.4, "x": 0.571, "y": 0.571, "curve": 0.215, "c3": 0.815 },
					{ "time": 0.5, "curve": 0.215, "c3": 0.815 },
					{ "time": 0.5667, "x": 0.571, "y": 0.571, "curve": 0.215, "c3": 0.815 },
					{ "time": 0.6667, "curve": 0.215, "c3": 0.815 },
					{ "time": 0.7333, "x": 0.571, "y": 0.571, "curve": 0.215, "c3": 0.815 },
					{ "time": 0.8333, "curve": 0.215, "c3": 0.815 },
					{ "time": 0.9, "x": 0.571, "y": 0.571 }
				]
			},
			"mouth-cry": {
				"scale": [
					{ "curve": 0.215, "c3": 0.815 },
					{ "time": 0.1667, "x": 0.771, "y": 0.771, "curve": 0.215, "c3": 0.815 },
					{ "time": 0.3333, "curve": 0.215, "c3": 0.815 },
					{ "time": 0.5, "x": 0.602, "y": 0.602, "curve": 0.215, "c3": 0.815 },
					{ "time": 0.6667, "curve": 0.215, "c3": 0.815 },
					{ "time": 0.8333, "x": 0.602, "y": 0.602, "curve": 0.215, "c3": 0.815 },
					{ "time": 1 }
				]
			},
			"iris-2": {
				"translate": [
					{ "curve": 0.215, "c3": 0.815 },
					{ "time": 0.1667, "x": 18.37, "y": 6.43, "curve": 0.215, "c3": 0.815 },
					{ "time": 0.3333, "curve": 0.215, "c3": 0.815 },
					{ "time": 0.5, "x": 18.37, "y": 6.43, "curve": 0.215, "c3": 0.815 },
					{ "time": 0.6667, "curve": 0.215, "c3": 0.815 },
					{ "time": 0.8333, "x": 18.37, "y": 6.43, "curve": 0.215, "c3": 0.815 },
					{ "time": 1 }
				]
			},
			"bone2": {
				"rotate": [
					{ "angle": 66.58 }
				],
				"translate": [
					{ "x": 340.07, "y": 8.09 }
				],
				"scale": [
					{ "x": 0.603, "y": 0.603 }
				]
			},
			"bone": {
				"translate": [
					{ "curve": 0.215, "c3": 0.815 },
					{ "time": 0.5, "x": -5.77, "y": -11.12, "curve": 0.215, "c3": 0.815 },
					{ "time": 1 }
				]
			},
			"leg-2cd": {
				"rotate": [
					{ "angle": 98.35 }
				]
			},
			"leg-2cd2": {
				"rotate": [
					{ "angle": -46.86 }
				]
			},
			"leg-2cd3": {
				"rotate": [
					{ "angle": 23.21 }
				]
			},
			"leg-1a": {
				"rotate": [
					{ "angle": 106.2 }
				]
			},
			"leg-1a2": {
				"rotate": [
					{ "angle": -29.03 }
				]
			},
			"1": {
				"translate": [
					{ "x": 74.53, "y": 48.07 }
				]
			},
			"2": {
				"translate": [
					{ "x": 104.7, "y": 42.37 }
				]
			},
			"diving-board-cut": {
				"rotate": [
					{ "angle": -6.9 }
				],
				"translate": [
					{ "x": 128.88, "y": -27.44, "curve": 0.423, "c2": 0.57, "c3": 0.79 },
					{ "time": 0.1667, "x": 129.75, "y": -25.27, "curve": 0.25, "c3": 0.75 },
					{ "time": 0.6667, "x": 126.93, "y": -32.3, "curve": 0.203, "c3": 0.648, "c4": 0.6 },
					{ "time": 1, "x": 128.88, "y": -27.44 }
				]
			},
			"hand-2c": {
				"rotate": [
					{ "angle": 10.3 }
				]
			},
			"hand-1b": {
				"rotate": [
					{ "angle": 168.04 }
				]
			}
		},
		"deform": {
			"default": {
				"Layer 11": {
					"Layer 11": [
						{
							"offset": 10,
							"vertices": [ -4.47012, 2.75507, -4.88278, 1.93225, -5.09955, 1.25333, -7.57921, 6.06403, -8.52141, 4.64816, -9.07266, 3.45071, -7.57921, 6.06403, -8.52141, 4.64816, -9.07266, 3.45071, -7.57921, 6.06403, -8.52141, 4.64816, -9.07266, 3.45071, -7.57921, 6.06403, -8.52141, 4.64816, -9.07266, 3.45071, -7.57921, 6.06403, -8.52141, 4.64816, -9.07266, 3.45071, -7.57921, 6.06403, -8.52141, 4.64816, -9.07266, 3.45071, -7.57921, 6.06403, -8.52141, 4.64816, -7.57921, 6.06403, -8.52141, 4.64816, -7.57921, 6.06403, -8.52141, 4.64816, -4.66209, 4.96344, -5.45692, 4.07358 ]
						}
					]
				}
			}
		}
	},
	"quest": {
		"slots": {
			"leg-1b": {
				"attachment": [
					{ "name": null }
				]
			},
			"leg-2b": {
				"attachment": [
					{ "name": null }
				]
			},
			"splash-1": {
				"color": [
					{ "color": "ffffff00" }
				]
			},
			"splash-2": {
				"color": [
					{ "color": "ffffff00" }
				]
			},
			"splash-3": {
				"color": [
					{ "color": "ffffff00" }
				]
			},
			"tear-1-cry": {
				"attachment": [
					{ "name": null }
				]
			},
			"tear-2-cry": {
				"attachment": [
					{ "name": null }
				]
			}
		},
		"bones": {
			"bone": {
				"translate": [
					{ "curve": 0.215, "c3": 0.815 },
					{ "time": 0.5, "x": -5.77, "y": -11.12, "curve": 0.215, "c3": 0.815 },
					{ "time": 1 }
				]
			},
			"tear-1-cry": {
				"rotate": [
					{ "angle": -6 }
				]
			}
		},
		"deform": {
			"default": {
				"Layer 11": {
					"Layer 11": [
						{
							"offset": 10,
							"vertices": [ 3.74959, -2.78043, 4.1774, -2.08381, 4.42107, -1.49802, 5.09474, -4.46113, 5.79545, -3.50415, 6.21652, -2.68586, 5.09474, -4.46113, 5.79545, -3.50415, 6.21652, -2.68586, 5.09474, -4.46113, 5.79545, -3.50415, 6.21652, -2.68586, 5.09474, -4.46113, 5.79545, -3.50415, 6.21652, -2.68586, 5.09474, -4.46113, 5.79545, -3.50415, 6.21652, -2.68586, 5.09474, -4.46113, 5.79545, -3.50415, 6.21652, -2.68586, 5.09474, -4.46113, 5.79545, -3.50415, 5.09474, -4.46113, 5.79545, -3.50415, 3.63701, 0.94636, 3.41623, 1.56625, -0.94449, 1.00554, -1.10551, 0.82526, 0, 0, 0, 0, 0, 0, 0, 0, 0, 0, 0, 0, 0, 0, 0, 0, 0, 0, 0, 0, 0, 0, 0, 0, 0, 0, 0, 0, 0, 0, 0, 0, 0, 0, 0, 0, 0, 0, 0, 0, 0, 0, 6.63021, -5.68963, 7.52179, -4.44582, 8.05454, -3.38493, 3.5737, -1.31672, 3.74879, -0.67306, 3.80527, -0.15862 ],
							"curve": 0.38,
							"c2": 0.59,
							"c3": 0.727
						},
						{
							"time": 0.1333,
							"offset": 10,
							"vertices": [ 5.83788, -4.18677, 6.47922, -3.10413, 6.83986, -2.19702, 8.31467, -7.13513, 9.43277, -5.57532, 10.10086, -4.2449, 8.31467, -7.13513, 9.43277, -5.57532, 10.10086, -4.2449, 8.31467, -7.13513, 9.43277, -5.57532, 10.10086, -4.2449, 8.31467, -7.13513, 9.43277, -5.57532, 10.10086, -4.2449, 8.31467, -7.13513, 9.43277, -5.57532, 10.10086, -4.2449, 8.31467, -7.13513, 9.43277, -5.57532, 10.10086, -4.2449, 8.31467, -7.13513, 9.43277, -5.57532, 8.31467, -7.13513, 9.43277, -5.57532, 6.48659, -0.35382, 6.44908, 0.78326, 0, 0, 0, 0, 0, 0, 0, 0, 0, 0, 0, 0, 0, 0, 0, 0, 0, 0, 0, 0, 0, 0, 0, 0, 0, 0, 0, 0, 0, 0, 0, 0, 0, 0, 0, 0, 0, 0, 0, 0, 0, 0, 0, 0, 0, 0, 8.31467, -7.13513, 9.43277, -5.57532, 10.10086, -4.2449, 4.48163, -1.65125, 4.7012, -0.84406, 4.77203, -0.19891 ],
							"curve": 0.25,
							"c3": 0.75
						},
						{
							"time": 0.6333,
							"offset": 10,
							"vertices": [ -4.47012, 2.75507, -4.88278, 1.93225, -5.09955, 1.25333, -7.57921, 6.06403, -8.52141, 4.64816, -9.07266, 3.45071, -7.57921, 6.06403, -8.52141, 4.64816, -9.07266, 3.45071, -7.57921, 6.06403, -8.52141, 4.64816, -9.07266, 3.45071, -7.57921, 6.06403, -8.52141, 4.64816, -9.07266, 3.45071, -7.57921, 6.06403, -8.52141, 4.64816, -9.07266, 3.45071, -7.57921, 6.06403, -8.52141, 4.64816, -9.07266, 3.45071, -7.57921, 6.06403, -8.52141, 4.64816, -7.57921, 6.06403, -8.52141, 4.64816, -7.57921, 6.06403, -8.52141, 4.64816, -4.66209, 4.96344, -5.45692, 4.07358 ],
							"curve": 0.242,
							"c3": 0.663,
							"c4": 0.65
						},
						{
							"time": 1,
							"offset": 10,
							"vertices": [ 3.74959, -2.78043, 4.1774, -2.08381, 4.42107, -1.49802, 5.09474, -4.46113, 5.79545, -3.50415, 6.21652, -2.68586, 5.09474, -4.46113, 5.79545, -3.50415, 6.21652, -2.68586, 5.09474, -4.46113, 5.79545, -3.50415, 6.21652, -2.68586, 5.09474, -4.46113, 5.79545, -3.50415, 6.21652, -2.68586, 5.09474, -4.46113, 5.79545, -3.50415, 6.21652, -2.68586, 5.09474, -4.46113, 5.79545, -3.50415, 6.21652, -2.68586, 5.09474, -4.46113, 5.79545, -3.50415, 5.09474, -4.46113, 5.79545, -3.50415, 3.63701, 0.94636, 3.41623, 1.56625, -0.94449, 1.00554, -1.10551, 0.82526, 0, 0, 0, 0, 0, 0, 0, 0, 0, 0, 0, 0, 0, 0, 0, 0, 0, 0, 0, 0, 0, 0, 0, 0, 0, 0, 0, 0, 0, 0, 0, 0, 0, 0, 0, 0, 0, 0, 0, 0, 0, 0, 6.63021, -5.68963, 7.52179, -4.44582, 8.05454, -3.38493, 3.5737, -1.31672, 3.74879, -0.67306, 3.80527, -0.15862 ]
						}
					]
				},
				"leg-1b": {
					"leg-1b": [
						{
							"vertices": [ 4.74426, 5.151, -4.79684, -5.10172, -6.81615, -4.66125, -8.12749, -3.42993, -2.32227, -8.27196, -8.39645, -1.81775, -3.82736, -7.33072, -8.26888, -0.04709, -5.90518, -4.56564, -6.79738, 3.08282, -7.104, -2.36783, -5.41588, 5.17062, -6.84448, -0.25684, -3.42885, 5.92908, -5.64569, 1.58565, -3.84631, 2.39336, -0.94711, -2.78922, -1.99991, 2.16232, -2.14992, -0.66516, 0.44061, 2.20634, -0.56082, 1.51923, 1.60269, -0.2323, 0.96857, 2.58914, 1.65584, 2.41992, 1.33688, -2.61003, -1.68048, -2.40256, 2.49751, 4.1944, -2.54047, -4.16815, -3.4895, -1.80687, -3.2289, 2.23877, -4.74724, -0.27826, -5.69704, -2.00909 ]
						}
					]
				}
			}
		},
		"drawOrder": [
			{
				"offsets": [
					{ "slot": "leg-1b", "offset": -3 }
				]
			}
		]
	},
	"quest2": {
		"slots": {
			"diving-board-cut": {
				"attachment": [
					{ "name": "diving-board-cut" }
				]
			},
			"leg-1c2": {
				"attachment": [
					{ "name": null }
				]
			},
			"leg-2c": {
				"attachment": [
					{ "name": null }
				]
			},
			"splash-1": {
				"color": [
					{ "color": "ffffff00", "curve": "stepped" },
					{ "time": 0.4, "color": "ffffffff", "curve": "stepped" },
					{ "time": 0.6, "color": "ffffffff", "curve": 0.215, "c3": 0.815 },
					{ "time": 0.6667, "color": "ffffff00" }
				]
			},
			"splash-2": {
				"color": [
					{ "color": "ffffff00", "curve": "stepped" },
					{ "time": 0.4, "color": "ffffffff", "curve": "stepped" },
					{ "time": 0.5667, "color": "ffffffff", "curve": 0.215, "c3": 0.815 },
					{ "time": 0.6333, "color": "ffffff00" }
				]
			},
			"splash-3": {
				"color": [
					{ "color": "ffffff00", "curve": "stepped" },
					{ "time": 0.4, "color": "ffffffff", "curve": "stepped" },
					{ "time": 0.5667, "color": "ffffffff", "curve": 0.215, "c3": 0.815 },
					{ "time": 0.6333, "color": "ffffff00" }
				]
			},
			"tear-1-cry": {
				"attachment": [
					{ "name": null },
					{ "time": 0.5, "name": "tear-1-cry" }
				]
			},
			"tear-2-cry": {
				"attachment": [
					{ "name": null },
					{ "time": 0.5, "name": "tear-2-cry" }
				]
			}
		},
		"bones": {
			"bone": {
				"translate": [
					{ "curve": 0.204, "c3": 0.698, "c4": 0.71 },
					{ "time": 0.4, "x": -4.88, "y": -9.41, "curve": 0.413, "c2": 0.62, "c3": 0.761 },
					{ "time": 0.5, "x": -5.77, "y": -11.12, "curve": 0.215, "c3": 0.815 },
					{ "time": 1 }
				]
			},
			"bone2": {
				"rotate": [
					{ "time": 0.3333, "curve": 0.215, "c3": 0.815 },
					{ "time": 0.4, "angle": 65.56, "curve": 0.215, "c3": 0.815 },
					{ "time": 0.5667, "angle": 66.58 }
				],
				"translate": [
					{ "curve": 0.22, "c3": 0.597, "c4": 0.45 },
					{
						"time": 0.3333,
						"x": 52.05,
						"y": 26.8,
						"curve": 0.33,
						"c2": 0.33,
						"c3": 0.665,
						"c4": 0.66
					},
					{ "time": 0.4, "x": 332.53, "y": 110.86, "curve": 0.406, "c2": 0.49, "c3": 0.813 },
					{ "time": 0.5667, "x": 340.07, "y": 8.09 }
				],
				"scale": [
					{ "time": 0.4, "curve": 0.215, "c3": 0.815 },
					{ "time": 0.5667, "x": 0.603, "y": 0.603 }
				]
			},
			"diving-board-cut": {
				"rotate": [
					{ "time": 0.3333, "curve": 0.215, "c3": 0.815 },
					{ "time": 0.4333, "angle": -6.9 }
				],
				"translate": [
					{ "time": 0.3333, "curve": 0.203, "c3": 0.648, "c4": 0.6 },
					{ "time": 0.4, "x": 89.76, "y": -17.48, "curve": 0.423, "c2": 0.57, "c3": 0.79 },
					{ "time": 0.4333, "x": 129.75, "y": -25.27 }
				]
			},
			"2": {
				"translate": [
					{ "curve": 0.215, "c3": 0.815 },
					{ "time": 0.1, "x": 51.04, "y": 42.37, "curve": 0.215, "c3": 0.815 },
					{ "time": 0.2333, "x": 104.7, "y": 42.37 }
				]
			},
			"1": {
				"translate": [
					{ "curve": 0.215, "c3": 0.815 },
					{ "time": 0.1, "x": -8.05, "y": -1.34, "curve": 0.215, "c3": 0.815 },
					{ "time": 0.2333, "x": -71.69, "y": 24.36, "curve": 0.215, "c3": 0.815 },
					{ "time": 0.3667, "x": 74.53, "y": 48.07 }
				]
			},
			"mouth-cry": {
				"scale": [
					{ "time": 0.5, "curve": 0.215, "c3": 0.815 },
					{ "time": 0.6667, "x": 0.836, "y": 0.836, "curve": 0.215, "c3": 0.815 },
					{ "time": 0.8333, "curve": 0.215, "c3": 0.815 },
					{ "time": 1, "x": 0.836, "y": 0.836 }
				]
			},
			"hand-2c": {
				"rotate": [
					{ "curve": 0.215, "c3": 0.815 },
					{ "time": 0.1667, "angle": 99.69, "curve": 0.215, "c3": 0.815 },
					{ "time": 0.3333, "angle": 10.3 }
				]
			},
			"hand-1b": {
				"rotate": [
					{ "angle": 12.01, "curve": 0.215, "c3": 0.815 },
					{ "time": 0.1667, "angle": -8.8, "curve": 0.215, "c3": 0.815 },
					{ "time": 0.3333, "angle": 138.52, "curve": 0.215, "c3": 0.815 },
					{ "time": 0.5, "angle": -139.95 }
				]
			},
			"tear-1-cry": {
				"scale": [
					{ "time": 0.5, "curve": 0.215, "c3": 0.815 },
					{ "time": 0.5667, "x": 0.571, "y": 0.571, "curve": 0.215, "c3": 0.815 },
					{ "time": 0.6667, "curve": 0.215, "c3": 0.815 },
					{ "time": 0.7333, "x": 0.571, "y": 0.571, "curve": 0.215, "c3": 0.815 },
					{ "time": 0.8333, "curve": 0.215, "c3": 0.815 },
					{ "time": 0.9, "x": 0.571, "y": 0.571 }
				]
			},
			"tear-2-cry3": {
				"scale": [
					{ "time": 0.5, "curve": 0.215, "c3": 0.815 },
					{ "time": 0.5667, "x": 0.571, "y": 0.571, "curve": 0.215, "c3": 0.815 },
					{ "time": 0.6667, "curve": 0.215, "c3": 0.815 },
					{ "time": 0.7333, "x": 0.571, "y": 0.571, "curve": 0.215, "c3": 0.815 },
					{ "time": 0.8333, "curve": 0.215, "c3": 0.815 },
					{ "time": 0.9, "x": 0.571, "y": 0.571 }
				]
			},
			"splash-1": {
				"translate": [
					{ "time": 0.4, "x": -3.75, "y": -60, "curve": 0.215, "c3": 0.815 },
					{ "time": 0.6333 }
				],
				"scale": [
					{ "time": 0.4, "x": 0, "y": 0, "curve": 0.215, "c3": 0.815 },
					{ "time": 0.6333, "x": 1.495, "y": 1.495 }
				]
			},
			"splash-2": {
				"rotate": [
					{ "time": 0.6333, "curve": 0.215, "c3": 0.815 },
					{ "time": 0.7667, "angle": 48.29 }
				],
				"translate": [
					{ "time": 0.4, "x": 243.45, "y": -280.72, "curve": 0.215, "c3": 0.815 },
					{ "time": 0.6333, "curve": 0.21, "c3": 0.609, "c4": 0.5 },
					{ "time": 0.7, "x": -115.05, "y": 84.37, "curve": 0.409, "c2": 0.5, "c3": 0.811 },
					{ "time": 0.7667, "x": -226.14, "y": 61.08 }
				],
				"scale": [
					{ "time": 0.4, "x": 0, "y": -0.02, "curve": 0.215, "c3": 0.815 },
					{ "time": 0.6333 }
				]
			},
			"splash-3": {
				"translate": [
					{ "time": 0.4, "x": -162.93, "y": 137.96, "curve": 0.215, "c3": 0.815 },
					{ "time": 0.6333 }
				],
				"scale": [
					{ "time": 0.4, "y": -0.02, "curve": 0.215, "c3": 0.815 },
					{ "time": 0.6333 }
				]
			},
			"leg-2cd3": {
				"rotate": [
					{ "time": 0.3333, "curve": 0.215, "c3": 0.815 },
					{ "time": 0.5, "angle": 64.11 }
				]
			}
		},
		"deform": {
			"default": {
				"Layer 11": {
					"Layer 11": [
						{
							"offset": 10,
							"vertices": [ 3.74959, -2.78043, 4.1774, -2.08381, 4.42107, -1.49802, 5.09474, -4.46113, 5.79545, -3.50415, 6.21652, -2.68586, 5.09474, -4.46113, 5.79545, -3.50415, 6.21652, -2.68586, 5.09474, -4.46113, 5.79545, -3.50415, 6.21652, -2.68586, 5.09474, -4.46113, 5.79545, -3.50415, 6.21652, -2.68586, 5.09474, -4.46113, 5.79545, -3.50415, 6.21652, -2.68586, 5.09474, -4.46113, 5.79545, -3.50415, 6.21652, -2.68586, 5.09474, -4.46113, 5.79545, -3.50415, 5.09474, -4.46113, 5.79545, -3.50415, 3.63701, 0.94636, 3.41623, 1.56625, -0.94449, 1.00554, -1.10551, 0.82526, 0, 0, 0, 0, 0, 0, 0, 0, 0, 0, 0, 0, 0, 0, 0, 0, 0, 0, 0, 0, 0, 0, 0, 0, 0, 0, 0, 0, 0, 0, 0, 0, 0, 0, 0, 0, 0, 0, 0, 0, 0, 0, 6.63021, -5.68963, 7.52179, -4.44582, 8.05454, -3.38493, 3.5737, -1.31672, 3.74879, -0.67306, 3.80527, -0.15862 ],
							"curve": 0.38,
							"c2": 0.59,
							"c3": 0.727
						},
						{
							"time": 0.1333,
							"offset": 10,
							"vertices": [ 5.83788, -4.18677, 6.47922, -3.10413, 6.83986, -2.19702, 8.31467, -7.13513, 9.43277, -5.57532, 10.10086, -4.2449, 8.31467, -7.13513, 9.43277, -5.57532, 10.10086, -4.2449, 8.31467, -7.13513, 9.43277, -5.57532, 10.10086, -4.2449, 8.31467, -7.13513, 9.43277, -5.57532, 10.10086, -4.2449, 8.31467, -7.13513, 9.43277, -5.57532, 10.10086, -4.2449, 8.31467, -7.13513, 9.43277, -5.57532, 10.10086, -4.2449, 8.31467, -7.13513, 9.43277, -5.57532, 8.31467, -7.13513, 9.43277, -5.57532, 6.48659, -0.35382, 6.44908, 0.78326, 0, 0, 0, 0, 0, 0, 0, 0, 0, 0, 0, 0, 0, 0, 0, 0, 0, 0, 0, 0, 0, 0, 0, 0, 0, 0, 0, 0, 0, 0, 0, 0, 0, 0, 0, 0, 0, 0, 0, 0, 0, 0, 0, 0, 0, 0, 8.31467, -7.13513, 9.43277, -5.57532, 10.10086, -4.2449, 4.48163, -1.65125, 4.7012, -0.84406, 4.77203, -0.19891 ],
							"curve": 0.25,
							"c3": 0.75
						},
						{
							"time": 0.6333,
							"offset": 10,
							"vertices": [ -4.47012, 2.75507, -4.88278, 1.93225, -5.09955, 1.25333, -7.57921, 6.06403, -8.52141, 4.64816, -9.07266, 3.45071, -7.57921, 6.06403, -8.52141, 4.64816, -9.07266, 3.45071, -7.57921, 6.06403, -8.52141, 4.64816, -9.07266, 3.45071, -7.57921, 6.06403, -8.52141, 4.64816, -9.07266, 3.45071, -7.57921, 6.06403, -8.52141, 4.64816, -9.07266, 3.45071, -7.57921, 6.06403, -8.52141, 4.64816, -9.07266, 3.45071, -7.57921, 6.06403, -8.52141, 4.64816, -7.57921, 6.06403, -8.52141, 4.64816, -7.57921, 6.06403, -8.52141, 4.64816, -4.66209, 4.96344, -5.45692, 4.07358 ],
							"curve": 0.242,
							"c3": 0.663,
							"c4": 0.65
						},
						{
							"time": 1,
							"offset": 10,
							"vertices": [ 3.74959, -2.78043, 4.1774, -2.08381, 4.42107, -1.49802, 5.09474, -4.46113, 5.79545, -3.50415, 6.21652, -2.68586, 5.09474, -4.46113, 5.79545, -3.50415, 6.21652, -2.68586, 5.09474, -4.46113, 5.79545, -3.50415, 6.21652, -2.68586, 5.09474, -4.46113, 5.79545, -3.50415, 6.21652, -2.68586, 5.09474, -4.46113, 5.79545, -3.50415, 6.21652, -2.68586, 5.09474, -4.46113, 5.79545, -3.50415, 6.21652, -2.68586, 5.09474, -4.46113, 5.79545, -3.50415, 5.09474, -4.46113, 5.79545, -3.50415, 3.63701, 0.94636, 3.41623, 1.56625, -0.94449, 1.00554, -1.10551, 0.82526, 0, 0, 0, 0, 0, 0, 0, 0, 0, 0, 0, 0, 0, 0, 0, 0, 0, 0, 0, 0, 0, 0, 0, 0, 0, 0, 0, 0, 0, 0, 0, 0, 0, 0, 0, 0, 0, 0, 0, 0, 0, 0, 6.63021, -5.68963, 7.52179, -4.44582, 8.05454, -3.38493, 3.5737, -1.31672, 3.74879, -0.67306, 3.80527, -0.15862 ]
						}
					]
				},
				"leg-1b": {
					"leg-1b": [
						{
							"vertices": [ 4.74426, 5.151, -4.79684, -5.10172, -6.81615, -4.66125, -8.12749, -3.42993, -2.32227, -8.27196, -8.39645, -1.81775, -3.82736, -7.33072, -8.26888, -0.04709, -5.90518, -4.56564, -6.79738, 3.08282, -7.104, -2.36783, -5.41588, 5.17062, -6.84448, -0.25684, -3.42885, 5.92908, -5.64569, 1.58565, -3.84631, 2.39336, -0.94711, -2.78922, -1.99991, 2.16232, -2.14992, -0.66516, 0.44061, 2.20634, -0.56082, 1.51923, 1.60269, -0.2323, 0.96857, 2.58914, 1.65584, 2.41992, 1.33688, -2.61003, -1.68048, -2.40256, 2.49751, 4.1944, -2.54047, -4.16815, -3.4895, -1.80687, -3.2289, 2.23877, -4.74724, -0.27826, -5.69704, -2.00909 ]
						}
					]
				}
			}
		},
		"drawOrder": [
			{
				"offsets": [
					{ "slot": "leg-1b", "offset": -3 }
				]
			}
		]
	}
}
}