
18.png
size: 404,576
format: RGBA8888
filter: Linear,Linear
repeat: none
lvtinh/lv18than
  rotate: false
  xy: 2, 244
  size: 268, 330
  orig: 268, 330
  offset: 0, 0
  index: -1
lvtinh/lv18thieu
  rotate: false
  xy: 2, 2
  size: 270, 240
  orig: 270, 240
  offset: 0, 0
  index: -1
lvtinh/lv1bong
  rotate: true
  xy: 274, 2
  size: 363, 126
  orig: 363, 126
  offset: 0, 0
  index: -1
