
28.png
size: 368,748
format: RGBA8888
filter: Linear,Linear
repeat: none
lvtinh/lv1bong
  rotate: false
  xy: 2, 2
  size: 363, 126
  orig: 363, 126
  offset: 0, 0
  index: -1
lvtinh/lv28than
  rotate: false
  xy: 2, 351
  size: 341, 392
  orig: 341, 392
  offset: 0, 0
  index: -1
lvtinh/lv28thieu
  rotate: true
  xy: 2, 130
  size: 219, 303
  orig: 219, 303
  offset: 0, 0
  index: -1
