
15.png
size: 480,456
format: RGBA8888
filter: Linear,Linear
repeat: none
lvtinh/lv15than
  rotate: false
  xy: 2, 46
  size: 348, 407
  orig: 348, 407
  offset: 0, 0
  index: -1
lvtinh/lv15thieu
  rotate: true
  xy: 292, 2
  size: 86, 125
  orig: 86, 125
  offset: 0, 0
  index: -1
lvtinh/lv1bong
  rotate: true
  xy: 352, 90
  size: 363, 126
  orig: 363, 126
  offset: 0, 0
  index: -1
