
lv 22.png
size: 536,656
format: RGBA8888
filter: Linear,Linear
repeat: none
1
  rotate: false
  xy: 250, 349
  size: 99, 158
  orig: 99, 158
  offset: 0, 0
  index: -1
10
  rotate: false
  xy: 365, 577
  size: 88, 72
  orig: 88, 72
  offset: 0, 0
  index: -1
11
  rotate: false
  xy: 101, 35
  size: 124, 58
  orig: 124, 58
  offset: 0, 0
  index: -1
12
  rotate: false
  xy: 2, 39
  size: 97, 78
  orig: 97, 78
  offset: 0, 0
  index: -1
13
  rotate: true
  xy: 371, 67
  size: 120, 84
  orig: 120, 84
  offset: 0, 0
  index: -1
14
  rotate: false
  xy: 227, 58
  size: 108, 35
  orig: 108, 35
  offset: 0, 0
  index: -1
15
  rotate: true
  xy: 310, 189
  size: 151, 86
  orig: 151, 86
  offset: 0, 0
  index: -1
16
  rotate: false
  xy: 452, 453
  size: 33, 63
  orig: 33, 63
  offset: 0, 0
  index: -1
17
  rotate: true
  xy: 351, 342
  size: 120, 93
  orig: 120, 93
  offset: 0, 0
  index: -1
18
  rotate: false
  xy: 2, 349
  size: 246, 305
  orig: 246, 305
  offset: 0, 0
  index: -1
2
  rotate: false
  xy: 182, 189
  size: 126, 158
  orig: 126, 158
  offset: 0, 0
  index: -1
20
  rotate: false
  xy: 337, 15
  size: 70, 50
  orig: 70, 50
  offset: 0, 0
  index: -1
21
  rotate: false
  xy: 460, 154
  size: 70, 53
  orig: 70, 53
  offset: 0, 0
  index: -1
22
  rotate: true
  xy: 446, 304
  size: 93, 30
  orig: 93, 30
  offset: 0, 0
  index: -1
23
  rotate: false
  xy: 409, 33
  size: 73, 32
  orig: 73, 32
  offset: 0, 0
  index: -1
25
  rotate: false
  xy: 508, 209
  size: 21, 32
  orig: 21, 32
  offset: 0, 0
  index: -1
26
  rotate: false
  xy: 182, 5
  size: 16, 28
  orig: 16, 28
  offset: 0, 0
  index: -1
27
  rotate: false
  xy: 219, 95
  size: 150, 92
  orig: 150, 92
  offset: 0, 0
  index: -1
28
  rotate: false
  xy: 2, 119
  size: 215, 68
  orig: 215, 68
  offset: 0, 0
  index: -1
29
  rotate: false
  xy: 2, 194
  size: 178, 153
  orig: 178, 153
  offset: 0, 0
  index: -1
3
  rotate: true
  xy: 357, 464
  size: 111, 93
  orig: 111, 93
  offset: 0, 0
  index: -1
30
  rotate: 180
  xy: 435, 3
  size: 87, 101
  orig: 87, 101
  offset: 0, 0
  index: -1
31
  rotate: true
  xy: 446, 399
  size: 52, 43
  orig: 52, 43
  offset: 0, 0
  index: -1
32
  rotate: false
  xy: 89, 13
  size: 48, 20
  orig: 48, 20
  offset: 0, 0
  index: -1
33
  rotate: false
  xy: 2, 16
  size: 48, 21
  orig: 48, 21
  offset: 0, 0
  index: -1
34
  rotate: false
  xy: 457, 67
  size: 25, 85
  orig: 25, 85
  offset: 0, 0
  index: -1
35
  rotate: true
  xy: 227, 24
  size: 32, 92
  orig: 32, 92
  offset: 0, 0
  index: -1
36
  rotate: false
  xy: 250, 510
  size: 113, 143
  orig: 113, 143
  offset: 0, 0
  index: -1
4
  rotate: false
  xy: 139, 12
  size: 41, 21
  orig: 41, 21
  offset: 0, 0
  index: -1
5
  rotate: false
  xy: 250, 512
  size: 22, 14
  orig: 22, 14
  offset: 0, 0
  index: -1
6
  rotate: false
  xy: 478, 209
  size: 28, 35
  orig: 28, 35
  offset: 0, 0
  index: -1
7
  rotate: false
  xy: 484, 106
  size: 38, 38
  orig: 38, 38
  offset: 0, 0
  index: -1
745y
  rotate: false
  xy: 52, 8
  size: 35, 29
  orig: 35, 29
  offset: 0, 0
  index: -1
8
  rotate: false
  xy: 452, 518
  size: 39, 50
  orig: 39, 50
  offset: 0, 0
  index: -1
9
  rotate: false
  xy: 455, 570
  size: 39, 50
  orig: 39, 50
  offset: 0, 0
  index: -1
toc
  rotate: true
  xy: 398, 189
  size: 113, 78
  orig: 113, 78
  offset: 0, 0
  index: -1
