
lv26.png
size: 2036,736
format: RGBA8888
filter: Linear,Linear
repeat: none
Eye l
  rotate: false
  xy: 933, 93
  size: 93, 76
  orig: 93, 76
  offset: 0, 0
  index: -1
ban chan r
  rotate: false
  xy: 618, 131
  size: 96, 42
  orig: 96, 42
  offset: 0, 0
  index: -1
body
  rotate: true
  xy: 1366, 113
  size: 225, 280
  orig: 225, 281
  offset: 0, 1
  index: -1
cai bom
  rotate: 180
  xy: 208, 88
  size: 366, 239
  orig: 366, 239
  offset: 0, 0
  index: -1
canh tay r
  rotate: false
  xy: 456, 127
  size: 160, 90
  orig: 160, 90
  offset: 0, 0
  index: -1
chan l
  rotate: false
  xy: 1873, 393
  size: 95, 180
  orig: 95, 180
  offset: 0, 0
  index: -1
chan r
  rotate: false
  xy: 1970, 429
  size: 46, 144
  orig: 46, 144
  offset: 0, 0
  index: -1
day bom
  rotate: false
  xy: 645, 3
  size: 315, 266
  orig: 315, 266
  offset: 0, 0
  index: -1
eye 1
  rotate: true
  xy: 1692, 389
  size: 342, 179
  orig: 342, 179
  offset: 0, 0
  index: -1
eye 3
  rotate: false
  xy: 762, 171
  size: 278, 159
  orig: 278, 159
  offset: 0, 0
  index: -1
eye r
  rotate: false
  xy: 1871, 125
  size: 96, 77
  orig: 96, 77
  offset: 0, 0
  index: -1
haed lack
  rotate: false
  xy: 2, 329
  size: 433, 402
  orig: 433, 402
  offset: 0, 0
  index: -1
hand l
  rotate: false
  xy: 784, 107
  size: 67, 62
  orig: 67, 62
  offset: 0, 0
  index: -1
hand r
  rotate: true
  xy: 1969, 133
  size: 69, 62
  orig: 69, 62
  offset: 0, 0
  index: -1
head
  rotate: true
  xy: 762, 332
  size: 399, 336
  orig: 399, 336
  offset: 0, 0
  index: -1
lo xo bom
  rotate: false
  xy: 1042, 109
  size: 198, 124
  orig: 198, 124
  offset: 0, 0
  index: -1
long den l 1
  rotate: true
  xy: 1367, 299
  size: 39, 62
  orig: 39, 62
  offset: 0, 0
  index: -1
long den r1
  rotate: true
  xy: 1367, 299
  size: 39, 62
  orig: 39, 62
  offset: 0, 0
  index: -1
may 1
  rotate: false
  xy: 486, 60
  size: 242, 58
  orig: 242, 58
  offset: 0, 0
  index: -1
may 2
  rotate: false
  xy: 1647, 114
  size: 222, 88
  orig: 222, 88
  offset: 0, 0
  index: -1
mount 1
  rotate: false
  xy: 1242, 62
  size: 180, 76
  orig: 180, 76
  offset: 0, 0
  index: -1
mouth cuoi
  rotate: false
  xy: 1692, 204
  size: 299, 183
  orig: 299, 183
  offset: 0, 0
  index: -1
nuoc bi
  rotate: false
  xy: 344, 218
  size: 299, 69
  orig: 299, 69
  offset: 0, 0
  index: -1
qua bi
  rotate: true
  xy: 1367, 340
  size: 391, 323
  orig: 391, 323
  offset: 0, 0
  index: -1
qua bi vo
  rotate: true
  xy: 437, 289
  size: 442, 323
  orig: 442, 323
  offset: 0, 0
  index: -1
tay l
  rotate: false
  xy: 1500, 38
  size: 160, 90
  orig: 160, 90
  offset: 0, 0
  index: -1
tay xeo
  rotate: false
  xy: 1969, 65
  size: 57, 66
  orig: 57, 66
  offset: 0, 0
  index: -1
toc
  rotate: false
  xy: 1242, 155
  size: 113, 78
  orig: 113, 78
  offset: 0, 0
  index: -1
vo bi
  rotate: false
  xy: 2, 126
  size: 204, 201
  orig: 204, 201
  offset: 0, 0
  index: -1
vo bi 2
  rotate: false
  xy: 1100, 235
  size: 265, 496
  orig: 265, 496
  offset: 0, 0
  index: -1
vo bi 3
  rotate: false
  xy: 1873, 575
  size: 144, 156
  orig: 144, 156
  offset: 0, 0
  index: -1
vo ong
  rotate: false
  xy: 350, 142
  size: 104, 74
  orig: 104, 74
  offset: 0, 0
  index: -1
