
level1.png
size: 1024,228
format: RGBA8888
filter: Linear,Linear
repeat: none
48
  rotate: true
  xy: 358, 73
  size: 150, 145
  orig: 150, 145
  offset: 0, 0
  index: -1
banchan1
  rotate: false
  xy: 958, 147
  size: 53, 24
  orig: 53, 24
  offset: 0, 0
  index: -1
banchan2
  rotate: true
  xy: 965, 95
  size: 50, 24
  orig: 50, 24
  offset: 0, 0
  index: -1
bantay1
  rotate: true
  xy: 958, 173
  size: 52, 49
  orig: 54, 51
  offset: 1, 1
  index: -1
body
  rotate: true
  xy: 288, 5
  size: 66, 126
  orig: 66, 126
  offset: 0, 0
  index: -1
canhtay1
  rotate: false
  xy: 185, 33
  size: 68, 62
  orig: 68, 62
  offset: 0, 0
  index: -1
canhtay2
  rotate: false
  xy: 775, 47
  size: 68, 62
  orig: 69, 62
  offset: 0, 0
  index: -1
chan1
  rotate: false
  xy: 991, 65
  size: 27, 81
  orig: 29, 82
  offset: 1, 1
  index: -1
chan2
  rotate: true
  xy: 615, 31
  size: 27, 82
  orig: 28, 82
  offset: 0, 0
  index: -1
dau
  rotate: true
  xy: 185, 50
  size: 173, 172
  orig: 173, 172
  offset: 0, 0
  index: -1
img/Laychai3er 135
  rotate: false
  xy: 616, 59
  size: 90, 164
  orig: 90, 164
  offset: 0, 0
  index: -1
img/chai1
  rotate: false
  xy: 505, 61
  size: 109, 162
  orig: 109, 162
  offset: 0, 0
  index: -1
img/chai2
  rotate: false
  xy: 708, 57
  size: 67, 166
  orig: 67, 166
  offset: 0, 0
  index: -1
img/chai4
  rotate: false
  xy: 896, 56
  size: 67, 75
  orig: 67, 75
  offset: 0, 0
  index: -1
img/dap1
  rotate: false
  xy: 416, 35
  size: 101, 24
  orig: 101, 24
  offset: 0, 0
  index: -1
img/dap2
  rotate: false
  xy: 519, 34
  size: 94, 25
  orig: 94, 25
  offset: 0, 0
  index: -1
img/vanhxe
  rotate: false
  xy: 2, 17
  size: 181, 206
  orig: 181, 206
  offset: 0, 0
  index: -1
phan2
  rotate: false
  xy: 896, 133
  size: 60, 90
  orig: 60, 90
  offset: 0, 0
  index: -1
shadow2
  rotate: true
  xy: 857, 2
  size: 221, 37
  orig: 221, 37
  offset: 0, 0
  index: -1
toc
  rotate: true
  xy: 777, 110
  size: 113, 78
  orig: 113, 78
  offset: 0, 0
  index: -1
