
3.png
size: 488,528
format: RGBA8888
filter: Linear,Linear
repeat: none
lvtinh/lv1bong
  rotate: false
  xy: 2, 3
  size: 363, 126
  orig: 363, 126
  offset: 0, 0
  index: -1
lvtinh/lv3than
  rotate: false
  xy: 2, 131
  size: 371, 394
  orig: 371, 394
  offset: 0, 0
  index: -1
lvtinh/lv3thieu
  rotate: 270
  xy: 301, 70
  size: 264, 181
  orig: 264, 181
  offset: 0, 0
  index: -1
