{
"skeleton": {
	"hash": "a6vQX0UgZpk3OInYUeG3AXrkytQ",
	"spine": "3.8.82",
	"x": -206.72,
	"y": -13.46,
	"width": 629.1,
	"height": 782.4,
	"images": "",
	"audio": ""
},
"bones": [
	{ "name": "root" },
	{ "name": "bone", "parent": "root", "length": 131.62, "rotation": 32.11, "x": -202.62, "y": 624.08 },
	{ "name": "bone2", "parent": "bone", "length": 107.04, "rotation": -22.55, "x": 131.62 },
	{ "name": "bone3", "parent": "bone2", "length": 117.42, "rotation": -10.15, "x": 107.04 },
	{ "name": "bone4", "parent": "bone3", "length": 125.74, "rotation": 1.66, "x": 117.42 },
	{ "name": "bone5", "parent": "bone4", "length": 83.13, "rotation": 12.96, "x": 125.74 },
	{ "name": "bone6", "parent": "root", "x": 284.27, "y": 120.89 },
	{ "name": "bone7", "parent": "bone6", "length": 95.93, "rotation": 93.69, "x": -0.19, "y": 1.2 },
	{ "name": "bone8", "parent": "bone7", "length": 48.13, "rotation": 112.55, "x": 64.67, "y": 7.94 },
	{ "name": "bone9", "parent": "bone8", "length": 60.39, "rotation": -43.22, "x": 48.13 },
	{ "name": "bone10", "parent": "bone7", "length": 36.25, "rotation": 111.14, "x": 82.67, "y": 6.97 },
	{ "name": "bone11", "parent": "bone10", "length": 52.96, "rotation": -42.09, "x": 36.25 },
	{ "name": "bone12", "parent": "bone7", "length": 54.6, "rotation": -179.62, "x": -3.15, "y": 2.73 },
	{ "name": "bone13", "parent": "bone12", "length": 52.1, "rotation": 10.55, "x": 54.6 },
	{ "name": "bone14", "parent": "bone7", "length": 56.99, "rotation": -30.98, "x": 96.44, "y": 0.23 },
	{ "name": "bone15", "parent": "bone14", "x": 77.74, "y": 65.89 },
	{ "name": "bone16", "parent": "bone14", "length": 35.83, "rotation": -15.89, "x": 129.22, "y": 32.73 },
	{ "name": "bone17", "parent": "root", "x": 86.77, "y": 647.34 },
	{ "name": "bone18", "parent": "bone17", "length": 86.78, "rotation": -86.69, "x": 0.21, "y": -2.11 },
	{ "name": "bone19", "parent": "bone18", "length": 74.35, "rotation": 71.05, "x": 73.69, "y": 15.46 },
	{ "name": "bone20", "parent": "bone18", "length": 74.19, "rotation": -71.2, "x": 74.07, "y": -8.95 },
	{ "name": "bone21", "parent": "bone18", "length": 52.03, "rotation": -179.37, "x": 8.76, "y": 8.82 },
	{ "name": "bone22", "parent": "bone21", "length": 35.17, "rotation": -8.03, "x": 52.03 },
	{ "name": "bone23", "parent": "bone18", "length": 66.85, "rotation": -8.05, "x": 87.3, "y": 0.18 },
	{ "name": "bone24", "parent": "bone23", "x": 32.03, "y": 19.6 },
	{ "name": "bone26", "parent": "bone23", "rotation": 161, "x": 111.94, "y": -15.36 },
	{ "name": "bone25", "parent": "bone26", "length": 64.06, "x": 12.97, "y": -71.43 }
],
"slots": [
	{ "name": "Ellipse 5", "bone": "root", "attachment": "Ellipse 5" },
	{ "name": "Layer 10", "bone": "bone25", "attachment": "Layer 10" },
	{ "name": "Layer 12", "bone": "bone20", "attachment": "Layer 12" },
	{ "name": "Layer 12 copy", "bone": "bone19", "attachment": "Layer 12 copy" },
	{ "name": "Layer 36", "bone": "root", "attachment": "Layer 36 copy" },
	{ "name": "Layer 38", "bone": "bone12", "attachment": "Layer 38" },
	{ "name": "Layer 39", "bone": "bone8", "attachment": "Layer 39" },
	{ "name": "Layer 39 copy", "bone": "bone10", "attachment": "Layer 39 copy" },
	{ "name": "Layer 4", "bone": "bone16", "attachment": "Layer 4" },
	{ "name": "Layer 44", "bone": "bone21", "attachment": "Layer 44" },
	{ "name": "Layer 45", "bone": "root", "attachment": "Layer 45" },
	{ "name": "Layer 46", "bone": "root", "attachment": "Layer 46" },
	{ "name": "Layer 37", "bone": "bone5", "attachment": "Layer 37" },
	{ "name": "Shape 1", "bone": "bone7", "attachment": "Shape 1" },
	{ "name": "Ellipse 1", "bone": "bone14", "attachment": "Ellipse 1" },
	{ "name": "lo lang", "bone": "bone15", "attachment": "lo lang" },
	{ "name": "1", "bone": "bone18", "attachment": "1" },
	{ "name": "Layer 43", "bone": "bone18", "attachment": "Layer 43" },
	{ "name": "Layer 41", "bone": "bone18", "attachment": "Layer 41" },
	{ "name": "Ellipse 1 copy", "bone": "bone23", "attachment": "Ellipse 1 copy" },
	{ "name": "so", "bone": "bone24", "attachment": "so" },
	{ "name": "vui", "bone": "bone24", "attachment": "vui" },
	{ "name": "Layer 9", "bone": "bone26", "attachment": "Layer 9" },
	{ "name": "cuu duoc", "bone": "bone15", "attachment": "cuu duoc" }
],
"skins": [
	{
		"name": "default",
		"attachments": {
			"1": {
				"1": { "x": 47.42, "y": 0.97, "rotation": 86.69, "width": 28, "height": 113 }
			},
			"Ellipse 1": {
				"Ellipse 1": { "x": 58.2, "y": 34.79, "rotation": -62.71, "width": 147, "height": 147 }
			},
			"Ellipse 1 copy": {
				"Ellipse 1 copy": { "x": 60.53, "y": 16.89, "rotation": 94.74, "width": 128, "height": 128 }
			},
			"Ellipse 5": {
				"Ellipse 5": { "x": 296.88, "y": 18.54, "width": 251, "height": 64 }
			},
			"Layer 10": {
				"Layer 10": { "x": 29.06, "y": -8.02, "rotation": -66.26, "width": 69, "height": 91 }
			},
			"Layer 12": {
				"Layer 12": { "x": 47.39, "y": 3.23, "rotation": 157.89, "width": 95, "height": 49 }
			},
			"Layer 12 copy": {
				"Layer 12 copy": { "x": 47.71, "y": -4.01, "rotation": 15.64, "width": 98, "height": 40 }
			},
			"Layer 36": {
				"Layer 36": {
					"type": "mesh",
					"uvs": [ 0.99739, 0, 1, 0.00603, 1, 0.04926, 0.91317, 0.18678, 0.87565, 0.20474, 0.8609, 0.21181, 0.84734, 0.2183, 0.83762, 0.22296, 0.75304, 0.26346, 0.67504, 0.27671, 0.68615, 0.30466, 0.82179, 0.64581, 0.8494, 0.86725, 0.80426, 0.70302, 0.69162, 0.47191, 0.64989, 0.42578, 0.62138, 0.40649, 0.58865, 0.38435, 0.47727, 0.30901, 0.4286, 0.3166, 0.40478, 0.32032, 0.39143, 0.33073, 0.26104, 0.43243, 0.36537, 0.66469, 0.53609, 0.66635, 0.49368, 0.76465, 0.36313, 0.79308, 0.29802, 0.71881, 0.19981, 0.54216, 0.13925, 0.65743, 0.0295, 0.92606, 0.00552, 1, 0, 1, 0, 0.5439, 0.01079, 0.52879, 0.15631, 0.26455, 0.19358, 0.22189, 0.22355, 0.18759, 0.31616, 0.0816, 0.37853, 0.09027, 0.4013, 0.09344, 0.42218, 0.09634, 0.44756, 0.09987, 0.59256, 0.12004, 0.6253, 0.12459, 0.65314, 0.12846, 0.69889, 0.13482, 0.71012, 0.14171, 0.83368, 0.12866, 0.84761, 0.12718, 0.85489, 0.12415, 0.87096, 0.11746, 0.89617, 0.10697, 0.99242, 0, 0.20922, 0.3169, 0.2278, 0.49741, 0.40533, 0.17977, 0.62385, 0.18394, 0.62168, 0.27475, 0.59724, 0.29095, 0.64627, 0.28631, 0.85817, 0.17222 ],
					"triangles": [ 53, 0, 1, 61, 50, 51, 3, 52, 53, 2, 3, 53, 1, 2, 53, 4, 51, 52, 4, 52, 3, 61, 51, 4, 5, 61, 4, 6, 48, 49, 49, 50, 61, 6, 49, 61, 6, 61, 5, 7, 48, 6, 8, 47, 48, 8, 48, 7, 9, 45, 46, 9, 46, 47, 9, 47, 8, 45, 57, 44, 60, 45, 9, 60, 57, 45, 58, 57, 60, 16, 58, 60, 15, 60, 9, 15, 9, 10, 16, 60, 15, 11, 14, 10, 15, 10, 14, 13, 14, 11, 13, 11, 12, 56, 40, 41, 57, 43, 44, 57, 59, 43, 58, 59, 57, 18, 42, 43, 18, 43, 59, 42, 56, 41, 19, 42, 18, 19, 56, 42, 20, 56, 19, 17, 18, 59, 16, 59, 58, 17, 59, 16, 54, 36, 37, 40, 56, 39, 56, 21, 39, 20, 21, 56, 22, 37, 38, 54, 37, 22, 21, 22, 38, 21, 38, 39, 55, 54, 22, 27, 22, 23, 55, 22, 27, 28, 55, 27, 25, 23, 24, 26, 27, 23, 26, 23, 25, 54, 35, 36, 28, 54, 55, 28, 35, 54, 29, 34, 35, 29, 35, 28, 30, 34, 29, 33, 34, 30, 32, 33, 30, 31, 32, 30 ],
					"vertices": [ 2, 4, 201.47, 22.69, 0, 5, 78.89, 5.14, 1, 2, 4, 202.86, 21.82, 0, 5, 80.05, 3.97, 1, 1, 5, 78.57, -1.94, 1, 2, 4, 155.67, -2.78, 5.0E-5, 5, 28.54, -9.42, 0.99995, 2, 4, 135.44, -4.93, 0.00842, 5, 8.35, -6.98, 0.99158, 2, 4, 127.49, -5.78, 0.42201, 5, 0.41, -6.02, 0.57799, 2, 4, 120.18, -6.56, 0.88254, 5, -6.89, -5.14, 0.11746, 1, 4, 114.93, -7.12, 1, 2, 4, 69.33, -11.97, 1, 5, -57.66, 0.98, 0, 1, 4, 27.34, -13.04, 1, 1, 4, 33.24, -17.1, 1, 1, 4, 105.29, -66.57, 1, 1, 4, 119.56, -98.06, 1, 1, 4, 95.71, -74.45, 1, 2, 3, 154.32, -39.68, 0.00236, 4, 35.74, -40.73, 0.99764, 2, 3, 131.81, -33.4, 0.13944, 4, 13.41, -33.8, 0.86056, 2, 3, 116.44, -30.83, 0.47023, 4, -1.87, -30.79, 0.52977, 2, 3, 98.8, -27.89, 0.87488, 4, -19.42, -27.34, 0.12512, 2, 3, 38.78, -17.87, 1, 5, -203.15, 30.74, 0, 3, 2, 116.07, -21.13, 0.1188, 3, 12.6, -19.21, 0.8812, 5, -228.81, 36.05, 0, 3, 2, 103.34, -19.52, 0.56639, 3, -0.21, -19.86, 0.43361, 5, -241.37, 38.65, 0, 3, 2, 96.01, -19.77, 0.83208, 3, -7.37, -21.4, 0.16792, 5, -248.69, 38.97, 0, 3, 1, 145.68, -29.93, 0.10863, 2, 24.46, -22.25, 0.89137, 5, -320.22, 42.07, 0, 3, 1, 175.81, -87.5, 2.5E-4, 2, 74.36, -63.87, 0.99975, 5, -273.72, -3.31, 0, 2, 2, 164.9, -79.37, 1, 5, -184.67, -25.82, 0, 2, 2, 140.09, -89.24, 1, 5, -210.16, -33.73, 0, 2, 2, 70.17, -81.52, 1, 5, -279.28, -20.59, 0, 3, 1, 141.06, -74.71, 0.03323, 2, 37.36, -65.38, 0.96677, 5, -310.72, -1.93, 0, 3, 1, 109.56, -25.52, 0.75942, 2, -10.6, -32.03, 0.24058, 5, -355.94, 35.05, 0, 2, 1, 73.32, -21.97, 1, 5, -391.48, 27.18, 0, 2, 1, 3.17, -22.66, 1, 5, -457.96, 4.76, 0, 2, 1, -13.3, -24.63, 1, 5, -473, -2.23, 0, 2, 1, -15.81, -23.05, 1, 5, -475.88, -1.51, 0, 1, 1, 18.37, 31.42, 1, 1, 1, 24.42, 30.14, 1, 1, 1, 110.54, 20.07, 1, 2, 1, 130.72, 14.51, 0.69967, 2, -6.4, 13.05, 0.30033, 2, 1, 146.95, 10.03, 0.04433, 2, 10.31, 15.14, 0.95567, 1, 2, 61.92, 21.6, 1, 2, 2, 94.81, 14.82, 0.9353, 3, -14.65, 12.43, 0.0647, 2, 2, 106.81, 12.34, 0.58393, 3, -2.4, 12.11, 0.41607, 2, 2, 117.82, 10.07, 0.08673, 3, 8.84, 11.81, 0.91327, 1, 3, 22.5, 11.45, 1, 2, 3, 100.53, 9.4, 1, 5, -136.51, 41.54, 0, 3, 3, 118.15, 8.93, 0.44349, 4, 0.99, 8.91, 0.55651, 5, -119.58, 36.65, 0, 2, 4, 15.95, 8.08, 1, 5, -105.18, 32.49, 0, 1, 4, 40.54, 6.72, 1, 1, 4, 46.57, 5.63, 1, 1, 4, 113.07, 6.22, 1, 2, 4, 120.56, 6.29, 0.81511, 5, -3.64, 7.29, 0.18489, 2, 4, 124.49, 6.64, 0.56016, 5, 0.27, 6.75, 0.43984, 2, 4, 133.15, 7.42, 0.00324, 5, 8.89, 5.57, 0.99676, 1, 5, 22.4, 3.71, 1, 2, 4, 198.79, 22.75, 0, 5, 76.29, 5.79, 1, 3, 1, 130.73, -1.31, 0.54357, 2, -0.33, -1.55, 0.45643, 5, -343.32, 64.63, 0, 3, 1, 125.66, -28.18, 0.40999, 2, 5.3, -28.31, 0.59001, 5, -339.8, 37.52, 0, 3, 2, 106.93, -0.02, 0.50702, 3, -0.11, -0.04, 0.49298, 5, -236.28, 57.8, 0, 3, 3, 117.45, 0.56, 0.49609, 4, 0.05, 0.55, 0.50391, 5, -122.37, 28.72, 0, 2, 3, 116.42, -12.26, 0.52876, 4, -1.36, -12.23, 0.47124, 2, 3, 103.29, -14.68, 0.88262, 4, -14.55, -14.26, 0.11738, 2, 3, 129.66, -13.76, 0.10863, 4, 11.84, -14.1, 0.89137, 2, 4, 126.12, -0.17, 0.47448, 5, 0.33, -0.25, 0.52552 ],
					"hull": 54,
					"edges": [ 0, 106, 0, 2, 2, 4, 4, 6, 16, 18, 22, 24, 24, 26, 26, 28, 28, 30, 44, 46, 46, 48, 48, 50, 50, 52, 52, 54, 54, 56, 56, 58, 58, 60, 60, 62, 62, 64, 64, 66, 66, 68, 68, 70, 92, 94, 104, 106, 70, 72, 72, 74, 74, 76, 36, 38, 38, 40, 40, 42, 42, 44, 76, 78, 78, 80, 80, 82, 82, 84, 88, 90, 90, 92, 84, 86, 86, 88, 30, 32, 32, 34, 34, 36, 18, 20, 20, 22, 98, 100, 100, 102, 102, 104, 6, 8, 8, 10, 10, 12, 94, 96, 96, 98, 12, 14, 14, 16 ],
					"width": 538,
					"height": 141
				},
				"Layer 36 copy": { "x": 62.28, "y": 664.3, "width": 538, "height": 141 }
			},
			"Layer 37": {
				"Layer 37": { "x": -106.69, "y": -9.5, "rotation": -14.04, "width": 407, "height": 182 }
			},
			"Layer 38": {
				"Layer 38": {
					"type": "mesh",
					"uvs": [ 0.44189, 0, 0.49312, 0, 0.55909, 0.14134, 0.69788, 0.45273, 0.77677, 0.54396, 0.91783, 0.64344, 0.99487, 0.76014, 0.99544, 0.87013, 0.91081, 0.93811, 0.63849, 0.9389, 0.59059, 0.45845, 0.32937, 0.61133, 0.44821, 0.88318, 0.34867, 1, 0.16425, 1, 0.04097, 0.9444, 0, 0.88406, 0, 0.84274, 0.01049, 0.79786, 0.24049, 0.66342, 0.19563, 0.53481, 0.11895, 0.2117, 0.1919, 0.10395, 0.38789, 0.00252 ],
					"triangles": [ 10, 2, 3, 11, 20, 22, 21, 22, 20, 23, 11, 22, 0, 1, 2, 23, 0, 2, 11, 23, 2, 11, 2, 10, 19, 20, 11, 15, 16, 17, 8, 4, 5, 8, 5, 6, 8, 6, 7, 4, 9, 10, 4, 10, 3, 9, 4, 8, 14, 15, 18, 15, 17, 18, 19, 14, 18, 12, 19, 11, 13, 19, 12, 14, 19, 13 ],
					"vertices": [ -5.95, 1.47, -5.26, 11.18, 13.81, 22.39, 55.75, 45.84, 68.56, 59.96, 83.26, 85.78, 99.31, 99.31, 113.47, 98.42, 121.08, 81.75, 117.51, 30.14, 55.04, 25.46, 71.19, -25.45, 107.78, -5.42, 121.47, -25.35, 118.98, -60.3, 110.16, -83.16, 101.85, -90.37, 96.53, -89.99, 90.9, -87.59, 76.7, -42.77, 59.54, -50.1, 16.93, -61.67, 4.05, -46.86, -6.36, -8.79 ],
					"hull": 24,
					"edges": [ 0, 46, 0, 2, 2, 4, 4, 6, 6, 8, 8, 10, 10, 12, 12, 14, 14, 16, 16, 18, 18, 20, 20, 22, 22, 24, 24, 26, 26, 28, 28, 30, 30, 32, 32, 34, 34, 36, 36, 38, 38, 40, 40, 42, 42, 44, 44, 46 ],
					"width": 190,
					"height": 129
				}
			},
			"Layer 39": {
				"Layer 39": {
					"type": "mesh",
					"uvs": [ 0.22014, 0, 0.23138, 0.00194, 0.29793, 0.27821, 0.36019, 0.33708, 0.4198, 0.50738, 0.46648, 0.6326, 0.62767, 0.79388, 0.6597, 0.80836, 0.68015, 0.81761, 0.7087, 0.7826, 0.96195, 0.47207, 1, 0.47221, 1, 0.54784, 0.97549, 0.61606, 0.95114, 0.6695, 0.74038, 0.96895, 0.71853, 1, 0.69779, 1, 0.65479, 1, 0.58016, 1, 0.37454, 0.76773, 0.33069, 0.72747, 0.10433, 0.72825, 0.03592, 0.65545, 0.01928, 0.4823, 0, 0.21573, 0.01588, 0.12677, 0.11436, 0.12696, 0.16003, 0, 0.69946, 0.924 ],
					"triangles": [ 17, 18, 29, 19, 6, 18, 18, 8, 29, 18, 7, 8, 18, 6, 7, 20, 5, 19, 19, 5, 6, 20, 4, 5, 20, 21, 4, 22, 2, 21, 22, 27, 2, 2, 0, 1, 0, 2, 27, 27, 28, 0, 27, 22, 24, 21, 3, 4, 21, 2, 3, 22, 23, 24, 24, 25, 27, 27, 25, 26, 15, 16, 29, 16, 17, 29, 29, 9, 15, 15, 9, 14, 29, 8, 9, 14, 9, 10, 14, 10, 13, 13, 10, 12, 10, 11, 12 ],
					"vertices": [ 1, 9, 86.35, -27.01, 1, 1, 9, 84.64, -27.42, 1, 1, 9, 70.28, -15.92, 1, 1, 9, 60.04, -15.66, 1, 1, 9, 48.41, -9.42, 1, 1, 9, 39.44, -4.96, 1, 1, 9, 12.8, -3.81, 1, 2, 8, 50.71, -8.62, 0.02952, 9, 7.79, -4.51, 0.97048, 2, 8, 48.08, -6.75, 0.23219, 9, 4.59, -4.95, 0.76781, 2, 8, 43.23, -6.51, 0.81497, 9, 0.89, -8.1, 0.18503, 1, 8, 0.24, -4.36, 1, 1, 8, -5.08, -1.73, 1, 1, 8, -3.24, 2, 1, 1, 8, 1.85, 3.68, 1, 1, 8, 6.56, 4.63, 1, 1, 8, 43.33, 4.87, 1, 2, 8, 47.14, 4.89, 0.86249, 9, -4.07, 2.89, 0.13751, 2, 8, 50.05, 3.46, 0.44005, 9, -0.97, 3.84, 0.55995, 1, 9, 5.44, 5.79, 1, 1, 9, 16.58, 9.19, 1, 1, 9, 50.99, 6.34, 1, 1, 9, 58.17, 6.22, 1, 1, 9, 91.94, 16.57, 1, 1, 9, 103.31, 15.86, 1, 1, 9, 108.57, 7.51, 1, 1, 9, 115.73, -5.64, 1, 1, 9, 114.79, -11.04, 1, 1, 9, 100.09, -15.52, 1, 1, 9, 95.32, -24.27, 1, 2, 8, 47.96, -0.17, 0.52979, 9, 0, -0.24, 0.47021 ],
					"hull": 29,
					"edges": [ 0, 56, 0, 2, 10, 12, 20, 22, 22, 24, 24, 26, 26, 28, 38, 40, 40, 42, 42, 44, 44, 46, 46, 48, 48, 50, 50, 52, 52, 54, 54, 56, 2, 4, 8, 10, 4, 6, 6, 8, 16, 18, 18, 20, 12, 14, 14, 16, 36, 38, 32, 34, 34, 36, 28, 30, 30, 32 ],
					"width": 156,
					"height": 55
				}
			},
			"Layer 39 copy": {
				"Layer 39 copy": {
					"type": "mesh",
					"uvs": [ 0.01128, 0.14343, 0.05121, 0.10058, 0.09189, 0.10917, 0.10948, 0.13514, 0.12217, 0.18842, 0.13182, 0.22702, 0.13547, 0.2291, 0.12049, 0.11276, 0.13634, 0.01981, 0.15955, 0, 0.23182, 0, 0.29081, 0.22541, 0.36362, 0.32522, 0.38821, 0.41862, 0.39522, 0.54025, 0.47838, 0.63707, 0.63554, 0.78738, 0.64852, 0.79979, 0.66811, 0.79808, 0.68234, 0.79683, 0.70027, 0.7749, 0.96401, 0.45226, 1, 0.45501, 1, 0.52828, 0.96141, 0.63688, 0.70553, 0.99968, 0.699, 1, 0.68258, 1, 0.6653, 1, 0.63921, 1, 0.59553, 1, 0.34075, 0.72247, 0.30286, 0.70979, 0.10073, 0.70953, 0.03724, 0.64618, 0.00243, 0.34919, 0, 0.26083, 0.66662, 0.87748 ],
					"triangles": [ 28, 29, 37, 37, 16, 17, 16, 37, 29, 30, 31, 15, 31, 14, 15, 29, 30, 16, 30, 15, 16, 37, 17, 18, 31, 32, 14, 33, 6, 32, 32, 6, 11, 6, 10, 11, 8, 9, 7, 6, 9, 10, 32, 13, 14, 32, 12, 13, 32, 11, 12, 6, 33, 5, 33, 34, 5, 34, 35, 5, 3, 4, 36, 3, 36, 0, 2, 3, 1, 1, 3, 0, 5, 36, 4, 5, 35, 36, 7, 9, 6, 25, 26, 37, 37, 26, 27, 27, 28, 37, 25, 37, 19, 37, 18, 19, 19, 20, 25, 25, 20, 24, 24, 20, 21, 24, 21, 23, 21, 22, 23 ],
					"vertices": [ 1, 11, 109.6, -8.28, 1, 1, 11, 104.35, -12.38, 1, 1, 11, 98.15, -13.81, 1, 1, 11, 95.11, -13.26, 1, 1, 11, 92.35, -11.05, 1, 1, 11, 90.28, -9.47, 1, 1, 11, 89.7, -9.53, 1, 1, 11, 93.83, -14.95, 1, 1, 11, 92.99, -20.56, 1, 1, 11, 89.85, -22.68, 1, 1, 11, 79.08, -26.02, 1, 1, 11, 66.62, -16.91, 1, 1, 11, 54.14, -15.04, 1, 1, 11, 48.96, -11.27, 1, 1, 11, 45.93, -5.21, 1, 1, 11, 31.96, -3.97, 1, 2, 10, 38.52, -6.57, 0.00454, 11, 6.09, -3.35, 0.99546, 2, 10, 36.97, -5.1, 0.08993, 11, 3.96, -3.3, 0.91007, 2, 10, 34.16, -3.9, 0.59132, 11, 1.06, -4.3, 0.40868, 2, 10, 32.11, -3.03, 0.9276, 11, -1.03, -5.02, 0.0724, 1, 10, 29.07, -2.96, 1, 1, 10, -15.72, -1.78, 1, 1, 10, -20.76, 0.71, 1, 1, 10, -19.06, 4.37, 1, 1, 10, -11.09, 7.26, 1, 2, 10, 33.52, 8.61, 0.95843, 11, -7.8, 4.56, 0.04157, 2, 10, 34.45, 8.2, 0.92919, 11, -6.83, 4.88, 0.07081, 2, 10, 36.77, 7.12, 0.76281, 11, -4.39, 5.64, 0.23719, 2, 10, 39.22, 5.99, 0.47542, 11, -1.81, 6.44, 0.52458, 2, 10, 42.91, 4.28, 0.10207, 11, 2.08, 7.64, 0.89793, 1, 11, 8.58, 9.67, 1, 1, 11, 51.07, 6.88, 1, 1, 11, 56.92, 7.97, 1, 1, 11, 87.04, 17.31, 1, 1, 11, 97.53, 16.92, 1, 1, 11, 107.56, 2.93, 1, 1, 11, 109.36, -1.59, 1, 2, 10, 36.2, -0.04, 0.50815, 11, -0.01, -0.06, 0.49185 ],
					"hull": 37,
					"edges": [ 0, 72, 18, 20, 28, 30, 42, 44, 44, 46, 46, 48, 48, 50, 50, 52, 60, 62, 62, 64, 64, 66, 66, 68, 68, 70, 70, 72, 20, 22, 22, 24, 24, 26, 26, 28, 4, 6, 0, 2, 2, 4, 16, 18, 14, 16, 6, 8, 8, 10, 10, 12, 12, 14, 34, 36, 36, 38, 30, 32, 32, 34, 38, 40, 40, 42, 56, 58, 58, 60, 52, 54, 54, 56 ],
					"width": 156,
					"height": 55
				}
			},
			"Layer 4": {
				"Layer 4": { "x": 10.91, "y": -2.12, "rotation": -46.82, "width": 106, "height": 94 }
			},
			"Layer 41": {
				"Layer 41": { "x": 39.61, "y": -4.81, "rotation": 86.69, "width": 70, "height": 101 }
			},
			"Layer 43": {
				"Layer 43": { "x": -0.68, "y": 0.12, "rotation": 86.69, "width": 23, "height": 18 }
			},
			"Layer 44": {
				"Layer 44": { "x": 51.05, "y": 6.07, "rotation": -93.95, "width": 87, "height": 98 }
			},
			"Layer 45": {
				"Layer 45": {
					"type": "mesh",
					"uvs": [ 0.43749, 0, 0.46085, 5.6E-4, 0.80441, 0.27568, 0.85265, 0.25939, 0.97511, 0.11626, 0.98704, 0.09709, 0.96147, 0.02505, 1, 0.06878, 1, 0.09879, 0.97683, 0.11466, 0.85389, 0.25935, 0.86152, 0.26331, 0.86156, 0.36611, 0.79847, 0.42103, 0.74452, 0.54784, 0.59338, 0.93486, 0.52436, 1, 0.45364, 1, 0.02949, 0.81076, 0.00306, 0.77562, 0.00127, 0.67236, 0.02836, 0.52434, 0.02733, 0.51594, 0.0892, 0.57053, 0.04233, 0.81277, 0.09256, 0.83543, 0.44488, 0.99267, 0.4771, 0.991, 0.55801, 0.86072, 0.58495, 0.83643, 0.61124, 0.86131, 0.79948, 0.41758, 0.80037, 0.38836, 0.82492, 0.29891, 0.82247, 0.29028, 0.4777, 0.01706, 0.45906, 0.03841, 0.32341, 0.06563, 0.28977, 0.03055, 0.36832, 0 ],
					"triangles": [ 1, 2, 35, 36, 0, 1, 36, 1, 35, 37, 38, 39, 36, 37, 39, 36, 39, 0, 5, 6, 7, 5, 7, 8, 9, 5, 8, 9, 4, 5, 10, 4, 9, 4, 10, 3, 34, 2, 3, 35, 2, 34, 33, 34, 3, 3, 10, 11, 33, 3, 11, 33, 11, 12, 32, 33, 12, 31, 32, 12, 13, 31, 12, 23, 21, 22, 31, 13, 14, 20, 21, 23, 24, 18, 19, 19, 20, 24, 23, 24, 20, 14, 30, 31, 30, 28, 29, 15, 28, 30, 15, 30, 14, 16, 27, 28, 17, 26, 27, 25, 26, 17, 18, 24, 25, 17, 18, 25, 15, 16, 28, 17, 27, 16 ],
					"vertices": [ 115.25, 743.68, 124.51, 743.48, 260.55, 643.88, 279.66, 649.78, 328.15, 701.59, 332.88, 708.53, 322.75, 734.61, 338.01, 718.78, 338.01, 707.91, 328.84, 702.17, 280.15, 649.79, 283.17, 648.36, 283.19, 611.14, 258.2, 591.26, 236.84, 545.36, 176.99, 405.26, 149.65, 381.68, 121.65, 381.68, -46.31, 450.18, -56.78, 462.9, -57.49, 500.28, -46.76, 553.87, -47.17, 556.91, -22.67, 537.15, -41.23, 449.46, -21.34, 441.25, 118.18, 384.33, 130.94, 384.93, 162.98, 432.1, 173.65, 440.89, 184.06, 431.88, 258.6, 592.51, 258.96, 603.09, 268.68, 635.47, 267.71, 638.59, 131.18, 737.5, 123.8, 729.77, 70.08, 719.92, 56.76, 732.62, 87.86, 743.68 ],
					"hull": 40,
					"edges": [ 0, 78, 0, 2, 2, 4, 4, 6, 6, 8, 8, 10, 10, 12, 12, 14, 14, 16, 16, 18, 18, 20, 20, 22, 22, 24, 24, 26, 26, 28, 28, 30, 30, 32, 32, 34, 34, 36, 36, 38, 38, 40, 40, 42, 42, 44, 44, 46, 46, 48, 48, 50, 50, 52, 52, 54, 54, 56, 56, 58, 58, 60, 60, 62, 62, 64, 64, 66, 66, 68, 68, 70, 70, 72, 72, 74, 74, 76, 76, 78 ],
					"width": 396,
					"height": 362
				}
			},
			"Layer 46": {
				"Layer 46": { "x": 100.35, "y": 301.1, "width": 72, "height": 112 }
			},
			"Layer 9": {
				"Layer 9": { "x": 28.99, "y": -5.77, "rotation": -66.26, "width": 133, "height": 146 }
			},
			"Shape 1": {
				"Shape 1": { "x": 47.03, "y": -2.78, "rotation": -93.69, "width": 28, "height": 113 }
			},
			"cuu duoc": {
				"cuu duoc": { "x": -21.08, "y": -25.24, "rotation": -62.71, "width": 123, "height": 110 }
			},
			"lo lang": {
				"lo lang": { "x": -15.1, "y": -16.98, "rotation": -62.71, "width": 122, "height": 148 }
			},
			"so": {
				"so": { "x": 49.81, "y": 12.1, "rotation": 94.74, "width": 82, "height": 114 }
			},
			"vui": {
				"vui": { "x": 19.99, "y": 8.65, "rotation": 94.74, "width": 111, "height": 97 }
			}
		}
	}
],
"animations": {
	"finish": {
		"slots": {
			"Layer 36": {
				"attachment": [
					{ "name": "Layer 36" }
				]
			},
			"Layer 45": {
				"attachment": [
					{ "time": 0.5333, "name": null }
				]
			},
			"Layer 46": {
				"attachment": [
					{ "name": null }
				]
			},
			"cuu duoc": {
				"attachment": [
					{ "name": null },
					{ "time": 0.8667, "name": "cuu duoc" },
					{ "time": 1.8333, "name": null }
				]
			},
			"lo lang": {
				"attachment": [
					{ "time": 0.8667, "name": null }
				]
			},
			"so": {
				"attachment": [
					{ "time": 1.1667, "name": null }
				]
			},
			"vui": {
				"attachment": [
					{ "name": null },
					{ "time": 1.1667, "name": "vui" },
					{ "time": 1.8333, "name": null }
				]
			}
		},
		"bones": {
			"bone2": {
				"rotate": [
					{},
					{ "time": 0.5, "angle": -2.24, "curve": 0.697, "c2": -0.77, "c3": 0.75 },
					{ "time": 1.8333 }
				]
			},
			"bone3": {
				"rotate": [
					{},
					{ "time": 0.5, "angle": -2.24, "curve": 0.697, "c2": -0.77, "c3": 0.75 },
					{ "time": 1.8333 }
				]
			},
			"bone4": {
				"rotate": [
					{},
					{ "time": 0.5, "angle": -2.24, "curve": 0.697, "c2": -0.77, "c3": 0.75 },
					{ "time": 1.8333 }
				]
			},
			"bone5": {
				"rotate": [
					{},
					{ "time": 0.5, "angle": -2.24, "curve": 0.697, "c2": -0.77, "c3": 0.75 },
					{ "time": 1.8333 }
				]
			},
			"bone7": {
				"rotate": [
					{},
					{ "time": 0.3333, "angle": 4.71 },
					{ "time": 1.8333 }
				],
				"translate": [
					{},
					{ "time": 0.8667, "x": 3.71, "y": -12.36 },
					{ "time": 1.8333 }
				]
			},
			"bone8": {
				"rotate": [
					{},
					{ "time": 0.3333, "angle": 13.83 },
					{ "time": 0.8, "angle": 1.45 },
					{ "time": 0.8667, "angle": 9.38 },
					{ "time": 0.9333, "angle": 10.77 }
				]
			},
			"bone9": {
				"rotate": [
					{},
					{ "time": 0.3333, "angle": 7.95 },
					{ "time": 0.9333, "angle": 7.58 }
				]
			},
			"bone10": {
				"rotate": [
					{},
					{ "time": 0.3333, "angle": -15.11 },
					{ "time": 0.8667, "angle": -4.33 },
					{ "time": 0.9333, "angle": 4.25 }
				]
			},
			"bone11": {
				"rotate": [
					{},
					{ "time": 0.3333, "angle": 10.52 },
					{ "time": 0.9333, "angle": 7.4 }
				]
			},
			"bone12": {
				"rotate": [
					{},
					{ "time": 0.3333, "angle": -7.34 },
					{ "time": 1.8333 }
				]
			},
			"bone14": {
				"rotate": [
					{},
					{ "time": 1.0333, "angle": 17.86 },
					{ "time": 1.8333 }
				]
			},
			"bone17": {
				"rotate": [
					{},
					{ "time": 0.8333, "angle": 63.39 }
				],
				"translate": [
					{},
					{ "time": 0.5, "x": 1.87, "y": -13.06 },
					{ "time": 0.8333, "x": 44.08, "y": -430.68, "curve": 1, "c3": 0.75 },
					{ "time": 0.8667, "x": 44.08, "y": -440.89, "curve": 0.25, "c3": 0.75 },
					{ "time": 0.9667, "x": 44.08, "y": -432.96 },
					{ "time": 1.0333, "x": 44.08, "y": -433.65 }
				]
			},
			"bone18": {
				"rotate": [
					{},
					{ "time": 0.8333, "angle": -12.96 },
					{ "time": 1.8333 }
				],
				"translate": [
					{},
					{ "time": 0.9, "x": -4.66, "y": -2.34, "curve": 1, "c2": -0.04, "c3": 0.75 },
					{ "time": 0.9667, "x": -4.91, "y": -2.46 }
				]
			},
			"bone19": {
				"rotate": [
					{},
					{ "time": 0.1667, "angle": -33.4 },
					{ "time": 0.3333, "angle": -33.85 },
					{ "time": 0.5, "angle": -29.01 },
					{ "time": 0.8667, "angle": 58.83 },
					{ "time": 1.8333 }
				]
			},
			"bone20": {
				"rotate": [
					{},
					{ "time": 0.1667, "angle": 3.58 },
					{ "time": 0.3333, "angle": -39.52 },
					{ "time": 0.5, "angle": 3.58 },
					{ "time": 0.6667, "angle": -39.52 },
					{ "time": 0.8667, "angle": -31.04 },
					{ "time": 1.1667, "angle": 25.64 },
					{ "time": 1.8333 }
				]
			},
			"bone21": {
				"rotate": [
					{},
					{ "time": 0.5, "angle": -12.87 },
					{ "time": 0.8667, "angle": 25.63 },
					{ "time": 1, "angle": 33.36 },
					{ "time": 1.8333 }
				]
			},
			"bone23": {
				"rotate": [
					{},
					{ "time": 1, "angle": 23.69 },
					{ "time": 1.8333 }
				]
			},
			"bone25": {
				"rotate": [
					{},
					{ "time": 0.3333, "angle": -19.62 },
					{ "time": 0.6667, "angle": -28.01 },
					{ "time": 1.8333 }
				]
			},
			"bone26": {
				"rotate": [
					{},
					{ "time": 0.3333, "angle": 5.92 },
					{ "time": 1.8333 }
				]
			}
		}
	},
	"quest": {
		"slots": {
			"cuu duoc": {
				"attachment": [
					{ "name": null }
				]
			}
		}
	},
	"quest2": {
		"slots": {
			"Layer 36": {
				"attachment": [
					{ "name": "Layer 36" }
				]
			},
			"cuu duoc": {
				"attachment": [
					{ "name": null }
				]
			},
			"vui": {
				"attachment": [
					{ "name": null }
				]
			}
		}
	}
}
}