
12.png
size: 440,492
format: RGBA8888
filter: Linear,Linear
repeat: none
lvtinh/lv12than
  rotate: false
  xy: 2, 97
  size: 305, 393
  orig: 305, 393
  offset: 0, 0
  index: -1
lvtinh/lv12thieu
  rotate: false
  xy: 254, 2
  size: 146, 123
  orig: 146, 123
  offset: 0, 0
  index: -1
lvtinh/lv1bong
  rotate: true
  xy: 309, 127
  size: 363, 126
  orig: 363, 126
  offset: 0, 0
  index: -1
