
level1.png
size: 264,1972
format: RGBA8888
filter: Linear,Linear
repeat: none
1_1
  rotate: true
  xy: 2, 580
  size: 103, 165
  orig: 103, 165
  offset: 0, 0
  index: -1
1_2
  rotate: true
  xy: 2, 475
  size: 103, 165
  orig: 103, 165
  offset: 0, 0
  index: -1
47
  rotate: true
  xy: 2, 1494
  size: 150, 211
  orig: 150, 211
  offset: 0, 0
  index: -1
New folder/ko hieu
  rotate: false
  xy: 2, 1646
  size: 193, 321
  orig: 193, 321
  offset: 0, 0
  index: -1
New folder/so
  rotate: false
  xy: 2, 995
  size: 187, 174
  orig: 187, 174
  offset: 0, 0
  index: -1
New folder/vui
  rotate: false
  xy: 2, 108
  size: 178, 155
  orig: 178, 155
  offset: 0, 0
  index: -1
banchan1
  rotate: false
  xy: 2, 6
  size: 53, 24
  orig: 53, 24
  offset: 0, 0
  index: -1
banchan2
  rotate: false
  xy: 57, 4
  size: 50, 24
  orig: 50, 24
  offset: 0, 0
  index: -1
bantay1
  rotate: false
  xy: 200, 5
  size: 52, 49
  orig: 54, 51
  offset: 1, 1
  index: -1
body
  rotate: false
  xy: 167, 892
  size: 66, 126
  orig: 66, 126
  offset: 0, 0
  index: -1
canhtay1
  rotate: false
  xy: 182, 85
  size: 68, 62
  orig: 68, 62
  offset: 0, 0
  index: -1
canhtay2
  rotate: false
  xy: 189, 318
  size: 68, 62
  orig: 69, 62
  offset: 0, 0
  index: -1
chan1
  rotate: false
  xy: 186, 1241
  size: 27, 81
  orig: 29, 82
  offset: 1, 1
  index: -1
chan2
  rotate: false
  xy: 176, 1322
  size: 27, 82
  orig: 28, 82
  offset: 0, 0
  index: -1
dau
  rotate: false
  xy: 2, 828
  size: 173, 172
  orig: 173, 172
  offset: 0, 0
  index: -1
img/chan1
  rotate: false
  xy: 248, 249
  size: 13, 59
  orig: 14, 59
  offset: 1, 0
  index: -1
img/chan2
  rotate: false
  xy: 240, 295
  size: 20, 52
  orig: 21, 52
  offset: 0, 0
  index: -1
img/chan3
  rotate: false
  xy: 208, 406
  size: 51, 17
  orig: 51, 17
  offset: 0, 0
  index: -1
img/chan4
  rotate: false
  xy: 208, 381
  size: 40, 23
  orig: 40, 23
  offset: 0, 0
  index: -1
img/dau
  rotate: false
  xy: 2, 1321
  size: 171, 171
  orig: 171, 171
  offset: 0, 0
  index: -1
img/tay1
  rotate: true
  xy: 178, 1097
  size: 124, 21
  orig: 125, 22
  offset: 0, 0
  index: -1
img/tay2
  rotate: false
  xy: 233, 103
  size: 28, 35
  orig: 28, 35
  offset: 0, 0
  index: -1
img/tay3
  rotate: false
  xy: 233, 45
  size: 27, 38
  orig: 27, 38
  offset: 0, 0
  index: -1
img/tay4
  rotate: true
  xy: 175, 1360
  size: 132, 21
  orig: 132, 21
  offset: 0, 0
  index: -1
img/toc1
  rotate: true
  xy: 173, 766
  size: 115, 41
  orig: 115, 41
  offset: 0, 0
  index: -1
img/toc2
  rotate: 270
  xy: 30, 3
  size: 121, 179
  orig: 121, 180
  offset: 0, 1
  index: -1
img/tocc
  rotate: false
  xy: 2, 1170
  size: 182, 149
  orig: 182, 149
  offset: 0, 0
  index: -1
img/vay
  rotate: 180
  xy: 142, 148
  size: 120, 172
  orig: 120, 172
  offset: 0, 0
  index: -1
keo
  rotate: true
  xy: 2, 370
  size: 103, 165
  orig: 103, 165
  offset: 0, 0
  index: -1
keo - Copy
  rotate: true
  xy: 2, 265
  size: 103, 165
  orig: 103, 165
  offset: 0, 0
  index: -1
mat1
  rotate: true
  xy: 2, 685
  size: 140, 169
  orig: 140, 169
  offset: 0, 0
  index: -1
shadow2
  rotate: true
  xy: 169, 347
  size: 221, 37
  orig: 221, 37
  offset: 0, 0
  index: -1
toc
  rotate: true
  xy: 169, 570
  size: 113, 78
  orig: 113, 78
  offset: 0, 0
  index: -1
