
lv61.png
size: 268,1292
format: RGBA8888
filter: Linear,Linear
repeat: none
0
  rotate: true
  xy: 193, 451
  size: 92, 40
  orig: 92, 40
  offset: 0, 0
  index: -1
1
  rotate: true
  xy: 153, 570
  size: 148, 101
  orig: 148, 101
  offset: 0, 0
  index: -1
11
  rotate: false
  xy: 135, 163
  size: 110, 36
  orig: 110, 36
  offset: 0, 0
  index: -1
12
  rotate: false
  xy: 2, 451
  size: 189, 117
  orig: 189, 117
  offset: 0, 0
  index: -1
13
  rotate: false
  xy: 2, 1058
  size: 231, 231
  orig: 231, 231
  offset: 0, 0
  index: -1
14
  rotate: false
  xy: 84, 65
  size: 133, 96
  orig: 133, 96
  offset: 0, 0
  index: -1
15
  rotate: false
  xy: 2, 3
  size: 108, 83
  orig: 108, 83
  offset: 0, 0
  index: -1
16
  rotate: true
  xy: 2, 721
  size: 143, 213
  orig: 143, 213
  offset: 0, 0
  index: -1
17
  rotate: false
  xy: 213, 720
  size: 47, 65
  orig: 47, 65
  offset: 0, 0
  index: -1
18
  rotate: false
  xy: 17, 3
  size: 72, 31
  orig: 72, 31
  offset: 0, 0
  index: -1
19
  rotate: 270
  xy: 57, 47
  size: 64, 137
  orig: 64, 137
  offset: 0, 0
  index: -1
2
  rotate: false
  xy: 2, 570
  size: 149, 149
  orig: 149, 149
  offset: 0, 0
  index: -1
20
  rotate: true
  xy: 185, 23
  size: 139, 70
  orig: 139, 70
  offset: 0, 0
  index: -1
21
  rotate: false
  xy: 104, 68
  size: 40, 59
  orig: 40, 59
  offset: 0, 0
  index: -1
22
  rotate: false
  xy: 2, 112
  size: 55, 44
  orig: 55, 44
  offset: 0, 0
  index: -1
3
  rotate: true
  xy: 235, 970
  size: 133, 26
  orig: 133, 26
  offset: 0, 0
  index: -1
4
  rotate: false
  xy: 2, 326
  size: 170, 123
  orig: 170, 123
  offset: 0, 0
  index: -1
5
  rotate: false
  xy: 2, 865
  size: 196, 191
  orig: 196, 191
  offset: 0, 0
  index: -1
6
  rotate: true
  xy: 200, 850
  size: 118, 64
  orig: 118, 64
  offset: 0, 0
  index: -1
7
  rotate: false
  xy: 2, 201
  size: 170, 123
  orig: 170, 123
  offset: 0, 0
  index: -1
8
  rotate: false
  xy: 2, 158
  size: 131, 41
  orig: 131, 41
  offset: 0, 0
  index: -1
9
  rotate: true
  xy: 174, 213
  size: 121, 64
  orig: 121, 64
  offset: 0, 0
  index: -1
toc
  rotate: true
  xy: 174, 336
  size: 113, 78
  orig: 113, 78
  offset: 0, 0
  index: -1
