
skeleton.png
size: 1780,368
format: RGBA8888
filter: Linear,Linear
repeat: none
1
  rotate: false
  xy: 1464, 26
  size: 28, 113
  orig: 28, 113
  offset: 0, 0
  index: -1
Shape 1
  rotate: false
  xy: 1464, 26
  size: 28, 113
  orig: 28, 113
  offset: 0, 0
  index: -1
Ellipse 1
  rotate: false
  xy: 951, 217
  size: 147, 147
  orig: 147, 147
  offset: 0, 0
  index: -1
Ellipse 1 copy
  rotate: false
  xy: 692, 52
  size: 128, 128
  orig: 128, 128
  offset: 0, 0
  index: -1
Ellipse 5
  rotate: true
  xy: 1100, 113
  size: 251, 64
  orig: 251, 64
  offset: 0, 0
  index: -1
Layer 10
  rotate: false
  xy: 76, 7
  size: 69, 91
  orig: 69, 91
  offset: 0, 0
  index: -1
Layer 12
  rotate: false
  xy: 147, 41
  size: 95, 49
  orig: 95, 49
  offset: 0, 0
  index: -1
Layer 12 copy
  rotate: false
  xy: 283, 181
  size: 98, 40
  orig: 98, 40
  offset: 0, 0
  index: -1
Layer 36
  rotate: false
  xy: 2, 80
  size: 538, 141
  orig: 538, 141
  offset: 0, 0
  index: -1
Layer 36 copy
  rotate: false
  xy: 2, 223
  size: 538, 141
  orig: 538, 141
  offset: 0, 0
  index: -1
Layer 37
  rotate: false
  xy: 542, 182
  size: 407, 182
  orig: 407, 182
  offset: 0, 0
  index: -1
Layer 38
  rotate: 270
  xy: 1166, 175
  size: 190, 129
  orig: 190, 129
  offset: 0, 0
  index: -1
Layer 39
  rotate: false
  xy: 80, 166
  size: 156, 55
  orig: 156, 55
  offset: 0, 0
  index: -1
Layer 39 copy
  rotate: false
  xy: 237, 4
  size: 156, 55
  orig: 156, 55
  offset: 0, 0
  index: -1
Layer 4
  rotate: true
  xy: 1279, 100
  size: 106, 94
  orig: 106, 94
  offset: 0, 0
  index: -1
Layer 41
  rotate: false
  xy: 1375, 5
  size: 70, 101
  orig: 70, 101
  offset: 0, 0
  index: -1
Layer 43
  rotate: false
  xy: 34, 203
  size: 23, 18
  orig: 23, 18
  offset: 0, 0
  index: -1
Layer 44
  rotate: false
  xy: 1375, 108
  size: 87, 98
  orig: 87, 98
  offset: 0, 0
  index: -1
Layer 45
  rotate: 180
  xy: 1381, 3
  size: 396, 362
  orig: 396, 362
  offset: 0, 0
  index: -1
Layer 46
  rotate: false
  xy: 2, 9
  size: 72, 112
  orig: 72, 112
  offset: 0, 0
  index: -1
Layer 9
  rotate: true
  xy: 951, 82
  size: 133, 146
  orig: 133, 146
  offset: 0, 0
  index: -1
cuu duoc
  rotate: false
  xy: 822, 70
  size: 123, 110
  orig: 123, 110
  offset: 0, 0
  index: -1
lo lang
  rotate: true
  xy: 542, 58
  size: 122, 148
  orig: 122, 148
  offset: 0, 0
  index: -1
so
  rotate: false
  xy: 1297, 208
  size: 82, 114
  orig: 82, 114
  offset: 0, 0
  index: -1
vui
  rotate: false
  xy: 1166, 76
  size: 111, 97
  orig: 111, 97
  offset: 0, 0
  index: -1
