{
"skeleton": {
	"hash": "G5keTX+4nOIQ2GQA2I9X7kDJ0wM",
	"spine": "3.8.82",
	"x": -501.55,
	"y": 82.08,
	"width": 1142,
	"height": 1075,
	"images": "./images/",
	"audio": "E:/bach_spine/Pencil/500lv/level-2"
},
"bones": [
	{ "name": "root" },
	{ "name": "bone", "parent": "root", "x": -294.5, "y": 425.99 },
	{ "name": "blue1-body", "parent": "bone", "length": 91.65, "rotation": 115.25, "x": 0.15, "y": 0.5 },
	{ "name": "blue1-body2", "parent": "blue1-body", "length": 111.85, "rotation": -26.46, "x": 91.65 },
	{ "name": "blue1-face", "parent": "blue1-body2", "length": 229.9, "rotation": -14.68, "x": 113.58, "y": -0.69 },
	{ "name": "blue1-smile", "parent": "blue1-face", "x": 43.8, "y": -22.98 },
	{ "name": "bone2", "parent": "bone", "length": 85.39, "rotation": -76.32, "x": 59.79, "y": -9.44 },
	{ "name": "bone3", "parent": "bone2", "length": 96.19, "rotation": -19.44, "x": 85.39 },
	{ "name": "bone4", "parent": "bone3", "length": 71.34, "rotation": -12.71, "x": 96.19, "transform": "noRotationOrReflection" },
	{ "name": "blue1-leg-2b", "parent": "bone", "length": 97.09, "rotation": -73.45, "x": -54.79, "y": -10.76 },
	{ "name": "blue1-leg-2b2", "parent": "blue1-leg-2b", "length": 97.71, "rotation": -20.67, "x": 97.09 },
	{ "name": "blue1-leg-2b3", "parent": "blue1-leg-2b2", "length": 93.71, "rotation": -12.33, "x": 97.71, "transform": "noRotationOrReflection" },
	{ "name": "target1", "parent": "root", "x": -224.4, "y": 237.38, "color": "ff3f00ff" },
	{ "name": "target2", "parent": "root", "x": -327.99, "y": 224.49, "color": "ff3f00ff" },
	{ "name": "blue1-hand-1b", "parent": "blue1-body2", "length": 119.69, "rotation": -107.41, "x": 35.41, "y": -18.67 },
	{ "name": "blue1-hand-1b2", "parent": "blue1-hand-1b", "length": 95.55, "rotation": 54.38, "x": 119.69 },
	{ "name": "blue1-hand-1b3", "parent": "blue1-hand-1b2", "length": 89.48, "rotation": 27.33, "x": 93.83, "y": 0.54 },
	{ "name": "blue1-hand-2b", "parent": "blue1-body2", "length": 85.66, "rotation": -177.15, "x": 54.81, "y": 44.39 },
	{ "name": "blue1-hand-2b2", "parent": "blue1-hand-2b", "length": 93.68, "rotation": -14.95, "x": 85.66 },
	{ "name": "blue1-hand-2b3", "parent": "blue1-hand-2b2", "length": 57.45, "rotation": 9, "x": 93.68 },
	{ "name": "blue1-body3", "parent": "blue1-body", "x": 37.26, "y": -80.6 },
	{ "name": "blue2-body", "parent": "root", "x": 331.07, "y": 463.58 },
	{ "name": "blue2-body2", "parent": "blue2-body", "length": 75.21, "rotation": 87.25, "x": 0.6 },
	{ "name": "blue2-body3", "parent": "blue2-body2", "length": 93.85, "rotation": 0.18, "x": 75.21 },
	{ "name": "blue2-hand-1b", "parent": "blue2-body3", "length": 134.71, "rotation": 122.56, "x": 56.38, "y": 87.27 },
	{ "name": "blue2-hand-1b2", "parent": "blue2-hand-1b", "length": 129.29, "rotation": -133.09, "x": 137.88, "y": -4.8 },
	{ "name": "blue2-hand-1b3", "parent": "blue2-hand-1b2", "length": 64.83, "rotation": -14.28, "x": 129.29 },
	{ "name": "blue2-hand-2b", "parent": "blue2-body3", "length": 135.21, "rotation": -154.23, "x": 75.35, "y": -75.96 },
	{ "name": "blue2-hand-2b2", "parent": "blue2-hand-2b", "length": 110.42, "rotation": -41.37, "x": 135.21 },
	{ "name": "blue2-hand-2b3", "parent": "blue2-hand-2b2", "length": 87.82, "rotation": -8.39, "x": 110.42 },
	{ "name": "blue2-leg-1b", "parent": "blue2-body", "length": 78.59, "rotation": -112.71, "x": -52.27, "y": -21.24 },
	{ "name": "blue2-leg-1b2", "parent": "blue2-leg-1b", "length": 90.57, "rotation": 20.22, "x": 78.59 },
	{ "name": "blue2-leg-2b", "parent": "blue2-body", "length": 88.88, "rotation": -92.54, "x": 21.35, "y": 0.67 },
	{ "name": "blue2-leg-2b2", "parent": "blue2-leg-2b", "length": 93.15, "rotation": 22.28, "x": 88.88 },
	{
		"name": "blue2-leg-2b3",
		"parent": "blue2-leg-2b2",
		"length": 67.46,
		"rotation": -143.64,
		"x": 94.07,
		"y": -1.57,
		"transform": "noRotationOrReflection"
	},
	{
		"name": "blue2-leg-1b3",
		"parent": "blue2-leg-1b2",
		"length": 82.42,
		"rotation": -164.45,
		"x": 87.7,
		"y": 0.42,
		"transform": "noRotationOrReflection"
	},
	{ "name": "blue2-face", "parent": "blue2-body3", "length": 186.92, "rotation": 7.62, "x": 92.81, "y": -0.07 },
	{ "name": "target3", "parent": "root", "x": 244.67, "y": 278.81, "color": "ff3f00ff" },
	{ "name": "target4", "parent": "root", "x": 380.21, "y": 286.52, "color": "ff3f00ff" }
],
"slots": [
	{ "name": "shadow", "bone": "root", "attachment": "shadow" },
	{ "name": "blue1-hand-1b", "bone": "blue1-hand-1b", "attachment": "blue1-hand-1b" },
	{ "name": "blue1-hand-1a", "bone": "blue1-hand-1b3", "attachment": "blue1-hand-1a" },
	{ "name": "blue1-leg-1a", "bone": "root", "attachment": "blue1-leg-1a" },
	{ "name": "blue1-leg-1b", "bone": "root" },
	{ "name": "blue1-leg-2b2", "bone": "bone2", "attachment": "blue1-leg-2b" },
	{ "name": "blue1-body", "bone": "blue1-body", "attachment": "blue1-body" },
	{ "name": "blue1-leg-2a", "bone": "root", "attachment": "blue1-leg-2a" },
	{ "name": "blue1-leg-2b", "bone": "blue1-leg-2b", "attachment": "blue1-leg-2b" },
	{ "name": "blue1-hand-2b", "bone": "blue1-hand-2b", "attachment": "blue1-hand-2b" },
	{ "name": "blue1-hand-2a", "bone": "blue1-hand-2b3", "attachment": "blue1-hand-2a" },
	{ "name": "blue1-face", "bone": "blue1-face", "attachment": "blue1-face" },
	{ "name": "blue1-eye-1", "bone": "blue1-face", "attachment": "blue1-eye-1" },
	{ "name": "blue1-eye-2", "bone": "blue1-face", "attachment": "blue1-eye-2" },
	{ "name": "blue1-lid-1", "bone": "blue1-face", "attachment": "blue1-lid-1" },
	{ "name": "blue1-lid-2", "bone": "blue1-face", "attachment": "blue1-lid-2" },
	{ "name": "blue1-iris-1", "bone": "blue1-face", "attachment": "blue1-iris-1" },
	{ "name": "blue1-iris-2", "bone": "blue1-face", "attachment": "blue1-iris-2" },
	{ "name": "blue1-smile", "bone": "blue1-smile", "attachment": "blue1-smile" },
	{ "name": "mirror", "bone": "root", "attachment": "mirror" },
	{ "name": "blue2-hand-1b", "bone": "blue2-hand-1b", "attachment": "blue2-hand-1b" },
	{ "name": "blue2-hand-1a", "bone": "blue2-hand-1b3", "attachment": "blue2-hand-1a" },
	{ "name": "blue2-leg-1a", "bone": "root", "attachment": "blue2-leg-1a" },
	{ "name": "blue2-leg-1b", "bone": "blue2-leg-1b", "attachment": "blue2-leg-1b" },
	{ "name": "blue2-body", "bone": "blue2-body", "attachment": "blue2-body" },
	{ "name": "blue2-leg-2a", "bone": "root", "attachment": "blue2-leg-2a" },
	{ "name": "blue2-leg-2b", "bone": "blue2-leg-2b", "attachment": "blue2-leg-2b" },
	{ "name": "blue2-hand-2b", "bone": "blue2-hand-2b", "attachment": "blue2-hand-2b" },
	{ "name": "blue2-hand-2a", "bone": "blue2-hand-2b3", "attachment": "blue2-hand-2a" },
	{ "name": "blue2-face", "bone": "blue2-face", "attachment": "blue2-face" },
	{ "name": "blue2-eye-2", "bone": "blue2-face", "attachment": "blue2-eye-2" },
	{ "name": "blue2-eye-1", "bone": "blue2-face", "attachment": "blue2-eye-1" },
	{ "name": "blue2-iris-1", "bone": "blue2-face", "attachment": "blue2-iris-1" },
	{ "name": "blue2-iris-2", "bone": "blue2-face", "attachment": "blue2-iris-2" },
	{ "name": "blue2--smile", "bone": "blue2-face", "attachment": "blue2--smile" },
	{ "name": "light-1", "bone": "root", "color": "ffffff79", "attachment": "light-1" },
	{ "name": "light-2", "bone": "root", "color": "ffffff79", "attachment": "light-2" },
	{ "name": "mouth", "bone": "blue1-face", "attachment": "mouth" }
],
"ik": [
	{
		"name": "target1",
		"bones": [ "bone2", "bone3" ],
		"target": "target1",
		"bendPositive": false
	},
	{
		"name": "target2",
		"order": 1,
		"bones": [ "blue1-leg-2b", "blue1-leg-2b2" ],
		"target": "target2",
		"bendPositive": false
	},
	{
		"name": "target3",
		"order": 2,
		"bones": [ "blue2-leg-1b", "blue2-leg-1b2" ],
		"target": "target3"
	},
	{
		"name": "target4",
		"order": 3,
		"bones": [ "blue2-leg-2b", "blue2-leg-2b2" ],
		"target": "target4"
	}
],
"skins": [
	{
		"name": "default",
		"attachments": {
			"blue1-body": {
				"blue1-body": {
					"type": "mesh",
					"uvs": [ 0.50448, 0.01219, 0.57924, 0.05709, 0.58371, 0.10709, 0.54665, 0.16904, 0.53834, 0.22359, 0.55879, 0.28098, 0.61183, 0.32304, 0.7273, 0.31327, 0.85419, 0.34169, 0.93726, 0.42855, 0.98404, 0.54525, 0.99232, 0.68874, 0.9462, 0.83243, 0.83146, 0.9574, 0.62731, 1, 0.41071, 0.97807, 0.2381, 0.90205, 0.10864, 0.79799, 0.02233, 0.65039, 0, 0.47964, 0.03226, 0.34592, 0.09731, 0.22928, 0.18476, 0.12401, 0.27745, 0.05119, 0.38558, 0, 0.40149, 0.1066, 0.333, 0.18636, 0.27756, 0.30528, 0.27266, 0.40824, 0.31669, 0.51845, 0.43573, 0.59821, 0.61348, 0.64607, 0.79938, 0.64607 ],
					"triangles": [ 31, 6, 7, 29, 19, 28, 6, 29, 5, 29, 28, 5, 5, 27, 4, 4, 27, 26, 28, 27, 5, 19, 20, 28, 28, 20, 27, 27, 20, 21, 21, 22, 27, 27, 22, 26, 26, 25, 4, 4, 25, 3, 22, 23, 26, 26, 23, 25, 3, 25, 2, 2, 0, 1, 0, 2, 25, 23, 24, 25, 25, 24, 0, 15, 31, 14, 13, 31, 32, 13, 14, 31, 15, 30, 31, 15, 16, 30, 16, 17, 30, 17, 29, 30, 17, 18, 29, 29, 18, 19, 30, 6, 31, 6, 30, 29, 13, 32, 12, 12, 32, 11, 32, 10, 11, 31, 7, 32, 32, 9, 10, 32, 8, 9, 32, 7, 8 ],
					"vertices": [ 1, 3, 131.97, -25.73, 1, 1, 3, 120.19, -43.99, 1, 2, 20, 129.68, -7.52, 2.3E-4, 3, 106.66, -45.36, 0.99977, 3, 20, 118.31, 7.72, 0.00671, 2, 155.56, -72.88, 2.0E-5, 3, 89.69, -36.78, 0.99328, 2, 2, 143.05, -64.77, 0.00315, 3, 74.87, -35.09, 0.99685, 2, 2, 126.88, -62.59, 0.03133, 3, 59.42, -40.34, 0.96867, 2, 2, 111.12, -69.29, 0.1068, 3, 48.29, -53.36, 0.8932, 3, 20, 64.38, -14.98, 0.48338, 2, 101.64, -95.58, 0.05345, 3, 51.52, -81.13, 0.46317, 3, 20, 44.37, -39.35, 0.80642, 2, 81.63, -119.96, 7.7E-4, 3, 44.47, -111.86, 0.1928, 2, 20, 14.54, -47.42, 0.97734, 3, 21.35, -132.37, 0.02266, 3, 20, -18.87, -44.12, 0.96783, 2, 18.38, -124.72, 0.03159, 3, -10.03, -144.3, 5.8E-4, 2, 20, -54.89, -29.34, 0.57088, 2, -17.64, -109.94, 0.42912, 2, 20, -85.37, -2.67, 0.13316, 2, -48.11, -83.28, 0.86684, 1, 2, -66.95, -43.82, 1, 1, 2, -56.4, 5.61, 1, 1, 2, -28.75, 50.28, 1, 2, 2, 7.62, 79.12, 0.99766, 3, -110.47, 33.4, 0.00234, 2, 2, 46.44, 95.31, 0.93532, 3, -82.94, 65.18, 0.06468, 2, 2, 91.49, 97.05, 0.7099, 3, -43.38, 86.82, 0.2901, 2, 2, 135.64, 82.18, 0.34464, 3, 2.77, 93.17, 0.65536, 2, 2, 165.1, 59.69, 0.11065, 3, 39.16, 86.16, 0.88935, 2, 2, 187, 32.02, 0.01207, 3, 71.1, 71.15, 0.98793, 1, 3, 100.06, 50.68, 1, 1, 3, 120.26, 28.75, 1, 1, 3, 134.67, 2.99, 1, 1, 3, 105.87, -1.45, 1, 1, 3, 83.91, 14.6, 1, 2, 2, 149.84, 1.52, 0.00161, 3, 51.42, 27.28, 0.99839, 2, 2, 125.1, 14.49, 0.0524, 3, 23.49, 27.88, 0.9476, 2, 2, 93.56, 17.64, 0.60075, 3, -6.14, 16.64, 0.39925, 1, 2, 61.78, 0.91, 1, 3, 20, -5.48, 48.3, 0.30214, 2, 31.77, -32.3, 0.6924, 3, -39.22, -55.59, 0.00547, 2, 20, -24.6, 7.78, 0.81367, 2, 12.66, -72.82, 0.18633 ],
					"hull": 25,
					"edges": [ 38, 40, 40, 42, 42, 44, 44, 46, 46, 48, 48, 0, 0, 2, 2, 4, 4, 6, 6, 8, 8, 10, 10, 12, 12, 14, 14, 16, 16, 18, 18, 20, 20, 22, 38, 36, 36, 34, 34, 32, 32, 30, 30, 28, 28, 26, 26, 24, 24, 22 ],
					"width": 241,
					"height": 271
				}
			},
			"blue1-eye-1": {
				"blue1-eye-1": { "x": 150.5, "y": 43.52, "rotation": -74.11, "width": 131, "height": 115 }
			},
			"blue1-eye-2": {
				"blue1-eye-2": { "x": 167.63, "y": -62.33, "rotation": -74.11, "width": 100, "height": 118 }
			},
			"blue1-face": {
				"blue1-face": { "x": 92.75, "y": -12.94, "rotation": -74.11, "width": 308, "height": 283 }
			},
			"blue1-hand-1a": {
				"blue1-hand-1a": { "x": 48.28, "y": 0.09, "rotation": -63.11, "width": 121, "height": 135 }
			},
			"blue1-hand-1b": {
				"blue1-hand-1b": {
					"type": "mesh",
					"uvs": [ 1, 0.17062, 0.89634, 0.44539, 0.76878, 0.66042, 0.62959, 0.80817, 0.50337, 0.90461, 0.39956, 0.95797, 0.28041, 1, 0, 1, 0, 0.90872, 0, 0.68015, 0.1511, 0.70246, 0.30135, 0.66422, 0.40762, 0.59728, 0.51207, 0.49528, 0.63667, 0.34865, 0.81257, 0, 1, 0, 0.12942, 0.95797 ],
					"triangles": [ 15, 16, 0, 1, 15, 0, 14, 15, 1, 2, 14, 1, 3, 13, 14, 3, 14, 2, 4, 12, 13, 4, 13, 3, 5, 12, 4, 8, 9, 10, 5, 11, 12, 17, 8, 10, 7, 8, 17, 6, 10, 11, 6, 11, 5, 17, 10, 6, 7, 17, 6 ],
					"vertices": [ 1, 15, 115.17, -9.64, 1, 1, 15, 85.7, -20.92, 1, 1, 15, 56.35, -25.21, 1, 1, 15, 29.2, -23.13, 1, 2, 14, 138.47, -5.23, 0.02765, 15, 6.68, -18.32, 0.97235, 2, 14, 123.67, -15.62, 0.72342, 15, -10.38, -12.34, 0.27658, 1, 14, 106.1, -25.79, 1, 1, 14, 61.72, -40.73, 1, 1, 14, 58.93, -32.43, 1, 1, 14, 51.92, -11.63, 1, 1, 14, 76.52, -5.61, 1, 2, 14, 99.13, 5.87, 0.98014, 15, -7.2, 20.13, 0.01986, 2, 14, 113.9, 17.63, 0.28694, 15, 10.96, 14.97, 0.71306, 2, 14, 127.31, 32.47, 0.00101, 15, 30.84, 12.71, 0.99899, 1, 15, 55.95, 11.97, 1, 1, 15, 99.35, 21.95, 1, 1, 15, 124.74, 3.65, 1, 1, 14, 80.92, -30.01, 1 ],
					"hull": 17,
					"edges": [ 18, 20, 20, 22, 22, 24, 24, 26, 26, 28, 30, 32, 28, 30, 14, 16, 16, 18, 16, 34, 12, 14, 34, 12, 12, 10, 10, 8, 8, 6, 6, 4, 4, 2, 0, 32, 2, 0 ],
					"width": 167,
					"height": 96
				}
			},
			"blue1-hand-2a": {
				"blue1-hand-2a": { "x": 56.82, "y": 1.01, "rotation": 94.3, "width": 177, "height": 161 }
			},
			"blue1-hand-2b": {
				"blue1-hand-2b": {
					"type": "mesh",
					"uvs": [ 0.78292, 0.03105, 0.92317, 0.13624, 0.95051, 0.2702, 0.96248, 0.3799, 0.9429, 0.50281, 0.86403, 0.65568, 0.73784, 0.80871, 0.54763, 0.93441, 0.34155, 1, 0, 1, 0, 0.91224, 0.16025, 0.7651, 0.28238, 0.62937, 0.36661, 0.50276, 0.41294, 0.38641, 0.42978, 0.23813, 0.32463, 0.05045, 0.50602, 0 ],
					"triangles": [ 16, 1, 15, 0, 16, 17, 1, 16, 0, 15, 1, 2, 14, 15, 2, 14, 2, 3, 4, 14, 3, 13, 14, 4, 5, 13, 4, 12, 13, 5, 6, 12, 5, 11, 12, 6, 7, 11, 6, 10, 11, 7, 8, 9, 10, 7, 8, 10 ],
					"vertices": [ 1, 17, -0.76, 8.88, 1, 1, 17, 19.64, 15.59, 1, 1, 17, 45.39, 16.27, 1, 1, 17, 66.46, 16.29, 1, 2, 18, 0.45, 15.22, 0.67715, 17, 90.02, 14.59, 0.32285, 1, 18, 29.96, 17.99, 1, 1, 18, 60.06, 18.36, 1, 1, 18, 85.82, 14.29, 1, 1, 18, 100.54, 6.76, 1, 1, 18, 104.63, -10.52, 1, 1, 18, 88.23, -14.4, 1, 1, 18, 58.82, -12.79, 1, 1, 18, 32, -12.61, 1, 2, 18, 7.34, -13.94, 0.84937, 17, 89.15, -15.36, 0.15063, 2, 18, -14.96, -16.74, 0.02405, 17, 66.89, -12.31, 0.97595, 1, 17, 38.46, -10.62, 1, 1, 17, 2.28, -15.05, 1, 1, 17, -7.13, -5.34, 1 ],
					"hull": 18,
					"edges": [ 18, 20, 20, 22, 22, 24, 24, 26, 26, 28, 28, 30, 30, 32, 32, 34, 34, 0, 0, 2, 2, 4, 4, 6, 6, 8, 8, 10, 10, 12, 12, 14, 16, 18, 14, 16 ],
					"width": 52,
					"height": 192
				}
			},
			"blue1-iris-1": {
				"blue1-iris-1": {
					"type": "mesh",
					"uvs": [ 1, 1, 0, 1, 0, 0, 1, 0 ],
					"triangles": [ 1, 2, 3, 1, 3, 0 ],
					"vertices": [ 143.65, -3.65, 134.07, 30.01, 175.43, 41.78, 185.01, 8.12 ],
					"hull": 4,
					"edges": [ 0, 2, 2, 4, 4, 6, 0, 6 ],
					"width": 35,
					"height": 43
				}
			},
			"blue1-iris-2": {
				"blue1-iris-2": {
					"type": "mesh",
					"uvs": [ 1, 1, 0, 1, 0, 0, 1, 0 ],
					"triangles": [ 1, 2, 3, 1, 3, 0 ],
					"vertices": [ 156.05, -94.74, 148.12, -66.84, 187.55, -55.62, 195.49, -83.51 ],
					"hull": 4,
					"edges": [ 0, 2, 2, 4, 4, 6, 0, 6 ],
					"width": 29,
					"height": 41
				}
			},
			"blue1-leg-1a": {
				"blue1-leg-1a": {
					"type": "mesh",
					"uvs": [ 0.49445, 0.04409, 0.59506, 0.21682, 0.53732, 0.32548, 0.68541, 0.31131, 0.82715, 0.36646, 0.92486, 0.50827, 0.97665, 0.64859, 1, 0.8322, 0.86364, 0.94864, 0.6708, 0.98334, 0.43474, 1, 0.21074, 0.93119, 0.03649, 0.8268, 0, 0.52065, 0.05374, 0.3032, 0, 0.23661, 0, 0.12253, 0.11679, 0.03221, 0.31733, 0, 0.24586, 0.56988, 0.41249, 0.63855, 0.6055, 0.66144, 0.79296, 0.66849 ],
					"triangles": [ 21, 2, 3, 22, 21, 3, 4, 22, 3, 20, 2, 21, 5, 22, 4, 22, 5, 6, 11, 12, 19, 11, 19, 20, 7, 8, 22, 7, 22, 6, 9, 21, 22, 9, 22, 8, 10, 20, 21, 10, 21, 9, 11, 20, 10, 14, 15, 16, 17, 14, 16, 2, 0, 1, 18, 14, 17, 2, 19, 18, 2, 18, 0, 19, 14, 18, 13, 14, 19, 20, 19, 2, 12, 13, 19 ],
					"vertices": [ 2, 7, 17.19, 35.69, 0.93119, 8, 24.7, 83.09, 0.06881, 2, 7, 39.42, 55.29, 0.78495, 8, 47.12, 63.72, 0.21505, 2, 7, 55.23, 46.52, 0.51759, 8, 40.56, 46.86, 0.48241, 2, 7, 51.04, 72.17, 0.11262, 8, 65.41, 54.48, 0.88738, 2, 7, 56.48, 97.54, 0.02461, 8, 91.28, 52.51, 0.97539, 2, 7, 74.51, 116.26, 0.00145, 8, 112.27, 37.18, 0.99855, 1, 8, 125.37, 20.29, 1, 1, 8, 134.93, -3.53, 1, 1, 8, 115.19, -24.45, 1, 1, 8, 83.32, -36.55, 1, 1, 8, 43.53, -47.89, 1, 2, 7, 143.44, -3.21, 0.06062, 8, 3.2, -47.25, 0.93938, 2, 7, 131.72, -34.83, 0.38822, 8, -29.71, -39.91, 0.61178, 2, 7, 90.18, -44.84, 0.92871, 8, -45.24, -0.1, 0.07129, 1, 7, 59.47, -38.06, 1, 2, 7, 51.13, -48.22, 1, 8, -53.87, 38.14, 0, 2, 7, 35.44, -49.58, 1, 8, -57.33, 53.49, 0, 2, 7, 21.26, -30.3, 0.99999, 8, -40.14, 70.15, 1.0E-5, 2, 7, 13.8, 4.28, 0.99877, 8, -6.88, 82.21, 0.00123, 1, 7, 93.23, -1.39, 1, 2, 7, 100.16, 28.48, 6.0E-5, 8, 28.76, -0.09, 0.99994, 2, 7, 100.39, 62.41, 0.00433, 8, 62.4, 4.26, 0.99567, 2, 7, 98.53, 95.17, 5.6E-4, 8, 94.62, 10.54, 0.99944 ],
					"hull": 19,
					"edges": [ 28, 26, 26, 24, 28, 30, 30, 32, 32, 34, 34, 36, 36, 0, 0, 2, 2, 4, 4, 6, 6, 8, 8, 10, 10, 12, 12, 14, 14, 16, 24, 22, 22, 20, 20, 18, 18, 16 ],
					"width": 175,
					"height": 138
				}
			},
			"blue1-leg-2a": {
				"blue1-leg-2a": {
					"type": "mesh",
					"uvs": [ 0.50071, 0.03769, 0.59762, 0.21282, 0.5322, 0.32804, 0.68861, 0.30253, 0.84829, 0.39079, 0.93709, 0.54093, 1, 0.74926, 0.96077, 0.9238, 0.73572, 0.97512, 0.50379, 1, 0.23443, 0.94611, 0.03371, 0.82082, 0, 0.56101, 0.05139, 0.32098, 0, 0.25504, 0, 0.1314, 0.09972, 0.04844, 0.2875, 0, 0.22434, 0.64673, 0.43479, 0.70195, 0.60606, 0.72035, 0.82378, 0.72219 ],
					"triangles": [ 19, 18, 2, 20, 2, 3, 20, 3, 4, 21, 20, 4, 19, 2, 20, 5, 21, 4, 21, 5, 6, 11, 12, 18, 7, 21, 6, 10, 18, 19, 11, 18, 10, 8, 20, 21, 8, 21, 7, 9, 19, 20, 9, 20, 8, 10, 19, 9, 13, 14, 15, 16, 13, 15, 2, 0, 1, 17, 13, 16, 17, 2, 13, 2, 17, 0, 2, 18, 13, 12, 13, 18 ],
					"vertices": [ 2, 10, 19.74, 40.43, 0.90653, 11, 27.92, 83.28, 0.09347, 2, 10, 42.84, 58.82, 0.76347, 11, 49.65, 63.29, 0.23653, 2, 10, 59.4, 48.35, 0.47292, 11, 41.87, 45.31, 0.52708, 2, 10, 54.24, 75.46, 0.08548, 11, 67.85, 54.59, 0.91452, 2, 10, 64.71, 104.09, 0.01018, 11, 97.75, 48.66, 0.98982, 2, 10, 84.45, 120.85, 5.0E-5, 11, 117.36, 31.74, 0.99995, 1, 11, 134.26, 6.01, 1, 1, 11, 132.69, -18.99, 1, 1, 11, 95.73, -34.32, 1, 1, 11, 56.81, -46.34, 1, 2, 10, 147.68, 1.48, 0.02404, 11, 9.17, -49.14, 0.97596, 2, 10, 132.54, -34.62, 0.39538, 11, -28.84, -39.75, 0.60462, 2, 10, 97.11, -42.67, 0.89322, 11, -42.26, -5.99, 0.10678, 1, 10, 63.5, -35.69, 1, 1, 10, 54.96, -45.22, 1, 1, 10, 37.93, -46.25, 1, 1, 10, 25.45, -29.52, 1, 2, 10, 16.8, 2.88, 0.99897, 11, -9.64, 80.39, 0.00103, 2, 10, 106.55, -2.77, 0.19627, 11, -1.38, -9.16, 0.80373, 1, 11, 36.23, -8.74, 1, 1, 11, 66.05, -4.82, 1, 1, 11, 103.33, 3.07, 1 ],
					"hull": 18,
					"edges": [ 30, 32, 32, 34, 34, 0, 0, 2, 2, 4, 4, 6, 6, 8, 8, 10, 10, 12, 12, 14, 14, 16, 16, 18, 18, 20, 20, 22, 22, 24, 24, 26, 28, 30, 26, 28 ],
					"width": 175,
					"height": 138
				}
			},
			"blue1-leg-2b": {
				"blue1-leg-2b": {
					"type": "mesh",
					"uvs": [ 0.71309, 0.11454, 0.91941, 0.33118, 0.97246, 0.4581, 0.96915, 0.92323, 0.82304, 1, 0.58521, 1, 0.40319, 0.93415, 0.40708, 0.66114, 0.3983, 0.56999, 0.38952, 0.47999, 0.34342, 0.36806, 0.20952, 0.24691, 0, 0.15806, 0, 0, 0.38695, 0, 0.96808, 0.67164, 0.9688, 0.57829 ],
					"triangles": [ 15, 2, 3, 3, 6, 7, 3, 7, 15, 5, 6, 3, 4, 5, 3, 12, 13, 14, 11, 12, 14, 11, 14, 0, 10, 11, 0, 10, 0, 1, 9, 10, 1, 9, 1, 2, 16, 8, 9, 2, 16, 9, 2, 15, 16, 7, 8, 16, 15, 7, 16 ],
					"vertices": [ 1, 9, 19.06, 28.99, 1, 1, 9, 56.27, 35.58, 1, 2, 9, 76.49, 34.11, 0.99311, 10, -30.9, 25.15, 0.00689, 1, 10, 41.56, 28.9, 1, 1, 10, 54.18, 17.6, 1, 1, 10, 55.26, -1.87, 1, 1, 10, 45.83, -17.34, 1, 2, 9, 93.65, -19.36, 0.42804, 10, 3.29, -19.38, 0.57196, 2, 9, 79.81, -16, 0.90069, 10, -10.87, -20.89, 0.09931, 2, 9, 66.15, -12.69, 0.99866, 10, -24.84, -22.39, 0.00134, 1, 9, 48.33, -11.34, 1, 1, 9, 27.09, -16.48, 1, 1, 9, 8.91, -29, 1, 1, 9, -14.73, -21.97, 1, 1, 9, -5.69, 8.44, 1, 2, 9, 108.32, 24.27, 0.37216, 10, 2.38, 26.64, 0.62784, 2, 9, 94.38, 28.48, 0.80534, 10, -12.16, 25.89, 0.19466 ],
					"hull": 15,
					"edges": [ 24, 26, 24, 22, 22, 20, 20, 18, 18, 16, 16, 14, 14, 12, 12, 10, 8, 10, 8, 6, 6, 30, 30, 32, 32, 4, 4, 2, 2, 0, 26, 28, 0, 28, 4, 6 ],
					"width": 82,
					"height": 156
				}
			},
			"blue1-leg-2b2": {
				"blue1-leg-2b": {
					"type": "mesh",
					"uvs": [ 0.71309, 0.11454, 0.91941, 0.33118, 0.97246, 0.4581, 0.96915, 0.92323, 0.82304, 1, 0.58521, 1, 0.40319, 0.93415, 0.40708, 0.66114, 0.3983, 0.56999, 0.38952, 0.47999, 0.34342, 0.36806, 0.20952, 0.24691, 0, 0.15806, 0, 0, 0.38695, 0, 0.96808, 0.67164, 0.9688, 0.57829 ],
					"triangles": [ 12, 13, 14, 11, 12, 14, 11, 14, 0, 10, 11, 0, 10, 0, 1, 9, 10, 1, 9, 1, 2, 16, 8, 9, 2, 16, 9, 2, 15, 16, 7, 8, 16, 15, 7, 16, 15, 2, 3, 3, 6, 7, 3, 7, 15, 5, 6, 3, 4, 5, 3 ],
					"vertices": [ 1, 6, 3.15, 20.23, 1, 1, 6, 39.87, 29.19, 1, 2, 7, -32.82, 20.05, 0.00128, 6, 60.14, 29.01, 0.99872, 1, 7, 39.52, 25.69, 1, 1, 7, 52.43, 14.72, 1, 1, 7, 54.01, -4.72, 1, 2, 7, 44.99, -20.43, 0.99879, 6, 122.13, -33.04, 0.00121, 2, 7, 2.52, -23.58, 0.35628, 6, 80.69, -23.24, 0.64372, 2, 7, -11.6, -25.45, 0.05424, 6, 66.66, -20.77, 0.94576, 2, 7, -25.53, -27.31, 3.1E-4, 6, 52.82, -18.35, 0.99969, 1, 6, 34.95, -18.14, 1, 1, 6, 14.08, -24.63, 1, 1, 6, -3.26, -38.29, 1, 1, 6, -27.3, -32.8, 1, 1, 6, -20.23, -1.86, 1, 2, 7, 0.41, 22.41, 0.6419, 6, 92.53, 21.24, 0.3581, 2, 7, -14.11, 21.28, 0.15381, 6, 78.35, 24.54, 0.84619 ],
					"hull": 15,
					"edges": [ 24, 26, 24, 22, 22, 20, 20, 18, 18, 16, 16, 14, 14, 12, 12, 10, 8, 10, 8, 6, 6, 30, 30, 32, 32, 4, 4, 2, 2, 0, 26, 28, 0, 28, 4, 6 ],
					"width": 82,
					"height": 156
				}
			},
			"blue1-lid-1": {
				"blue1-lid-1": {
					"type": "mesh",
					"uvs": [ 1, 1, 0, 1, 0, 0, 1, 0 ],
					"triangles": [ 1, 2, 3, 1, 3, 0 ],
					"vertices": [ 119.75, -0.06, 93.75, 91.31, 130.3, 101.72, 156.3, 10.34 ],
					"hull": 4,
					"edges": [ 0, 2, 2, 4, 4, 6, 0, 6 ],
					"width": 95,
					"height": 38
				}
			},
			"blue1-lid-2": {
				"blue1-lid-2": {
					"type": "mesh",
					"uvs": [ 1, 1, 0, 1, 0, 0, 1, 0 ],
					"triangles": [ 1, 2, 3, 1, 3, 0 ],
					"vertices": [ 143.12, -115.05, 120.4, -35.22, 135.79, -30.84, 158.51, -110.67 ],
					"hull": 4,
					"edges": [ 0, 2, 2, 4, 4, 6, 0, 6 ],
					"width": 83,
					"height": 16
				}
			},
			"blue1-smile": {
				"blue1-smile": { "x": 9.11, "y": 0.25, "rotation": -74.11, "width": 195, "height": 129 }
			},
			"blue2--smile": {
				"blue2--smile": { "x": 77.35, "y": -52.46, "rotation": -95.05, "width": 53, "height": 42 }
			},
			"blue2-body": {
				"blue2-body": {
					"type": "mesh",
					"uvs": [ 0.78889, 0.0141, 0.92019, 0.04907, 1, 0.12943, 1, 0.24068, 0.96307, 0.37311, 0.91104, 0.52426, 0.85191, 0.64784, 0.79298, 0.73794, 0.71331, 0.82309, 0.63695, 0.88921, 0.56889, 0.91815, 0.51122, 0.9493, 0.46106, 0.99343, 0.42762, 1, 0.34761, 0.97463, 0.27176, 0.91967, 0.2457, 0.82389, 0.18548, 0.78718, 0.14054, 0.71468, 0.14768, 0.64808, 0.10052, 0.62459, 0.04738, 0.56749, 0, 0.48073, 0, 0.3621, 0.0604, 0.23407, 0.17212, 0.13957, 0.29914, 0.06031, 0.42769, 0.0283, 0.58685, 0, 0.39939, 0.87694, 0.37482, 0.82944, 0.34302, 0.72723, 0.31267, 0.61783, 0.304, 0.49835, 0.32857, 0.33568, 0.40084, 0.20613, 0.57514, 0.74808, 0.65213, 0.55325, 0.7104, 0.37708, 0.72497, 0.2175 ],
					"triangles": [ 33, 34, 37, 21, 22, 33, 32, 33, 37, 20, 21, 33, 33, 19, 20, 6, 37, 5, 32, 19, 33, 36, 31, 32, 7, 37, 6, 37, 36, 32, 36, 37, 7, 18, 32, 31, 32, 18, 19, 17, 18, 31, 8, 36, 7, 16, 17, 31, 30, 31, 36, 16, 31, 30, 29, 30, 36, 9, 36, 8, 10, 29, 36, 9, 10, 36, 15, 16, 30, 15, 30, 29, 11, 29, 10, 14, 15, 29, 29, 13, 14, 11, 12, 29, 12, 13, 29, 35, 26, 27, 39, 28, 0, 39, 1, 2, 35, 25, 26, 34, 25, 35, 24, 25, 34, 2, 3, 39, 28, 35, 27, 39, 0, 1, 4, 39, 3, 23, 33, 22, 34, 23, 24, 34, 33, 23, 28, 39, 35, 38, 35, 39, 4, 38, 39, 5, 38, 4, 38, 34, 35, 37, 38, 5, 37, 34, 38 ],
					"vertices": [ 1, 23, 122.46, -54.59, 1, 2, 23, 115.25, -87.38, 0.99715, 22, 190.73, -87.02, 0.00285, 2, 23, 96.22, -107.97, 0.98514, 22, 171.77, -107.67, 0.01486, 2, 23, 68.66, -109.2, 0.95121, 22, 144.21, -108.99, 0.04879, 2, 23, 35.44, -101.56, 0.83267, 22, 110.97, -101.45, 0.16733, 2, 23, -2.58, -90.41, 0.54029, 22, 72.91, -90.41, 0.45971, 2, 23, -33.86, -77.19, 0.23419, 22, 41.6, -77.29, 0.76581, 2, 23, -56.83, -63.65, 0.07068, 22, 18.58, -63.83, 0.92932, 2, 23, -78.81, -44.94, 0.00472, 22, -3.46, -45.18, 0.99528, 1, 22, -20.74, -27.13, 1, 1, 22, -28.71, -10.68, 1, 1, 22, -37.12, 3.18, 1, 1, 22, -48.64, 15.02, 1, 1, 22, -50.66, 23.2, 1, 2, 23, -120.4, 43.62, 1.0E-5, 22, -45.33, 43.24, 0.99999, 2, 23, -107.63, 62.94, 0.00398, 22, -32.61, 62.61, 0.99602, 2, 23, -84.18, 70.44, 0.03673, 22, -9.19, 70.17, 0.96327, 2, 23, -75.76, 85.7, 0.08426, 22, -0.81, 85.47, 0.91574, 2, 23, -58.29, 97.6, 0.14791, 22, 16.62, 97.42, 0.85209, 2, 23, -41.71, 96.58, 0.25066, 22, 33.2, 96.45, 0.74934, 2, 23, -36.42, 108.48, 0.349, 22, 38.46, 108.36, 0.651, 2, 23, -22.86, 122.22, 0.44199, 22, 51.97, 122.15, 0.55801, 2, 23, -1.89, 134.88, 0.5355, 22, 72.9, 134.87, 0.4645, 2, 23, 27.5, 136.2, 0.63445, 22, 102.29, 136.28, 0.36555, 2, 23, 59.89, 122.72, 0.75202, 22, 134.72, 122.9, 0.24798, 2, 23, 84.54, 96.2, 0.87098, 22, 159.45, 96.47, 0.12902, 2, 23, 105.58, 65.74, 0.96228, 22, 180.59, 66.07, 0.03772, 2, 23, 114.94, 34.38, 0.99617, 22, 190.04, 34.73, 0.00383, 1, 23, 123.71, -4.58, 1, 2, 23, -95.63, 31.92, 5.0E-4, 22, -20.51, 31.63, 0.9995, 2, 23, -84.13, 38.52, 0.00531, 22, -9.04, 38.25, 0.99469, 2, 23, -59.16, 47.5, 0.04293, 22, 15.9, 47.31, 0.95707, 2, 23, -32.39, 56.2, 0.17324, 22, 42.64, 56.1, 0.82676, 2, 23, -2.89, 59.67, 0.43774, 22, 72.14, 59.66, 0.56226, 2, 23, 37.69, 55.42, 0.81208, 22, 112.72, 55.53, 0.18792, 2, 23, 70.58, 39.03, 0.96807, 22, 145.67, 39.25, 0.03193, 1, 22, 13.49, -10.2, 1, 2, 23, -12.63, -26.84, 0.2107, 22, 62.66, -26.88, 0.7893, 2, 23, 31.66, -39.26, 0.87024, 22, 106.99, -39.16, 0.12976, 2, 23, 71.36, -41.08, 0.98735, 22, 146.7, -40.86, 0.01265 ],
					"hull": 29,
					"edges": [ 46, 48, 48, 50, 50, 52, 52, 54, 54, 56, 56, 0, 0, 2, 2, 4, 44, 46, 44, 42, 42, 40, 40, 38, 38, 36, 36, 34, 34, 32, 32, 30, 30, 28, 28, 26, 26, 24, 24, 22, 22, 20, 20, 18, 18, 16, 16, 14, 14, 12, 12, 10, 10, 8, 4, 6, 8, 6 ],
					"width": 245,
					"height": 246
				}
			},
			"blue2-eye-1": {
				"blue2-eye-1": { "x": 155.37, "y": 46.56, "rotation": -95.05, "width": 84, "height": 100 }
			},
			"blue2-eye-2": {
				"blue2-eye-2": { "x": 157.77, "y": -45.51, "rotation": -95.05, "width": 111, "height": 97 }
			},
			"blue2-face": {
				"blue2-face": { "x": 100.69, "y": -9.85, "rotation": -95.05, "width": 264, "height": 243 }
			},
			"blue2-hand-1a": {
				"blue2-hand-1a": { "x": 33.19, "y": -13.04, "rotation": -62.62, "width": 117, "height": 127 }
			},
			"blue2-hand-1b": {
				"blue2-hand-1b": {
					"type": "mesh",
					"uvs": [ 0.49618, 0.08704, 0.4503, 0.16636, 0.43719, 0.26209, 0.4503, 0.36603, 0.50536, 0.27987, 0.63382, 0.24158, 0.74394, 0.16226, 0.91173, 0.15269, 1, 0.2826, 0.97335, 0.50799, 0.86936, 0.65867, 0.75659, 0.7452, 0.59499, 0.8527, 0.41583, 0.96387, 0.22965, 1, 0.08327, 0.93577, 0, 0.77926, 0, 0.54443, 0.05214, 0.37128, 0.12057, 0.20723, 0.19192, 0.08268, 0.30985, 0, 0.46403, 0, 0.46079, 0.47543, 0.44243, 0.61492 ],
					"triangles": [ 13, 14, 24, 12, 13, 24, 24, 14, 15, 23, 24, 15, 12, 24, 11, 24, 23, 11, 10, 11, 23, 23, 4, 5, 10, 23, 5, 10, 5, 9, 8, 9, 6, 6, 9, 5, 8, 6, 7, 23, 3, 4, 15, 16, 3, 19, 3, 18, 3, 17, 18, 3, 16, 17, 23, 15, 3, 19, 2, 3, 19, 20, 2, 2, 20, 1, 1, 20, 21, 1, 22, 0, 1, 21, 22 ],
					"vertices": [ 1, 25, 132.91, -24.93, 1, 2, 25, 116.61, -19.63, 0.99877, 24, 43.88, -76.55, 0.00123, 2, 25, 98.79, -21.18, 0.95599, 24, 54.93, -62.47, 0.04401, 2, 25, 80.64, -28, 0.57484, 24, 62.35, -44.56, 0.42516, 1, 24, 45.17, -53.05, 1, 1, 24, 20.16, -46.79, 1, 2, 25, 130.2, -74.66, 0.00643, 24, -5.58, -48.88, 0.99357, 1, 24, -34.52, -34.23, 1, 1, 24, -37.26, -4.89, 1, 1, 24, -11.96, 28.65, 1, 1, 24, 19.35, 42.76, 1, 1, 24, 46.21, 45.75, 1, 1, 24, 83.16, 47.38, 1, 1, 24, 123.39, 47.91, 1, 2, 25, -43.25, -13.1, 0.14682, 24, 157.85, 35.74, 0.85318, 2, 25, -38.08, 17.1, 0.60192, 24, 176.38, 11.33, 0.39808, 2, 25, -13.52, 39.32, 0.96937, 24, 175.83, -21.78, 0.03063, 1, 25, 28.8, 49.16, 1, 1, 25, 62.28, 46.62, 1, 1, 25, 94.83, 40.63, 1, 1, 25, 120.39, 32.44, 1, 1, 25, 140.45, 13.74, 1, 1, 25, 147.19, -15.24, 1, 2, 25, 61.38, -34.56, 0.35576, 24, 70.71, -26.01, 0.64424, 2, 25, 35.44, -36.96, 0.05689, 24, 86.68, -5.43, 0.94311 ],
					"hull": 23,
					"edges": [ 34, 36, 36, 38, 38, 40, 40, 42, 42, 44, 44, 0, 0, 2, 2, 4, 4, 6, 6, 46, 46, 48, 6, 8, 8, 10, 10, 12, 12, 14, 14, 16, 32, 34, 32, 30, 30, 28, 28, 26, 26, 24, 24, 22, 22, 20, 20, 18, 18, 16 ],
					"width": 191,
					"height": 183
				}
			},
			"blue2-hand-2a": {
				"blue2-hand-2a": { "x": 40.04, "y": -6.73, "rotation": 116.57, "width": 126, "height": 137 }
			},
			"blue2-hand-2b": {
				"blue2-hand-2b": {
					"type": "mesh",
					"uvs": [ 0.58059, 0.02952, 0.76376, 0.14191, 0.89604, 0.2892, 0.97236, 0.43224, 1, 0.57866, 0.95454, 0.73963, 0.86046, 0.87746, 0.70686, 1, 0.23454, 1, 0.38579, 0.80907, 0.30143, 0.66767, 0.21126, 0.53856, 0.11346, 0.39329, 0, 0.2925, 0, 0.17171, 0.14302, 0.06869, 0.34484, 0 ],
					"triangles": [ 13, 14, 15, 1, 12, 13, 15, 16, 0, 13, 15, 1, 1, 15, 0, 2, 12, 1, 11, 2, 3, 2, 11, 12, 11, 3, 4, 10, 11, 4, 5, 10, 4, 9, 10, 5, 6, 9, 5, 7, 9, 6, 8, 9, 7 ],
					"vertices": [ 1, 27, -9.02, 40.29, 1, 1, 27, 25.72, 50.31, 1, 1, 27, 65.95, 51.06, 1, 2, 28, -54.86, 12.72, 0.00314, 27, 102.44, 45.8, 0.99686, 2, 28, -21.3, 27.37, 0.32311, 27, 137.32, 34.61, 0.67689, 2, 28, 18.56, 34.47, 0.99206, 27, 171.92, 13.6, 0.00794, 1, 28, 54.83, 34, 1, 1, 28, 89.81, 25.27, 1, 1, 28, 108.22, -30.83, 1, 2, 28, 57.16, -27.69, 0.95112, 27, 159.81, -58.55, 0.04888, 2, 28, 26.99, -48.69, 0.45989, 27, 123.29, -54.38, 0.54011, 2, 28, -0.04, -69.42, 0.06922, 27, 89.3, -52.07, 0.93078, 2, 28, -30.6, -92.32, 1.1E-4, 27, 51.24, -49.06, 0.99989, 1, 27, 22.58, -52.21, 1, 1, 27, -5.06, -40.36, 1, 1, 27, -21.6, -13.82, 1, 1, 27, -27.38, 16.1, 1 ],
					"hull": 17,
					"edges": [ 28, 30, 30, 32, 32, 0, 0, 2, 2, 4, 4, 6, 26, 28, 26, 24, 24, 22, 22, 20, 20, 18, 18, 16, 14, 16, 14, 12, 12, 10, 10, 8, 8, 6 ],
					"width": 123,
					"height": 247
				}
			},
			"blue2-iris-1": {
				"blue2-iris-1": { "x": 149.91, "y": -32.26, "rotation": -95.05, "width": 26, "height": 37 }
			},
			"blue2-iris-2": {
				"blue2-iris-2": { "x": 150.14, "y": 55.56, "rotation": -95.05, "width": 23, "height": 34 }
			},
			"blue2-leg-1a": {
				"blue2-leg-1a": {
					"type": "mesh",
					"uvs": [ 0.74297, 0, 0.9953, 0.06101, 0.9936, 0.8402, 0.63149, 1, 0.39294, 1, 0, 0.92994, 0, 0.91528, 0.02792, 0.52622, 0.56561, 0 ],
					"triangles": [ 4, 5, 6, 4, 7, 8, 4, 6, 7, 3, 4, 8, 0, 2, 3, 2, 0, 1, 3, 8, 0 ],
					"vertices": [ 2, 31, 21.47, 6.87, 0.98585, 35, -26.64, -60.97, 0.01415, 2, 31, 27.06, 45.5, 0.7735, 35, -61.64, -43.7, 0.2265, 2, 31, 119.71, 49.27, 0.06344, 35, -36.54, 45.56, 0.93656, 2, 31, 141.1, -4.89, 0.0282, 35, 21.58, 49.13, 0.9718, 1, 35, 56.51, 39.41, 1, 1, 35, 111.82, 15.37, 1, 1, 35, 111.35, 13.69, 1, 2, 31, 88.75, -98.99, 0.00594, 35, 94.86, -29.77, 0.99406, 2, 31, 22.64, -20.06, 0.96706, 35, -0.67, -68.2, 0.03294 ],
					"hull": 9,
					"edges": [ 0, 16, 0, 2, 2, 4, 4, 6, 6, 8, 8, 10, 10, 12, 12, 14, 14, 16 ],
					"width": 150,
					"height": 117
				}
			},
			"blue2-leg-1b": {
				"blue2-leg-1b": {
					"type": "mesh",
					"uvs": [ 1, 0.14354, 0.75512, 0.26757, 0.62512, 0.41856, 0.60692, 0.51697, 0.59652, 0.62348, 0.59912, 0.77177, 0.58872, 1, 0, 1, 0, 0.75786, 0, 0.59017, 0, 0.43788, 0.07792, 0.29414, 0.25282, 0.13159, 0.50362, 0, 1, 0 ],
					"triangles": [ 8, 9, 4, 8, 4, 5, 7, 8, 5, 6, 7, 5, 13, 14, 0, 1, 13, 0, 12, 13, 1, 2, 12, 1, 11, 12, 2, 10, 11, 2, 3, 10, 2, 9, 10, 3, 4, 9, 3 ],
					"vertices": [ 1, 30, 3.91, 20.77, 1, 1, 30, 25.97, 11.43, 1, 2, 30, 48.29, 10.9, 0.99654, 31, -24.67, 20.71, 0.00346, 2, 30, 61.04, 14.86, 0.88033, 31, -11.34, 20.01, 0.11967, 2, 30, 74.58, 19.74, 0.38363, 31, 3.06, 19.91, 0.61637, 2, 30, 92.98, 27.64, 0.0093, 31, 23.05, 20.96, 0.9907, 1, 31, 53.87, 21.57, 1, 1, 31, 55.66, -19.6, 1, 2, 30, 107.44, -11.77, 0.00397, 31, 23, -21.02, 0.99603, 2, 30, 86.56, -20.51, 0.45823, 31, 0.38, -22, 0.54177, 2, 30, 67.59, -28.45, 0.96888, 31, -20.16, -22.9, 0.03112, 1, 30, 47.59, -30.91, 1, 1, 30, 22.62, -28.09, 1, 1, 30, -0.55, -18.76, 1, 1, 30, -13.97, 13.29, 1 ],
					"hull": 15,
					"edges": [ 14, 16, 16, 18, 18, 20, 20, 22, 22, 24, 26, 28, 24, 26, 12, 14, 12, 10, 10, 8, 8, 6, 6, 4, 4, 2, 0, 28, 2, 0 ],
					"width": 68,
					"height": 133
				}
			},
			"blue2-leg-2a": {
				"blue2-leg-2a": {
					"type": "mesh",
					"uvs": [ 0.87176, 0.1041, 0.82977, 0.19635, 0.94237, 0.32128, 1, 0.59228, 0.81642, 0.77872, 0.6362, 0.88165, 0.38279, 0.96263, 0.14035, 1, 0.02217, 0.93564, 0, 0.75275, 0.04167, 0.54875, 0.1882, 0.41637, 0.34336, 0.37947, 0.24556, 0.2984, 0.34038, 0.11393, 0.53791, 0.01627, 0.77443, 0, 0.19062, 0.7377, 0.40515, 0.62123, 0.62304, 0.54696, 0.79232, 0.46425 ],
					"triangles": [ 20, 2, 3, 20, 19, 1, 1, 19, 12, 1, 12, 15, 20, 1, 2, 1, 15, 16, 13, 14, 12, 12, 14, 15, 1, 16, 0, 5, 19, 4, 6, 7, 17, 7, 8, 17, 6, 18, 5, 6, 17, 18, 8, 9, 17, 18, 19, 5, 9, 10, 17, 10, 11, 17, 18, 11, 12, 18, 17, 11, 4, 20, 3, 18, 12, 19, 19, 20, 4 ],
					"vertices": [ 1, 33, 47.41, 54.97, 1, 1, 33, 57.64, 44.96, 1, 2, 34, -57.44, 2.06, 0.264, 33, 79.62, 54.06, 0.736, 2, 34, -41.38, 37.68, 0.91211, 33, 118.35, 48.85, 0.08789, 1, 34, -4.8, 43.39, 1, 2, 34, 24.41, 39.91, 0.79646, 33, 139.3, -13.55, 0.20354, 2, 34, 60.16, 27.77, 0.99952, 33, 137.89, -51.28, 4.8E-4, 1, 34, 91.01, 11.6, 1, 1, 34, 99.14, -5.66, 1, 2, 34, 86.38, -28.29, 0.99809, 33, 91.67, -92.44, 0.00191, 2, 34, 64.57, -47.95, 0.95445, 33, 66.59, -77.15, 0.04555, 2, 34, 36.74, -50.64, 0.80006, 33, 56.06, -51.26, 0.19994, 2, 34, 15.92, -41.77, 0.32401, 33, 58.6, -28.77, 0.67599, 2, 34, 20.32, -59.21, 0.07194, 33, 43.15, -37.98, 0.92806, 2, 34, -5.94, -72.17, 0.00226, 33, 23.22, -16.52, 0.99774, 1, 33, 19.74, 14.54, 1, 1, 33, 28.93, 46.92, 1, 2, 34, 63.33, -13.95, 0.99404, 33, 98.81, -66.25, 0.00596, 2, 34, 29.06, -9.11, 0.94693, 33, 93.65, -32.03, 0.05307, 2, 34, -2.06, 0.8, 0.44038, 33, 94.25, 0.63, 0.55962, 2, 34, -28.33, 5.66, 0.264, 33, 91.39, 27.2, 0.736 ],
					"hull": 17,
					"edges": [ 24, 22, 22, 20, 20, 18, 18, 16, 16, 14, 14, 12, 12, 10, 10, 8, 8, 6, 6, 4, 4, 2, 2, 0, 0, 32, 32, 30, 30, 28, 28, 26, 26, 24 ],
					"width": 140,
					"height": 139
				}
			},
			"blue2-leg-2b": {
				"blue2-leg-2b": {
					"type": "mesh",
					"uvs": [ 0.88805, 0.08279, 0.71308, 0.20474, 0.64747, 0.35432, 0.66934, 0.43236, 0.70579, 0.5104, 0.8115, 0.66649, 1, 0.8616, 1, 1, 0.40689, 1, 0.19183, 0.75592, 0.05271, 0.57524, 2.1E-4, 0.45949, 0.00621, 0.35445, 0.06397, 0.22922, 0.17865, 0.09509, 0.36852, 0, 0.67299, 0 ],
					"triangles": [ 9, 4, 5, 6, 8, 9, 6, 9, 5, 8, 6, 7, 1, 16, 0, 15, 1, 14, 1, 15, 16, 1, 13, 14, 2, 13, 1, 12, 13, 2, 11, 2, 3, 2, 11, 12, 10, 3, 4, 10, 11, 3, 9, 10, 4 ],
					"vertices": [ 1, 32, 6.6, 24.41, 1, 1, 32, 24.02, 14.32, 1, 1, 32, 44.97, 11.18, 1, 2, 32, 55.74, 13.01, 0.99995, 33, -25.73, 24.6, 5.0E-5, 2, 32, 66.48, 15.75, 0.96659, 33, -14.76, 23.07, 0.03341, 2, 32, 87.87, 23.26, 0.28909, 33, 7.88, 21.91, 0.71091, 1, 33, 37.35, 23.74, 1, 1, 33, 55.46, 17.24, 1, 1, 33, 43.03, -17.37, 1, 2, 32, 101.98, -14.58, 0.12531, 33, 6.6, -18.46, 0.87469, 2, 32, 77.28, -24.3, 0.97149, 33, -19.95, -18.09, 0.02851, 1, 32, 61.35, -28.27, 1, 1, 32, 46.74, -28.54, 1, 1, 32, 29.2, -25.74, 1, 1, 32, 10.26, -19.46, 1, 1, 32, -3.47, -8.28, 1, 1, 32, -4.3, 10.58, 1 ],
					"hull": 17,
					"edges": [ 30, 28, 28, 26, 26, 24, 24, 22, 22, 20, 20, 18, 14, 16, 18, 16, 14, 12, 12, 10, 10, 8, 8, 6, 6, 4, 4, 2, 2, 0, 30, 32, 0, 32 ],
					"width": 62,
					"height": 137
				}
			},
			"light-1": {
				"light-1": { "x": 301.95, "y": 704.08, "width": 449, "height": 506 }
			},
			"light-2": {
				"light-2": { "x": 301.95, "y": 389.08, "width": 449, "height": 506 }
			},
			"mirror": {
				"mirror": { "x": 324.45, "y": 619.58, "width": 632, "height": 1075 }
			},
			"mouth": {
				"mouth": {
					"x": 33.97,
					"y": -74.7,
					"scaleX": 1.8077,
					"scaleY": 1.8077,
					"rotation": -91.02,
					"width": 27,
					"height": 22
				}
			},
			"shadow": {
				"shadow": {
					"type": "mesh",
					"uvs": [ 1, 1, 0, 1, 0, 0, 1, 0 ],
					"triangles": [ 1, 2, 3, 1, 3, 0 ],
					"vertices": [ -13.55, 138.08, -501.55, 138.08, -501.55, 227.08, -13.55, 227.08 ],
					"hull": 4,
					"edges": [ 0, 2, 2, 4, 4, 6, 0, 6 ],
					"width": 488,
					"height": 89
				}
			}
		}
	}
],
"animations": {
	"finish": {
		"slots": {
			"mouth": {
				"attachment": [
					{ "time": 0.0333, "name": null }
				]
			}
		},
		"bones": {
			"blue1-hand-1b2": {
				"rotate": [
					{ "curve": 0.25, "c3": 0.75 },
					{ "time": 0.5, "angle": 29.64, "curve": 0.25, "c3": 0.75 },
					{ "time": 1, "curve": 0.25, "c3": 0.75 },
					{ "time": 1.5, "angle": 29.64, "curve": 0.25, "c3": 0.75 },
					{ "time": 2, "curve": 0.25, "c3": 0.75 },
					{ "time": 2.5, "angle": 29.64 }
				]
			},
			"blue1-hand-2b": {
				"rotate": [
					{ "angle": -2.15, "curve": 0.375, "c2": 0.62, "c3": 0.716 },
					{ "time": 0.1, "angle": -3.18, "curve": 0.25, "c3": 0.75 },
					{ "time": 0.6, "angle": 4.74, "curve": 0.243, "c3": 0.68, "c4": 0.71 },
					{ "time": 1, "angle": -2.15, "curve": 0.375, "c2": 0.62, "c3": 0.716 },
					{ "time": 1.1, "angle": -3.18, "curve": 0.25, "c3": 0.75 },
					{ "time": 1.6, "angle": 4.74, "curve": 0.243, "c3": 0.68, "c4": 0.71 },
					{ "time": 2, "angle": -2.15, "curve": 0.375, "c2": 0.62, "c3": 0.716 },
					{ "time": 2.1, "angle": -3.18, "curve": 0.25, "c3": 0.75 },
					{ "time": 2.6, "angle": 4.74 }
				]
			},
			"blue1-hand-2b2": {
				"rotate": [
					{ "angle": -0.3, "curve": 0.349, "c2": 0.39, "c3": 0.689, "c4": 0.74 },
					{ "time": 0.1, "angle": -2.15, "curve": 0.375, "c2": 0.62, "c3": 0.716 },
					{ "time": 0.2, "angle": -3.18, "curve": 0.25, "c3": 0.75 },
					{ "time": 0.7, "angle": 4.74, "curve": 0.245, "c3": 0.637, "c4": 0.56 },
					{ "time": 1, "angle": -0.3, "curve": 0.349, "c2": 0.39, "c3": 0.689, "c4": 0.74 },
					{ "time": 1.1, "angle": -2.15, "curve": 0.375, "c2": 0.62, "c3": 0.716 },
					{ "time": 1.2, "angle": -3.18, "curve": 0.25, "c3": 0.75 },
					{ "time": 1.7, "angle": 4.74, "curve": 0.245, "c3": 0.637, "c4": 0.56 },
					{ "time": 2, "angle": -0.3, "curve": 0.349, "c2": 0.39, "c3": 0.689, "c4": 0.74 },
					{ "time": 2.1, "angle": -2.15, "curve": 0.375, "c2": 0.62, "c3": 0.716 },
					{ "time": 2.2, "angle": -3.18, "curve": 0.25, "c3": 0.75 },
					{ "time": 2.7, "angle": 4.74 }
				]
			},
			"blue1-body3": {
				"rotate": [
					{ "angle": 3.27, "curve": 0.382, "c2": 0.57, "c3": 0.735 },
					{ "time": 0.1667, "angle": 7.8, "curve": 0.25, "c3": 0.75 },
					{ "time": 0.6667, "angle": -8.18, "curve": 0.243, "c3": 0.649, "c4": 0.6 },
					{ "time": 1, "angle": 3.27, "curve": 0.382, "c2": 0.57, "c3": 0.735 },
					{ "time": 1.1667, "angle": 7.8, "curve": 0.25, "c3": 0.75 },
					{ "time": 1.6667, "angle": -8.18, "curve": 0.243, "c3": 0.649, "c4": 0.6 },
					{ "time": 2, "angle": 3.27, "curve": 0.382, "c2": 0.57, "c3": 0.735 },
					{ "time": 2.1667, "angle": 7.8, "curve": 0.25, "c3": 0.75 },
					{ "time": 2.6667, "angle": -8.18 }
				],
				"translate": [
					{ "x": -11.01, "y": -6.26, "curve": 0.382, "c2": 0.57, "c3": 0.735 },
					{ "time": 0.1667, "x": -5.31, "y": -9.89, "curve": 0.25, "c3": 0.75 },
					{ "time": 0.6667, "x": -25.38, "y": 2.91, "curve": 0.243, "c3": 0.649, "c4": 0.6 },
					{ "time": 1, "x": -11.01, "y": -6.26, "curve": 0.382, "c2": 0.57, "c3": 0.735 },
					{ "time": 1.1667, "x": -5.31, "y": -9.89, "curve": 0.25, "c3": 0.75 },
					{ "time": 1.6667, "x": -25.38, "y": 2.91, "curve": 0.243, "c3": 0.649, "c4": 0.6 },
					{ "time": 2, "x": -11.01, "y": -6.26, "curve": 0.382, "c2": 0.57, "c3": 0.735 },
					{ "time": 2.1667, "x": -5.31, "y": -9.89, "curve": 0.25, "c3": 0.75 },
					{ "time": 2.6667, "x": -25.38, "y": 2.91 }
				]
			},
			"blue1-hand-2b3": {
				"rotate": [
					{ "angle": 1.8, "curve": 0.33, "c2": 0.32, "c3": 0.67, "c4": 0.68 },
					{ "time": 0.1, "angle": -0.3, "curve": 0.349, "c2": 0.39, "c3": 0.689, "c4": 0.74 },
					{ "time": 0.2, "angle": -2.15, "curve": 0.375, "c2": 0.62, "c3": 0.716 },
					{ "time": 0.3, "angle": -3.18, "curve": 0.25, "c3": 0.75 },
					{ "time": 0.8, "angle": 4.74, "curve": 0.258, "c3": 0.619, "c4": 0.45 },
					{ "time": 1, "angle": 1.8, "curve": 0.33, "c2": 0.32, "c3": 0.67, "c4": 0.68 },
					{ "time": 1.1, "angle": -0.3, "curve": 0.349, "c2": 0.39, "c3": 0.689, "c4": 0.74 },
					{ "time": 1.2, "angle": -2.15, "curve": 0.375, "c2": 0.62, "c3": 0.716 },
					{ "time": 1.3, "angle": -3.18, "curve": 0.25, "c3": 0.75 },
					{ "time": 1.8, "angle": 4.74, "curve": 0.258, "c3": 0.619, "c4": 0.45 },
					{ "time": 2, "angle": 1.8, "curve": 0.33, "c2": 0.32, "c3": 0.67, "c4": 0.68 },
					{ "time": 2.1, "angle": -0.3, "curve": 0.349, "c2": 0.39, "c3": 0.689, "c4": 0.74 },
					{ "time": 2.2, "angle": -2.15, "curve": 0.375, "c2": 0.62, "c3": 0.716 },
					{ "time": 2.3, "angle": -3.18, "curve": 0.25, "c3": 0.75 },
					{ "time": 2.8, "angle": 4.74 }
				]
			},
			"bone": {
				"translate": [
					{ "curve": 0.25, "c3": 0.75 },
					{ "time": 0.5, "y": -6.68, "curve": 0.25, "c3": 0.75 },
					{ "time": 1, "curve": 0.25, "c3": 0.75 },
					{ "time": 1.5, "y": -6.68, "curve": 0.25, "c3": 0.75 },
					{ "time": 2, "curve": 0.25, "c3": 0.75 },
					{ "time": 2.5, "y": -6.68 }
				]
			},
			"blue1-hand-1b": {
				"rotate": [
					{ "curve": 0.25, "c3": 0.75 },
					{ "time": 0.5, "angle": 9.73, "curve": 0.25, "c3": 0.75 },
					{ "time": 1, "curve": 0.25, "c3": 0.75 },
					{ "time": 1.5, "angle": 9.73, "curve": 0.25, "c3": 0.75 },
					{ "time": 2, "curve": 0.25, "c3": 0.75 },
					{ "time": 2.5, "angle": 9.73 }
				]
			},
			"blue1-face": {
				"rotate": [
					{ "angle": 4.08, "curve": "stepped" },
					{ "time": 1, "angle": 4.08, "curve": 0.25, "c3": 0.75 },
					{ "time": 1.3333, "angle": -5.51, "curve": "stepped" },
					{ "time": 2.1667, "angle": -5.51, "curve": 0.25, "c3": 0.75 },
					{ "time": 2.7, "angle": 4.08 }
				],
				"translate": [
					{ "curve": 0.25, "c3": 0.75 },
					{ "time": 0.0667, "x": -30.68, "y": -12.62, "curve": 0.25, "c3": 0.75 },
					{ "time": 0.2, "curve": "stepped" },
					{ "time": 1.3333, "curve": 0.25, "c3": 0.75 },
					{ "time": 1.4333, "x": -16.27, "y": -0.34, "curve": 0.25, "c3": 0.75 },
					{ "time": 1.5667, "curve": 0.25, "c3": 0.75 },
					{ "time": 1.6667, "x": -16.27, "y": -0.34, "curve": 0.25, "c3": 0.75 },
					{ "time": 1.7667, "curve": 0.25, "c3": 0.75 },
					{ "time": 1.9, "x": -16.27, "y": -0.34, "curve": 0.25, "c3": 0.75 },
					{ "time": 2, "curve": "stepped" },
					{ "time": 2.1667, "curve": 0.25, "c3": 0.75 },
					{ "time": 2.7, "x": -25.67, "y": -46.72 }
				]
			},
			"blue1-smile": {
				"translate": [
					{ "x": -3.19, "y": -38.39, "curve": 0.25, "c3": 0.75 },
					{ "time": 0.1667, "x": -14.13, "y": 4.19 }
				],
				"scale": [
					{ "x": 0, "y": 0, "curve": 0.25, "c3": 0.75 },
					{ "time": 0.1667 }
				]
			},
			"blue2-body": {
				"translate": [
					{ "curve": 0.25, "c3": 0.75 },
					{ "time": 0.5, "y": -3.93, "curve": 0.25, "c3": 0.75 },
					{ "time": 1, "curve": 0.25, "c3": 0.75 },
					{ "time": 1.5, "y": -3.93, "curve": 0.25, "c3": 0.75 },
					{ "time": 2, "curve": 0.25, "c3": 0.75 },
					{ "time": 2.5, "y": -3.93 }
				]
			},
			"blue2-hand-1b2": {
				"rotate": [
					{ "angle": 15.42, "curve": 0.25, "c3": 0.75 },
					{ "time": 0.5, "angle": 3.74, "curve": 0.25, "c3": 0.75 },
					{ "time": 1, "angle": 15.42, "curve": 0.25, "c3": 0.75 },
					{ "time": 1.5, "angle": 3.74, "curve": 0.25, "c3": 0.75 },
					{ "time": 2, "angle": 15.42, "curve": 0.25, "c3": 0.75 },
					{ "time": 2.5, "angle": 3.74 }
				]
			},
			"blue2-body3": {
				"rotate": [
					{ "angle": -0.28, "curve": 0.366, "c2": 0.63, "c3": 0.703 },
					{ "time": 0.0667, "curve": 0.25, "c3": 0.75 },
					{ "time": 0.5667, "angle": -4.04, "curve": 0.25, "c3": 0.75 },
					{ "time": 1.0667, "curve": 0.25, "c3": 0.75 },
					{ "time": 1.5667, "angle": -4.04, "curve": 0.25, "c3": 0.75 },
					{ "time": 2.0667, "curve": 0.25, "c3": 0.75 },
					{ "time": 2.5667, "angle": -4.04 }
				],
				"translate": [
					{ "x": -12.65, "y": -0.46, "curve": 0.366, "c2": 0.63, "c3": 0.703 },
					{ "time": 0.0667, "x": -14.08, "y": -0.68, "curve": 0.25, "c3": 0.75 },
					{ "time": 0.5667, "x": 6.39, "y": 2.48, "curve": 0.25, "c3": 0.75 },
					{ "time": 1.0667, "x": -14.08, "y": -0.68, "curve": 0.25, "c3": 0.75 },
					{ "time": 1.5667, "x": 6.39, "y": 2.48, "curve": 0.25, "c3": 0.75 },
					{ "time": 2.0667, "x": -14.08, "y": -0.68, "curve": 0.25, "c3": 0.75 },
					{ "time": 2.5667, "x": 6.39, "y": 2.48 }
				]
			},
			"blue2-hand-2b": {
				"rotate": [
					{ "angle": -8.34, "curve": 0.25, "c3": 0.75 },
					{ "time": 0.5, "angle": -2.47, "curve": 0.25, "c3": 0.75 },
					{ "time": 1, "angle": -8.34, "curve": 0.25, "c3": 0.75 },
					{ "time": 1.5, "angle": -2.47, "curve": 0.25, "c3": 0.75 },
					{ "time": 2, "angle": -8.34, "curve": 0.25, "c3": 0.75 },
					{ "time": 2.5, "angle": -2.47 }
				]
			},
			"blue2-hand-2b2": {
				"rotate": [
					{ "angle": -8.34, "curve": 0.25, "c3": 0.75 },
					{ "time": 0.5, "angle": -2.47, "curve": 0.25, "c3": 0.75 },
					{ "time": 1, "angle": -8.34, "curve": 0.25, "c3": 0.75 },
					{ "time": 1.5, "angle": -2.47, "curve": 0.25, "c3": 0.75 },
					{ "time": 2, "angle": -8.34, "curve": 0.25, "c3": 0.75 },
					{ "time": 2.5, "angle": -2.47 }
				]
			}
		},
		"deform": {
			"default": {
				"blue1-iris-1": {
					"blue1-iris-1": [
						{ "curve": "stepped" },
						{ "time": 1, "curve": 0.25, "c3": 0.75 },
						{
							"time": 1.3333,
							"vertices": [ -11.95795, -10.32257, -11.95792, -10.32257, -11.95789, -10.32257, -11.95792, -10.3226 ]
						}
					]
				},
				"blue1-iris-2": {
					"blue1-iris-2": [
						{ "curve": "stepped" },
						{ "time": 1, "curve": 0.25, "c3": 0.75 },
						{
							"time": 1.3333,
							"vertices": [ -3.15103, -13.68253, -3.15097, -13.6825, -3.15097, -13.68253, -3.15094, -13.68253 ]
						}
					]
				},
				"blue1-lid-1": {
					"blue1-lid-1": [
						{ "curve": 0.25, "c3": 0.75 },
						{
							"time": 0.2,
							"vertices": [ -12.45172, 15.8667, -5.27319, -9.35757, -15.36298, -12.229, -22.54138, 12.9953 ],
							"curve": 0.25,
							"c3": 0.75
						},
						{
							"time": 1.1667,
							"vertices": [ -12.4519, 15.86658, -5.27338, -9.3577, -15.36316, -12.22913, -22.54156, 12.99518 ],
							"curve": 0.25,
							"c3": 0.75
						},
						{ "time": 1.5333 }
					]
				},
				"blue1-lid-2": {
					"blue1-lid-2": [
						{ "curve": 0.25, "c3": 0.75 },
						{
							"time": 0.2,
							"vertices": [ -6.32513, 6.17975, -0.48437, -14.34393, -4.44061, -15.46985, -10.28137, 5.05386 ],
							"curve": 0.25,
							"c3": 0.75
						},
						{
							"time": 1.1667,
							"vertices": [ -6.32532, 6.17963, -0.48456, -14.34406, -4.4408, -15.46997, -10.28156, 5.05374 ],
							"curve": 0.25,
							"c3": 0.75
						},
						{ "time": 1.5333 }
					]
				},
				"blue2-body": {
					"blue2-body": [
						{ "curve": 0.25, "c3": 0.75 },
						{
							"time": 0.5,
							"offset": 52,
							"vertices": [ 3.34485, -1.80798, 3.34998, -1.79764, 4.64752, -1.74942, 4.6524, -1.73505, 4.05463, -3.08139, 4.06372, -3.06885, 3.22784, 0.79752, 3.22491, 0.8075, 5.80408, 1.56573, 5.79861, 1.58368, 12.72473, 9.7081, 12.69406, 9.74744, 12.33636, 3.8168, 12.32416, 3.85501, 12.33636, 3.8168, 12.32416, 3.85501, 12.33636, 3.8168, 12.32416, 3.85501, 5.68707, 4.17099, 5.67374, 4.18863, 6.0E-5, -3.0E-5, 0, -3.0E-5, 6.0E-5, -3.0E-5, 0, -3.0E-5, 6.0E-5, -3.0E-5, 6.0E-5, -3.0E-5, 0, -3.0E-5, 10.71429, -7.97211, 10.35846, -8.15308, 6.19781, -11.85828, 5.69794, -12.00497, 5.32727, -8.35983, 4.87723, -8.50421, 12.33636, 3.8168, 12.32416, 3.85501, 12.33636, 3.8168, 12.32416, 3.85501, 12.33636, 3.8168, 12.32416, 3.85501, 0.48569, -0.44147, 12.33636, 3.8168, 12.32416, 3.85501, 12.33636, 3.8168, 12.32416, 3.85501, 12.33636, 3.8168, 12.32416, 3.85501 ],
							"curve": 0.25,
							"c3": 0.75
						},
						{ "time": 1, "curve": 0.25, "c3": 0.75 },
						{
							"time": 1.5,
							"offset": 52,
							"vertices": [ 3.34485, -1.80798, 3.34998, -1.79764, 4.64752, -1.74942, 4.6524, -1.73505, 4.05463, -3.08139, 4.06372, -3.06885, 3.22784, 0.79752, 3.22491, 0.8075, 5.80408, 1.56573, 5.79861, 1.58368, 12.72473, 9.7081, 12.69406, 9.74744, 12.33636, 3.8168, 12.32416, 3.85501, 12.33636, 3.8168, 12.32416, 3.85501, 12.33636, 3.8168, 12.32416, 3.85501, 5.68707, 4.17099, 5.67374, 4.18863, 6.0E-5, -3.0E-5, 0, -3.0E-5, 6.0E-5, -3.0E-5, 0, -3.0E-5, 6.0E-5, -3.0E-5, 6.0E-5, -3.0E-5, 0, -3.0E-5, 10.71429, -7.97211, 10.35846, -8.15308, 6.19781, -11.85828, 5.69794, -12.00497, 5.32727, -8.35983, 4.87723, -8.50421, 12.33636, 3.8168, 12.32416, 3.85501, 12.33636, 3.8168, 12.32416, 3.85501, 12.33636, 3.8168, 12.32416, 3.85501, 0.48569, -0.44147, 12.33636, 3.8168, 12.32416, 3.85501, 12.33636, 3.8168, 12.32416, 3.85501, 12.33636, 3.8168, 12.32416, 3.85501 ],
							"curve": 0.25,
							"c3": 0.75
						},
						{ "time": 2, "curve": 0.25, "c3": 0.75 },
						{
							"time": 2.5,
							"offset": 52,
							"vertices": [ 3.34485, -1.80798, 3.34998, -1.79764, 4.64752, -1.74942, 4.6524, -1.73505, 4.05463, -3.08139, 4.06372, -3.06885, 3.22784, 0.79752, 3.22491, 0.8075, 5.80408, 1.56573, 5.79861, 1.58368, 12.72473, 9.7081, 12.69406, 9.74744, 12.33636, 3.8168, 12.32416, 3.85501, 12.33636, 3.8168, 12.32416, 3.85501, 12.33636, 3.8168, 12.32416, 3.85501, 5.68707, 4.17099, 5.67374, 4.18863, 6.0E-5, -3.0E-5, 0, -3.0E-5, 6.0E-5, -3.0E-5, 0, -3.0E-5, 6.0E-5, -3.0E-5, 6.0E-5, -3.0E-5, 0, -3.0E-5, 10.71429, -7.97211, 10.35846, -8.15308, 6.19781, -11.85828, 5.69794, -12.00497, 5.32727, -8.35983, 4.87723, -8.50421, 12.33636, 3.8168, 12.32416, 3.85501, 12.33636, 3.8168, 12.32416, 3.85501, 12.33636, 3.8168, 12.32416, 3.85501, 0.48569, -0.44147, 12.33636, 3.8168, 12.32416, 3.85501, 12.33636, 3.8168, 12.32416, 3.85501, 12.33636, 3.8168, 12.32416, 3.85501 ]
						}
					]
				},
				"blue2-hand-1b": {
					"blue2-hand-1b": [
						{
							"offset": 10,
							"vertices": [ -5.25757, -0.83185, 1.70404, 5.04147, 6.63458, -2.02869, 5.21393, -2.40991 ],
							"curve": 0.25,
							"c3": 0.75
						},
						{
							"time": 0.5,
							"offset": 10,
							"vertices": [ 13.39941, 6.84277, -4.18872, -14.25314, -3.09753, -20.52933, -7.75806, -22.10287, 5.32458, 1.93521, -1.87897, -5.34476, 0, 0, 0, 0, 0, 0, -1.24695, 3.539, -1.62604, 9.39655, 2.66577, 15.79459, 5.04248, 8.73807 ],
							"curve": 0.25,
							"c3": 0.75
						},
						{
							"time": 1,
							"offset": 10,
							"vertices": [ -5.25757, -0.83185, 1.70404, 5.04147, 6.63458, -2.02869, 5.21393, -2.40991 ],
							"curve": 0.25,
							"c3": 0.75
						},
						{
							"time": 1.5,
							"offset": 10,
							"vertices": [ 13.39941, 6.84277, -4.18872, -14.25314, -3.09753, -20.52933, -7.75806, -22.10287, 5.32458, 1.93521, -1.87897, -5.34476, 0, 0, 0, 0, 0, 0, -1.24695, 3.539, -1.62604, 9.39655, 2.66577, 15.79459, 5.04248, 8.73807 ],
							"curve": 0.25,
							"c3": 0.75
						},
						{
							"time": 2,
							"offset": 10,
							"vertices": [ -5.25757, -0.83185, 1.70404, 5.04147, 6.63458, -2.02869, 5.21393, -2.40991 ],
							"curve": 0.25,
							"c3": 0.75
						},
						{
							"time": 2.5,
							"offset": 10,
							"vertices": [ 13.39941, 6.84277, -4.18872, -14.25314, -3.09753, -20.52933, -7.75806, -22.10287, 5.32458, 1.93521, -1.87897, -5.34476, 0, 0, 0, 0, 0, 0, -1.24695, 3.539, -1.62604, 9.39655, 2.66577, 15.79459, 5.04248, 8.73807 ]
						}
					]
				},
				"shadow": {
					"shadow": [
						{
							"vertices": [ -17.21417, 3.13947, 17.21417, 3.13947, 17.21417, -3.13947, -17.21417, -3.13947 ],
							"curve": 0.25,
							"c3": 0.75
						},
						{
							"time": 0.5,
							"vertices": [ -2.44, 0.44499, 2.44, 0.44499, 2.44, -0.44499, -2.44, -0.44499 ],
							"curve": 0.25,
							"c3": 0.75
						},
						{
							"time": 1,
							"vertices": [ -17.21417, 3.13947, 17.21417, 3.13947, 17.21417, -3.13947, -17.21417, -3.13947 ],
							"curve": 0.25,
							"c3": 0.75
						},
						{
							"time": 1.5,
							"vertices": [ -2.44, 0.44499, 2.44, 0.44499, 2.44, -0.44499, -2.44, -0.44499 ],
							"curve": 0.25,
							"c3": 0.75
						},
						{
							"time": 2,
							"vertices": [ -17.21417, 3.13947, 17.21417, 3.13947, 17.21417, -3.13947, -17.21417, -3.13947 ],
							"curve": 0.25,
							"c3": 0.75
						},
						{
							"time": 2.5,
							"vertices": [ -2.44, 0.44499, 2.44, 0.44499, 2.44, -0.44499, -2.44, -0.44499 ]
						}
					]
				}
			}
		}
	},
	"quest": {
		"slots": {
			"blue1-smile": {
				"attachment": [
					{ "name": null }
				]
			},
			"blue2--smile": {
				"attachment": [
					{ "name": null }
				]
			},
			"blue2-body": {
				"attachment": [
					{ "name": null }
				]
			},
			"blue2-eye-1": {
				"attachment": [
					{ "name": null }
				]
			},
			"blue2-eye-2": {
				"attachment": [
					{ "name": null }
				]
			},
			"blue2-face": {
				"attachment": [
					{ "name": null }
				]
			},
			"blue2-hand-1a": {
				"attachment": [
					{ "name": null }
				]
			},
			"blue2-hand-1b": {
				"attachment": [
					{ "name": null }
				]
			},
			"blue2-hand-2a": {
				"attachment": [
					{ "name": null }
				]
			},
			"blue2-hand-2b": {
				"attachment": [
					{ "name": null }
				]
			},
			"blue2-iris-1": {
				"attachment": [
					{ "name": null }
				]
			},
			"blue2-iris-2": {
				"attachment": [
					{ "name": null }
				]
			},
			"blue2-leg-1a": {
				"attachment": [
					{ "name": null }
				]
			},
			"blue2-leg-1b": {
				"attachment": [
					{ "name": null }
				]
			},
			"blue2-leg-2a": {
				"attachment": [
					{ "name": null }
				]
			},
			"blue2-leg-2b": {
				"attachment": [
					{ "name": null }
				]
			}
		},
		"bones": {
			"bone": {
				"translate": [
					{ "curve": 0.25, "c3": 0.75 },
					{ "time": 0.5, "y": -6.68, "curve": 0.25, "c3": 0.75 },
					{ "time": 1, "curve": 0.25, "c3": 0.75 },
					{ "time": 1.5, "y": -6.68, "curve": 0.25, "c3": 0.75 },
					{ "time": 2, "curve": 0.25, "c3": 0.75 },
					{ "time": 2.5, "y": -6.68, "curve": 0.25, "c3": 0.75 },
					{ "time": 3 }
				]
			},
			"blue1-body3": {
				"rotate": [
					{ "angle": 3.27, "curve": 0.382, "c2": 0.57, "c3": 0.735 },
					{ "time": 0.1667, "angle": 7.8, "curve": 0.25, "c3": 0.75 },
					{ "time": 0.6667, "angle": -8.18, "curve": 0.243, "c3": 0.649, "c4": 0.6 },
					{ "time": 1, "angle": 3.27, "curve": 0.382, "c2": 0.57, "c3": 0.735 },
					{ "time": 1.1667, "angle": 7.8, "curve": 0.25, "c3": 0.75 },
					{ "time": 1.6667, "angle": -8.18, "curve": 0.243, "c3": 0.649, "c4": 0.6 },
					{ "time": 2, "angle": 3.27, "curve": 0.382, "c2": 0.57, "c3": 0.735 },
					{ "time": 2.1667, "angle": 7.8, "curve": 0.25, "c3": 0.75 },
					{ "time": 2.6667, "angle": -8.18, "curve": 0.243, "c3": 0.649, "c4": 0.6 },
					{ "time": 3, "angle": 3.27 }
				],
				"translate": [
					{ "x": -11.01, "y": -6.26, "curve": 0.382, "c2": 0.57, "c3": 0.735 },
					{ "time": 0.1667, "x": -5.31, "y": -9.89, "curve": 0.25, "c3": 0.75 },
					{ "time": 0.6667, "x": -25.38, "y": 2.91, "curve": 0.243, "c3": 0.649, "c4": 0.6 },
					{ "time": 1, "x": -11.01, "y": -6.26, "curve": 0.382, "c2": 0.57, "c3": 0.735 },
					{ "time": 1.1667, "x": -5.31, "y": -9.89, "curve": 0.25, "c3": 0.75 },
					{ "time": 1.6667, "x": -25.38, "y": 2.91, "curve": 0.243, "c3": 0.649, "c4": 0.6 },
					{ "time": 2, "x": -11.01, "y": -6.26, "curve": 0.382, "c2": 0.57, "c3": 0.735 },
					{ "time": 2.1667, "x": -5.31, "y": -9.89, "curve": 0.25, "c3": 0.75 },
					{ "time": 2.6667, "x": -25.38, "y": 2.91, "curve": 0.243, "c3": 0.649, "c4": 0.6 },
					{ "time": 3, "x": -11.01, "y": -6.26 }
				]
			},
			"blue1-hand-1b": {
				"rotate": [
					{ "curve": 0.25, "c3": 0.75 },
					{ "time": 0.5, "angle": 9.73, "curve": 0.25, "c3": 0.75 },
					{ "time": 1, "curve": 0.25, "c3": 0.75 },
					{ "time": 1.5, "angle": 9.73, "curve": 0.25, "c3": 0.75 },
					{ "time": 2, "curve": 0.25, "c3": 0.75 },
					{ "time": 2.5, "angle": 9.73, "curve": 0.25, "c3": 0.75 },
					{ "time": 3 }
				]
			},
			"blue1-hand-1b2": {
				"rotate": [
					{ "curve": 0.25, "c3": 0.75 },
					{ "time": 0.5, "angle": 29.64, "curve": 0.25, "c3": 0.75 },
					{ "time": 1, "curve": 0.25, "c3": 0.75 },
					{ "time": 1.5, "angle": 29.64, "curve": 0.25, "c3": 0.75 },
					{ "time": 2, "curve": 0.25, "c3": 0.75 },
					{ "time": 2.5, "angle": 29.64, "curve": 0.25, "c3": 0.75 },
					{ "time": 3 }
				]
			},
			"blue1-hand-2b": {
				"rotate": [
					{ "angle": -2.15, "curve": 0.375, "c2": 0.62, "c3": 0.716 },
					{ "time": 0.1, "angle": -3.18, "curve": 0.25, "c3": 0.75 },
					{ "time": 0.6, "angle": 4.74, "curve": 0.243, "c3": 0.68, "c4": 0.71 },
					{ "time": 1, "angle": -2.15, "curve": 0.375, "c2": 0.62, "c3": 0.716 },
					{ "time": 1.1, "angle": -3.18, "curve": 0.25, "c3": 0.75 },
					{ "time": 1.6, "angle": 4.74, "curve": 0.243, "c3": 0.68, "c4": 0.71 },
					{ "time": 2, "angle": -2.15, "curve": 0.375, "c2": 0.62, "c3": 0.716 },
					{ "time": 2.1, "angle": -3.18, "curve": 0.25, "c3": 0.75 },
					{ "time": 2.6, "angle": 4.74, "curve": 0.243, "c3": 0.68, "c4": 0.71 },
					{ "time": 3, "angle": -2.15 }
				]
			},
			"blue1-hand-2b2": {
				"rotate": [
					{ "angle": -0.3, "curve": 0.349, "c2": 0.39, "c3": 0.689, "c4": 0.74 },
					{ "time": 0.1, "angle": -2.15, "curve": 0.375, "c2": 0.62, "c3": 0.716 },
					{ "time": 0.2, "angle": -3.18, "curve": 0.25, "c3": 0.75 },
					{ "time": 0.7, "angle": 4.74, "curve": 0.245, "c3": 0.637, "c4": 0.56 },
					{ "time": 1, "angle": -0.3, "curve": 0.349, "c2": 0.39, "c3": 0.689, "c4": 0.74 },
					{ "time": 1.1, "angle": -2.15, "curve": 0.375, "c2": 0.62, "c3": 0.716 },
					{ "time": 1.2, "angle": -3.18, "curve": 0.25, "c3": 0.75 },
					{ "time": 1.7, "angle": 4.74, "curve": 0.245, "c3": 0.637, "c4": 0.56 },
					{ "time": 2, "angle": -0.3, "curve": 0.349, "c2": 0.39, "c3": 0.689, "c4": 0.74 },
					{ "time": 2.1, "angle": -2.15, "curve": 0.375, "c2": 0.62, "c3": 0.716 },
					{ "time": 2.2, "angle": -3.18, "curve": 0.25, "c3": 0.75 },
					{ "time": 2.7, "angle": 4.74, "curve": 0.245, "c3": 0.637, "c4": 0.56 },
					{ "time": 3, "angle": -0.3 }
				]
			},
			"blue1-hand-2b3": {
				"rotate": [
					{ "angle": 1.8, "curve": 0.33, "c2": 0.32, "c3": 0.67, "c4": 0.68 },
					{ "time": 0.1, "angle": -0.3, "curve": 0.349, "c2": 0.39, "c3": 0.689, "c4": 0.74 },
					{ "time": 0.2, "angle": -2.15, "curve": 0.375, "c2": 0.62, "c3": 0.716 },
					{ "time": 0.3, "angle": -3.18, "curve": 0.25, "c3": 0.75 },
					{ "time": 0.8, "angle": 4.74, "curve": 0.258, "c3": 0.619, "c4": 0.45 },
					{ "time": 1, "angle": 1.8, "curve": 0.33, "c2": 0.32, "c3": 0.67, "c4": 0.68 },
					{ "time": 1.1, "angle": -0.3, "curve": 0.349, "c2": 0.39, "c3": 0.689, "c4": 0.74 },
					{ "time": 1.2, "angle": -2.15, "curve": 0.375, "c2": 0.62, "c3": 0.716 },
					{ "time": 1.3, "angle": -3.18, "curve": 0.25, "c3": 0.75 },
					{ "time": 1.8, "angle": 4.74, "curve": 0.258, "c3": 0.619, "c4": 0.45 },
					{ "time": 2, "angle": 1.8, "curve": 0.33, "c2": 0.32, "c3": 0.67, "c4": 0.68 },
					{ "time": 2.1, "angle": -0.3, "curve": 0.349, "c2": 0.39, "c3": 0.689, "c4": 0.74 },
					{ "time": 2.2, "angle": -2.15, "curve": 0.375, "c2": 0.62, "c3": 0.716 },
					{ "time": 2.3, "angle": -3.18, "curve": 0.25, "c3": 0.75 },
					{ "time": 2.8, "angle": 4.74, "curve": 0.258, "c3": 0.619, "c4": 0.45 },
					{ "time": 3, "angle": 1.8 }
				]
			},
			"blue1-face": {
				"rotate": [
					{ "angle": 4.08, "curve": "stepped" },
					{ "time": 1, "angle": 4.08, "curve": 0.25, "c3": 0.75 },
					{ "time": 1.3333, "angle": -5.51, "curve": "stepped" },
					{ "time": 2.1667, "angle": -5.51, "curve": 0.25, "c3": 0.75 },
					{ "time": 2.6667, "angle": 4.08 }
				]
			}
		},
		"deform": {
			"default": {
				"blue1-iris-1": {
					"blue1-iris-1": [
						{ "curve": "stepped" },
						{ "time": 1, "curve": 0.25, "c3": 0.75 },
						{
							"time": 1.3333,
							"vertices": [ -14.34378, -14.66119, -14.34375, -14.66119, -14.34372, -14.66119, -14.34375, -14.66122 ],
							"curve": "stepped"
						},
						{
							"time": 2.1667,
							"vertices": [ -14.34378, -14.66119, -14.34375, -14.66119, -14.34372, -14.66119, -14.34375, -14.66122 ],
							"curve": 0.25,
							"c3": 0.75
						},
						{ "time": 2.6667 }
					]
				},
				"blue1-iris-2": {
					"blue1-iris-2": [
						{ "curve": "stepped" },
						{ "time": 1, "curve": 0.25, "c3": 0.75 },
						{
							"time": 1.3333,
							"vertices": [ -14.34378, -14.66122, -14.34372, -14.66119, -14.34372, -14.66122, -14.34369, -14.66122 ],
							"curve": "stepped"
						},
						{
							"time": 2.1667,
							"vertices": [ -14.34378, -14.66122, -14.34372, -14.66119, -14.34372, -14.66122, -14.34369, -14.66122 ],
							"curve": 0.25,
							"c3": 0.75
						},
						{ "time": 2.6667 }
					]
				},
				"shadow": {
					"shadow": [
						{
							"vertices": [ -17.21417, 3.13947, 17.21417, 3.13947, 17.21417, -3.13947, -17.21417, -3.13947 ],
							"curve": 0.25,
							"c3": 0.75
						},
						{
							"time": 0.5,
							"vertices": [ -2.44, 0.44499, 2.44, 0.44499, 2.44, -0.44499, -2.44, -0.44499 ],
							"curve": 0.25,
							"c3": 0.75
						},
						{
							"time": 1,
							"vertices": [ -17.21417, 3.13947, 17.21417, 3.13947, 17.21417, -3.13947, -17.21417, -3.13947 ],
							"curve": 0.25,
							"c3": 0.75
						},
						{
							"time": 1.5,
							"vertices": [ -2.44, 0.44499, 2.44, 0.44499, 2.44, -0.44499, -2.44, -0.44499 ],
							"curve": 0.25,
							"c3": 0.75
						},
						{
							"time": 2,
							"vertices": [ -17.21417, 3.13947, 17.21417, 3.13947, 17.21417, -3.13947, -17.21417, -3.13947 ],
							"curve": 0.25,
							"c3": 0.75
						},
						{
							"time": 2.5,
							"vertices": [ -2.44, 0.44499, 2.44, 0.44499, 2.44, -0.44499, -2.44, -0.44499 ],
							"curve": 0.25,
							"c3": 0.75
						},
						{
							"time": 3,
							"vertices": [ -17.21417, 3.13947, 17.21417, 3.13947, 17.21417, -3.13947, -17.21417, -3.13947 ]
						}
					]
				}
			}
		}
	},
	"quest2": {
		"bones": {
			"blue2-hand-2b2": {
				"rotate": [
					{ "angle": -8.34, "curve": 0.25, "c3": 0.75 },
					{ "time": 0.5, "angle": -2.47, "curve": 0.25, "c3": 0.75 },
					{ "time": 1, "angle": -8.34, "curve": 0.25, "c3": 0.75 },
					{ "time": 1.5, "angle": -2.47, "curve": 0.25, "c3": 0.75 },
					{ "time": 2, "angle": -8.34, "curve": 0.25, "c3": 0.75 },
					{ "time": 2.5, "angle": -2.47, "curve": 0.25, "c3": 0.75 },
					{ "time": 3, "angle": -8.34 }
				]
			},
			"blue1-hand-1b2": {
				"rotate": [
					{ "curve": "stepped" },
					{ "time": 0.0165, "curve": 0.25, "c3": 0.75 },
					{ "time": 0.5165, "angle": 29.64, "curve": 0.25, "c3": 0.75 },
					{ "time": 1, "curve": 0.25, "c3": 0.75 },
					{ "time": 1.5, "angle": 29.64, "curve": 0.25, "c3": 0.75 },
					{ "time": 2, "curve": 0.25, "c3": 0.75 },
					{ "time": 2.5, "angle": 29.64, "curve": 0.25, "c3": 0.75 },
					{ "time": 3 }
				]
			},
			"blue1-hand-2b": {
				"rotate": [
					{ "angle": -2.15, "curve": "stepped" },
					{ "time": 0.0165, "angle": -2.15, "curve": 0.375, "c2": 0.62, "c3": 0.716 },
					{ "time": 0.1165, "angle": -3.18, "curve": 0.25, "c3": 0.75 },
					{ "time": 0.6165, "angle": 4.74, "curve": 0.243, "c3": 0.68, "c4": 0.71 },
					{ "time": 1, "angle": -2.15, "curve": 0.375, "c2": 0.62, "c3": 0.716 },
					{ "time": 1.1, "angle": -3.18, "curve": 0.25, "c3": 0.75 },
					{ "time": 1.6, "angle": 4.74, "curve": 0.243, "c3": 0.68, "c4": 0.71 },
					{ "time": 2, "angle": -2.15, "curve": 0.375, "c2": 0.62, "c3": 0.716 },
					{ "time": 2.1, "angle": -3.18, "curve": 0.25, "c3": 0.75 },
					{ "time": 2.6, "angle": 4.74, "curve": 0.243, "c3": 0.68, "c4": 0.71 },
					{ "time": 3, "angle": -2.15 }
				]
			},
			"blue2-hand-2b": {
				"rotate": [
					{ "angle": -8.34, "curve": 0.25, "c3": 0.75 },
					{ "time": 0.5, "angle": -2.47, "curve": 0.25, "c3": 0.75 },
					{ "time": 1, "angle": -8.34, "curve": 0.25, "c3": 0.75 },
					{ "time": 1.5, "angle": -2.47, "curve": 0.25, "c3": 0.75 },
					{ "time": 2, "angle": -8.34, "curve": 0.25, "c3": 0.75 },
					{ "time": 2.5, "angle": -2.47, "curve": 0.25, "c3": 0.75 },
					{ "time": 3, "angle": -8.34 }
				]
			},
			"blue1-hand-2b2": {
				"rotate": [
					{ "angle": -0.3, "curve": "stepped" },
					{ "time": 0.0165, "angle": -0.3, "curve": 0.349, "c2": 0.39, "c3": 0.689, "c4": 0.74 },
					{ "time": 0.1165, "angle": -2.15, "curve": 0.375, "c2": 0.62, "c3": 0.716 },
					{ "time": 0.2165, "angle": -3.18, "curve": 0.25, "c3": 0.75 },
					{ "time": 0.7165, "angle": 4.74, "curve": 0.245, "c3": 0.637, "c4": 0.56 },
					{ "time": 1, "angle": -0.3, "curve": 0.349, "c2": 0.39, "c3": 0.689, "c4": 0.74 },
					{ "time": 1.1, "angle": -2.15, "curve": 0.375, "c2": 0.62, "c3": 0.716 },
					{ "time": 1.2, "angle": -3.18, "curve": 0.25, "c3": 0.75 },
					{ "time": 1.7, "angle": 4.74, "curve": 0.245, "c3": 0.637, "c4": 0.56 },
					{ "time": 2, "angle": -0.3, "curve": 0.349, "c2": 0.39, "c3": 0.689, "c4": 0.74 },
					{ "time": 2.1, "angle": -2.15, "curve": 0.375, "c2": 0.62, "c3": 0.716 },
					{ "time": 2.2, "angle": -3.18, "curve": 0.25, "c3": 0.75 },
					{ "time": 2.7, "angle": 4.74, "curve": 0.245, "c3": 0.637, "c4": 0.56 },
					{ "time": 3, "angle": -0.3 }
				]
			},
			"blue1-body3": {
				"rotate": [
					{ "angle": 3.27, "curve": "stepped" },
					{ "time": 0.0165, "angle": 3.27, "curve": 0.382, "c2": 0.57, "c3": 0.735 },
					{ "time": 0.1832, "angle": 7.8, "curve": 0.25, "c3": 0.75 },
					{ "time": 0.6832, "angle": -8.18, "curve": 0.243, "c3": 0.649, "c4": 0.6 },
					{ "time": 1, "angle": 3.27, "curve": 0.382, "c2": 0.57, "c3": 0.735 },
					{ "time": 1.1667, "angle": 7.8, "curve": 0.25, "c3": 0.75 },
					{ "time": 1.6667, "angle": -8.18, "curve": 0.243, "c3": 0.649, "c4": 0.6 },
					{ "time": 2, "angle": 3.27, "curve": 0.382, "c2": 0.57, "c3": 0.735 },
					{ "time": 2.1667, "angle": 7.8, "curve": 0.25, "c3": 0.75 },
					{ "time": 2.6667, "angle": -8.18, "curve": 0.243, "c3": 0.649, "c4": 0.6 },
					{ "time": 3, "angle": 3.27 }
				],
				"translate": [
					{ "x": -11.01, "y": -6.26, "curve": "stepped" },
					{ "time": 0.0165, "x": -11.01, "y": -6.26, "curve": 0.382, "c2": 0.57, "c3": 0.735 },
					{ "time": 0.1832, "x": -5.31, "y": -9.89, "curve": 0.25, "c3": 0.75 },
					{ "time": 0.6832, "x": -25.38, "y": 2.91, "curve": 0.243, "c3": 0.649, "c4": 0.6 },
					{ "time": 1, "x": -11.01, "y": -6.26, "curve": 0.382, "c2": 0.57, "c3": 0.735 },
					{ "time": 1.1667, "x": -5.31, "y": -9.89, "curve": 0.25, "c3": 0.75 },
					{ "time": 1.6667, "x": -25.38, "y": 2.91, "curve": 0.243, "c3": 0.649, "c4": 0.6 },
					{ "time": 2, "x": -11.01, "y": -6.26, "curve": 0.382, "c2": 0.57, "c3": 0.735 },
					{ "time": 2.1667, "x": -5.31, "y": -9.89, "curve": 0.25, "c3": 0.75 },
					{ "time": 2.6667, "x": -25.38, "y": 2.91, "curve": 0.243, "c3": 0.649, "c4": 0.6 },
					{ "time": 3, "x": -11.01, "y": -6.26 }
				]
			},
			"blue1-hand-2b3": {
				"rotate": [
					{ "angle": 1.8, "curve": "stepped" },
					{ "time": 0.0165, "angle": 1.8, "curve": 0.33, "c2": 0.32, "c3": 0.67, "c4": 0.68 },
					{ "time": 0.1165, "angle": -0.3, "curve": 0.349, "c2": 0.39, "c3": 0.689, "c4": 0.74 },
					{ "time": 0.2165, "angle": -2.15, "curve": 0.375, "c2": 0.62, "c3": 0.716 },
					{ "time": 0.3165, "angle": -3.18, "curve": 0.25, "c3": 0.75 },
					{ "time": 0.8165, "angle": 4.74, "curve": 0.258, "c3": 0.619, "c4": 0.45 },
					{ "time": 1, "angle": 1.8, "curve": 0.33, "c2": 0.32, "c3": 0.67, "c4": 0.68 },
					{ "time": 1.1, "angle": -0.3, "curve": 0.349, "c2": 0.39, "c3": 0.689, "c4": 0.74 },
					{ "time": 1.2, "angle": -2.15, "curve": 0.375, "c2": 0.62, "c3": 0.716 },
					{ "time": 1.3, "angle": -3.18, "curve": 0.25, "c3": 0.75 },
					{ "time": 1.8, "angle": 4.74, "curve": 0.258, "c3": 0.619, "c4": 0.45 },
					{ "time": 2, "angle": 1.8, "curve": 0.33, "c2": 0.32, "c3": 0.67, "c4": 0.68 },
					{ "time": 2.1, "angle": -0.3, "curve": 0.349, "c2": 0.39, "c3": 0.689, "c4": 0.74 },
					{ "time": 2.2, "angle": -2.15, "curve": 0.375, "c2": 0.62, "c3": 0.716 },
					{ "time": 2.3, "angle": -3.18, "curve": 0.25, "c3": 0.75 },
					{ "time": 2.8, "angle": 4.74, "curve": 0.258, "c3": 0.619, "c4": 0.45 },
					{ "time": 3, "angle": 1.8 }
				]
			},
			"bone": {
				"translate": [
					{ "curve": "stepped" },
					{ "time": 0.0165, "curve": 0.25, "c3": 0.75 },
					{ "time": 0.5165, "y": -6.68, "curve": 0.25, "c3": 0.75 },
					{ "time": 1, "curve": 0.25, "c3": 0.75 },
					{ "time": 1.5, "y": -6.68, "curve": 0.25, "c3": 0.75 },
					{ "time": 2, "curve": 0.25, "c3": 0.75 },
					{ "time": 2.5, "y": -6.68, "curve": 0.25, "c3": 0.75 },
					{ "time": 3 }
				]
			},
			"blue1-hand-1b": {
				"rotate": [
					{ "curve": "stepped" },
					{ "time": 0.0165, "curve": 0.25, "c3": 0.75 },
					{ "time": 0.5165, "angle": 9.73, "curve": 0.25, "c3": 0.75 },
					{ "time": 1, "curve": 0.25, "c3": 0.75 },
					{ "time": 1.5, "angle": 9.73, "curve": 0.25, "c3": 0.75 },
					{ "time": 2, "curve": 0.25, "c3": 0.75 },
					{ "time": 2.5, "angle": 9.73, "curve": 0.25, "c3": 0.75 },
					{ "time": 3 }
				]
			},
			"blue2-body": {
				"translate": [
					{ "curve": 0.25, "c3": 0.75 },
					{ "time": 0.5, "y": -3.93, "curve": 0.25, "c3": 0.75 },
					{ "time": 1, "curve": "stepped" },
					{ "time": 3 }
				]
			},
			"blue2-hand-1b2": {
				"rotate": [
					{ "angle": 15.42, "curve": 0.25, "c3": 0.75 },
					{ "time": 0.5, "angle": 3.74, "curve": 0.25, "c3": 0.75 },
					{ "time": 1, "angle": 15.42, "curve": 0.25, "c3": 0.75 },
					{ "time": 1.5, "angle": 3.74, "curve": 0.25, "c3": 0.75 },
					{ "time": 2, "angle": 15.42, "curve": 0.25, "c3": 0.75 },
					{ "time": 2.5, "angle": 3.74, "curve": 0.25, "c3": 0.75 },
					{ "time": 3, "angle": 15.42 }
				]
			},
			"blue2-body3": {
				"rotate": [
					{ "curve": 0.25, "c3": 0.75 },
					{ "time": 0.5667, "angle": -4.04, "curve": 0.25, "c3": 0.75 },
					{ "time": 1.0667, "curve": 0.25, "c3": 0.75 },
					{ "time": 1.5667, "angle": -4.04, "curve": 0.25, "c3": 0.75 },
					{ "time": 2.0667, "curve": 0.25, "c3": 0.75 },
					{ "time": 2.5667, "angle": -4.04, "curve": 0.244, "c3": 0.7, "c4": 0.79 },
					{ "time": 3 }
				],
				"translate": [
					{ "x": -14.08, "y": -0.68, "curve": 0.25, "c3": 0.75 },
					{ "time": 0.5667, "x": 6.39, "y": 2.48, "curve": 0.25, "c3": 0.75 },
					{ "time": 1.0667, "x": -14.08, "y": -0.68, "curve": 0.25, "c3": 0.75 },
					{ "time": 1.5667, "x": 6.39, "y": 2.48, "curve": 0.25, "c3": 0.75 },
					{ "time": 2.0667, "x": -14.08, "y": -0.68, "curve": 0.25, "c3": 0.75 },
					{ "time": 2.5667, "x": 6.39, "y": 2.48, "curve": 0.244, "c3": 0.7, "c4": 0.79 },
					{ "time": 3, "x": -14.08, "y": -0.68 }
				]
			}
		},
		"deform": {
			"default": {
				"blue1-iris-1": {
					"blue1-iris-1": [
						{
							"time": 0.1832,
							"vertices": [ -11.95795, -10.32257, -11.95792, -10.32257, -11.95789, -10.32257, -11.95792, -10.3226 ],
							"curve": 0.25,
							"c3": 0.75
						},
						{ "time": 0.6832, "curve": 0.25, "c3": 0.75 },
						{
							"time": 0.7667,
							"vertices": [ 0.75879, -3.63205, 0.75882, -3.63205, 0.75885, -3.63205, 0.75882, -3.63208 ],
							"curve": 0.25,
							"c3": 0.75
						},
						{ "time": 0.8498, "curve": 0.25, "c3": 0.75 },
						{
							"time": 0.9333,
							"vertices": [ 0.75879, -3.63205, 0.75882, -3.63205, 0.75885, -3.63205, 0.75882, -3.63208 ],
							"curve": 0.25,
							"c3": 0.75
						},
						{ "time": 1.0165, "curve": 0.25, "c3": 0.75 },
						{
							"time": 1.1,
							"vertices": [ 0.75879, -3.63205, 0.75882, -3.63205, 0.75885, -3.63205, 0.75882, -3.63208 ],
							"curve": 0.25,
							"c3": 0.75
						},
						{ "time": 1.1832, "curve": 0.25, "c3": 0.75 },
						{
							"time": 1.2667,
							"vertices": [ 0.75879, -3.63205, 0.75882, -3.63205, 0.75885, -3.63205, 0.75882, -3.63208 ],
							"curve": 0.25,
							"c3": 0.75
						},
						{ "time": 1.3498, "curve": 0.25, "c3": 0.75 },
						{
							"time": 1.4333,
							"vertices": [ 0.75879, -3.63205, 0.75882, -3.63205, 0.75885, -3.63205, 0.75882, -3.63208 ],
							"curve": 0.25,
							"c3": 0.75
						},
						{ "time": 1.5165, "curve": 0.25, "c3": 0.75 },
						{
							"time": 1.6,
							"vertices": [ 0.75879, -3.63205, 0.75882, -3.63205, 0.75885, -3.63205, 0.75882, -3.63208 ],
							"curve": 0.25,
							"c3": 0.75
						},
						{ "time": 1.6832, "curve": 0.25, "c3": 0.75 },
						{
							"time": 1.7667,
							"vertices": [ 0.75879, -3.63205, 0.75882, -3.63205, 0.75885, -3.63205, 0.75882, -3.63208 ],
							"curve": 0.25,
							"c3": 0.75
						},
						{ "time": 1.8498, "curve": 0.25, "c3": 0.75 },
						{
							"time": 1.9333,
							"vertices": [ 0.75879, -3.63205, 0.75882, -3.63205, 0.75885, -3.63205, 0.75882, -3.63208 ],
							"curve": 0.25,
							"c3": 0.75
						},
						{ "time": 2.0165, "curve": 0.25, "c3": 0.75 },
						{
							"time": 2.1,
							"vertices": [ 0.75879, -3.63205, 0.75882, -3.63205, 0.75885, -3.63205, 0.75882, -3.63208 ],
							"curve": 0.25,
							"c3": 0.75
						},
						{ "time": 2.1832, "curve": 0.25, "c3": 0.75 },
						{
							"time": 2.2667,
							"vertices": [ 0.75879, -3.63205, 0.75882, -3.63205, 0.75885, -3.63205, 0.75882, -3.63208 ],
							"curve": 0.25,
							"c3": 0.75
						},
						{ "time": 2.3498, "curve": 0.25, "c3": 0.75 },
						{
							"time": 2.4333,
							"vertices": [ 0.75879, -3.63205, 0.75882, -3.63205, 0.75885, -3.63205, 0.75882, -3.63208 ],
							"curve": 0.25,
							"c3": 0.75
						},
						{ "time": 2.5165, "curve": 0.25, "c3": 0.75 },
						{
							"time": 2.6,
							"vertices": [ 0.75879, -3.63205, 0.75882, -3.63205, 0.75885, -3.63205, 0.75882, -3.63208 ],
							"curve": 0.25,
							"c3": 0.75
						},
						{ "time": 2.6832, "curve": 0.25, "c3": 0.75 },
						{
							"time": 2.7667,
							"vertices": [ 0.75879, -3.63205, 0.75882, -3.63205, 0.75885, -3.63205, 0.75882, -3.63208 ],
							"curve": 0.25,
							"c3": 0.75
						},
						{ "time": 2.8498, "curve": 0.25, "c3": 0.75 },
						{
							"time": 2.9333,
							"vertices": [ 0.75879, -3.63205, 0.75882, -3.63205, 0.75885, -3.63205, 0.75882, -3.63208 ],
							"curve": 0.25,
							"c3": 0.75
						},
						{ "time": 3 }
					]
				},
				"blue1-iris-2": {
					"blue1-iris-2": [
						{
							"time": 0.1832,
							"vertices": [ -3.15103, -13.68253, -3.15097, -13.6825, -3.15097, -13.68253, -3.15094, -13.68253 ],
							"curve": 0.25,
							"c3": 0.75
						},
						{ "time": 0.6832, "curve": 0.25, "c3": 0.75 },
						{
							"time": 0.7667,
							"vertices": [ 0.75879, -3.63208, 0.75885, -3.63205, 0.75885, -3.63208, 0.75888, -3.63208 ],
							"curve": 0.25,
							"c3": 0.75
						},
						{ "time": 0.8498, "curve": 0.25, "c3": 0.75 },
						{
							"time": 0.9333,
							"vertices": [ 0.75879, -3.63208, 0.75885, -3.63205, 0.75885, -3.63208, 0.75888, -3.63208 ],
							"curve": 0.25,
							"c3": 0.75
						},
						{ "time": 1.0165, "curve": 0.25, "c3": 0.75 },
						{
							"time": 1.1,
							"vertices": [ 0.75879, -3.63208, 0.75885, -3.63205, 0.75885, -3.63208, 0.75888, -3.63208 ],
							"curve": 0.25,
							"c3": 0.75
						},
						{ "time": 1.1832, "curve": 0.25, "c3": 0.75 },
						{
							"time": 1.2667,
							"vertices": [ 0.75879, -3.63208, 0.75885, -3.63205, 0.75885, -3.63208, 0.75888, -3.63208 ],
							"curve": 0.25,
							"c3": 0.75
						},
						{ "time": 1.3498, "curve": 0.25, "c3": 0.75 },
						{
							"time": 1.4333,
							"vertices": [ 0.75879, -3.63208, 0.75885, -3.63205, 0.75885, -3.63208, 0.75888, -3.63208 ],
							"curve": 0.25,
							"c3": 0.75
						},
						{ "time": 1.5165, "curve": 0.25, "c3": 0.75 },
						{
							"time": 1.6,
							"vertices": [ 0.75879, -3.63208, 0.75885, -3.63205, 0.75885, -3.63208, 0.75888, -3.63208 ],
							"curve": 0.25,
							"c3": 0.75
						},
						{ "time": 1.6832, "curve": 0.25, "c3": 0.75 },
						{
							"time": 1.7667,
							"vertices": [ 0.75879, -3.63208, 0.75885, -3.63205, 0.75885, -3.63208, 0.75888, -3.63208 ],
							"curve": 0.25,
							"c3": 0.75
						},
						{ "time": 1.8498, "curve": 0.25, "c3": 0.75 },
						{
							"time": 1.9333,
							"vertices": [ 0.75879, -3.63208, 0.75885, -3.63205, 0.75885, -3.63208, 0.75888, -3.63208 ],
							"curve": 0.25,
							"c3": 0.75
						},
						{ "time": 2.0165, "curve": 0.25, "c3": 0.75 },
						{
							"time": 2.1,
							"vertices": [ 0.75879, -3.63208, 0.75885, -3.63205, 0.75885, -3.63208, 0.75888, -3.63208 ],
							"curve": 0.25,
							"c3": 0.75
						},
						{ "time": 2.1832, "curve": 0.25, "c3": 0.75 },
						{
							"time": 2.2667,
							"vertices": [ 0.75879, -3.63208, 0.75885, -3.63205, 0.75885, -3.63208, 0.75888, -3.63208 ],
							"curve": 0.25,
							"c3": 0.75
						},
						{ "time": 2.3498, "curve": 0.25, "c3": 0.75 },
						{
							"time": 2.4333,
							"vertices": [ 0.75879, -3.63208, 0.75885, -3.63205, 0.75885, -3.63208, 0.75888, -3.63208 ],
							"curve": 0.25,
							"c3": 0.75
						},
						{ "time": 2.5165, "curve": 0.25, "c3": 0.75 },
						{
							"time": 2.6,
							"vertices": [ 0.75879, -3.63208, 0.75885, -3.63205, 0.75885, -3.63208, 0.75888, -3.63208 ],
							"curve": 0.25,
							"c3": 0.75
						},
						{ "time": 2.6832, "curve": 0.25, "c3": 0.75 },
						{
							"time": 2.7667,
							"vertices": [ 0.75879, -3.63208, 0.75885, -3.63205, 0.75885, -3.63208, 0.75888, -3.63208 ],
							"curve": 0.25,
							"c3": 0.75
						},
						{ "time": 2.8498, "curve": 0.25, "c3": 0.75 },
						{
							"time": 2.9333,
							"vertices": [ 0.75879, -3.63208, 0.75885, -3.63205, 0.75885, -3.63208, 0.75888, -3.63208 ],
							"curve": 0.25,
							"c3": 0.75
						},
						{ "time": 3 }
					]
				},
				"blue2-body": {
					"blue2-body": [
						{ "curve": 0.25, "c3": 0.75 },
						{
							"time": 0.5,
							"offset": 52,
							"vertices": [ 3.34485, -1.80798, 3.34998, -1.79764, 4.64752, -1.74942, 4.6524, -1.73505, 4.05463, -3.08139, 4.06372, -3.06885, 3.22784, 0.79752, 3.22491, 0.8075, 5.80408, 1.56573, 5.79861, 1.58368, 12.72473, 9.7081, 12.69406, 9.74744, 12.33636, 3.8168, 12.32416, 3.85501, 12.33636, 3.8168, 12.32416, 3.85501, 12.33636, 3.8168, 12.32416, 3.85501, 5.68707, 4.17099, 5.67374, 4.18863, 6.0E-5, -3.0E-5, 0, -3.0E-5, 6.0E-5, -3.0E-5, 0, -3.0E-5, 6.0E-5, -3.0E-5, 6.0E-5, -3.0E-5, 0, -3.0E-5, 10.71429, -7.97211, 10.35846, -8.15308, 6.19781, -11.85828, 5.69794, -12.00497, 5.32727, -8.35983, 4.87723, -8.50421, 12.33636, 3.8168, 12.32416, 3.85501, 12.33636, 3.8168, 12.32416, 3.85501, 12.33636, 3.8168, 12.32416, 3.85501, 0.48569, -0.44147, 12.33636, 3.8168, 12.32416, 3.85501, 12.33636, 3.8168, 12.32416, 3.85501, 12.33636, 3.8168, 12.32416, 3.85501 ],
							"curve": 0.25,
							"c3": 0.75
						},
						{ "time": 1, "curve": 0.25, "c3": 0.75 },
						{
							"time": 1.5,
							"offset": 52,
							"vertices": [ 3.34485, -1.80798, 3.34998, -1.79764, 4.64752, -1.74942, 4.6524, -1.73505, 4.05463, -3.08139, 4.06372, -3.06885, 3.22784, 0.79752, 3.22491, 0.8075, 5.80408, 1.56573, 5.79861, 1.58368, 12.72473, 9.7081, 12.69406, 9.74744, 12.33636, 3.8168, 12.32416, 3.85501, 12.33636, 3.8168, 12.32416, 3.85501, 12.33636, 3.8168, 12.32416, 3.85501, 5.68707, 4.17099, 5.67374, 4.18863, 6.0E-5, -3.0E-5, 0, -3.0E-5, 6.0E-5, -3.0E-5, 0, -3.0E-5, 6.0E-5, -3.0E-5, 6.0E-5, -3.0E-5, 0, -3.0E-5, 10.71429, -7.97211, 10.35846, -8.15308, 6.19781, -11.85828, 5.69794, -12.00497, 5.32727, -8.35983, 4.87723, -8.50421, 12.33636, 3.8168, 12.32416, 3.85501, 12.33636, 3.8168, 12.32416, 3.85501, 12.33636, 3.8168, 12.32416, 3.85501, 0.48569, -0.44147, 12.33636, 3.8168, 12.32416, 3.85501, 12.33636, 3.8168, 12.32416, 3.85501, 12.33636, 3.8168, 12.32416, 3.85501 ],
							"curve": 0.25,
							"c3": 0.75
						},
						{ "time": 2, "curve": 0.25, "c3": 0.75 },
						{
							"time": 2.5,
							"offset": 52,
							"vertices": [ 3.34485, -1.80798, 3.34998, -1.79764, 4.64752, -1.74942, 4.6524, -1.73505, 4.05463, -3.08139, 4.06372, -3.06885, 3.22784, 0.79752, 3.22491, 0.8075, 5.80408, 1.56573, 5.79861, 1.58368, 12.72473, 9.7081, 12.69406, 9.74744, 12.33636, 3.8168, 12.32416, 3.85501, 12.33636, 3.8168, 12.32416, 3.85501, 12.33636, 3.8168, 12.32416, 3.85501, 5.68707, 4.17099, 5.67374, 4.18863, 6.0E-5, -3.0E-5, 0, -3.0E-5, 6.0E-5, -3.0E-5, 0, -3.0E-5, 6.0E-5, -3.0E-5, 6.0E-5, -3.0E-5, 0, -3.0E-5, 10.71429, -7.97211, 10.35846, -8.15308, 6.19781, -11.85828, 5.69794, -12.00497, 5.32727, -8.35983, 4.87723, -8.50421, 12.33636, 3.8168, 12.32416, 3.85501, 12.33636, 3.8168, 12.32416, 3.85501, 12.33636, 3.8168, 12.32416, 3.85501, 0.48569, -0.44147, 12.33636, 3.8168, 12.32416, 3.85501, 12.33636, 3.8168, 12.32416, 3.85501, 12.33636, 3.8168, 12.32416, 3.85501 ],
							"curve": 0.25,
							"c3": 0.75
						},
						{ "time": 3 }
					]
				},
				"blue2-hand-1b": {
					"blue2-hand-1b": [
						{
							"offset": 10,
							"vertices": [ -5.25757, -0.83185, 1.70404, 5.04147, 6.63458, -2.02869, 5.21393, -2.40991 ],
							"curve": 0.25,
							"c3": 0.75
						},
						{
							"time": 0.5,
							"offset": 10,
							"vertices": [ 13.39941, 6.84277, -4.18872, -14.25314, -3.09753, -20.52933, -7.75806, -22.10287, 5.32458, 1.93521, -1.87897, -5.34476, 0, 0, 0, 0, 0, 0, -1.24695, 3.539, -1.62604, 9.39655, 2.66577, 15.79459, 5.04248, 8.73807 ],
							"curve": 0.25,
							"c3": 0.75
						},
						{
							"time": 1,
							"offset": 10,
							"vertices": [ -5.25757, -0.83185, 1.70404, 5.04147, 6.63458, -2.02869, 5.21393, -2.40991 ],
							"curve": 0.25,
							"c3": 0.75
						},
						{
							"time": 1.5,
							"offset": 10,
							"vertices": [ 13.39941, 6.84277, -4.18872, -14.25314, -3.09753, -20.52933, -7.75806, -22.10287, 5.32458, 1.93521, -1.87897, -5.34476, 0, 0, 0, 0, 0, 0, -1.24695, 3.539, -1.62604, 9.39655, 2.66577, 15.79459, 5.04248, 8.73807 ],
							"curve": 0.25,
							"c3": 0.75
						},
						{
							"time": 2,
							"offset": 10,
							"vertices": [ -5.25757, -0.83185, 1.70404, 5.04147, 6.63458, -2.02869, 5.21393, -2.40991 ],
							"curve": 0.25,
							"c3": 0.75
						},
						{
							"time": 2.5,
							"offset": 10,
							"vertices": [ 13.39941, 6.84277, -4.18872, -14.25314, -3.09753, -20.52933, -7.75806, -22.10287, 5.32458, 1.93521, -1.87897, -5.34476, 0, 0, 0, 0, 0, 0, -1.24695, 3.539, -1.62604, 9.39655, 2.66577, 15.79459, 5.04248, 8.73807 ],
							"curve": 0.25,
							"c3": 0.75
						},
						{
							"time": 3,
							"offset": 10,
							"vertices": [ -5.25757, -0.83185, 1.70404, 5.04147, 6.63458, -2.02869, 5.21393, -2.40991 ]
						}
					]
				},
				"shadow": {
					"shadow": [
						{
							"vertices": [ -17.21417, 3.13947, 17.21417, 3.13947, 17.21417, -3.13947, -17.21417, -3.13947 ],
							"curve": 0.25,
							"c3": 0.75
						},
						{
							"time": 0.5,
							"vertices": [ -2.44, 0.44499, 2.44, 0.44499, 2.44, -0.44499, -2.44, -0.44499 ],
							"curve": 0.25,
							"c3": 0.75
						},
						{
							"time": 1,
							"vertices": [ -17.21417, 3.13947, 17.21417, 3.13947, 17.21417, -3.13947, -17.21417, -3.13947 ],
							"curve": 0.25,
							"c3": 0.75
						},
						{
							"time": 1.5,
							"vertices": [ -2.44, 0.44499, 2.44, 0.44499, 2.44, -0.44499, -2.44, -0.44499 ],
							"curve": 0.25,
							"c3": 0.75
						},
						{
							"time": 2,
							"vertices": [ -17.21417, 3.13947, 17.21417, 3.13947, 17.21417, -3.13947, -17.21417, -3.13947 ],
							"curve": 0.25,
							"c3": 0.75
						},
						{
							"time": 2.5,
							"vertices": [ -2.44, 0.44499, 2.44, 0.44499, 2.44, -0.44499, -2.44, -0.44499 ],
							"curve": 0.25,
							"c3": 0.75
						},
						{
							"time": 3,
							"vertices": [ -17.21417, 3.13947, 17.21417, 3.13947, 17.21417, -3.13947, -17.21417, -3.13947 ]
						}
					]
				}
			}
		}
	}
}
}