%YAML 1.1
%TAG !u! tag:unity3d.com,2011:
--- !u!114 &11400000
MonoBehaviour:
  m_ObjectHideFlags: 0
  m_CorrespondingSourceObject: {fileID: 0}
  m_PrefabInstance: {fileID: 0}
  m_PrefabAsset: {fileID: 0}
  m_GameObject: {fileID: 0}
  m_Enabled: 1
  m_EditorHideFlags: 0
  m_Script: {fileID: 11500000, guid: a6b194f808b1af6499c93410e504af42, type: 3}
  m_Name: mode draw4_Atlas
  m_EditorClassIdentifier: 
  atlasFile: {fileID: 4900000, guid: 9978f91359930c746ac4ee2cd99fed9b, type: 3}
  materials:
  - {fileID: 2100000, guid: 52f9a4db284959e48a4d07e75720b5c3, type: 2}
