{
"skeleton": {
	"hash": "A+gnXwls/5FkQ+OKIsUskWmco74",
	"spine": "3.8.82",
	"x": -286.77,
	"y": 77.02,
	"width": 590.22,
	"height": 528.12,
	"images": "./images/",
	"audio": "E:/bach_spine/Pencil/500lv/New folder"
},
"bones": [
	{ "name": "root", "scaleX": 0.54, "scaleY": 0.54 },
	{ "name": "pink-body", "parent": "root", "x": 410.36, "y": 836.61 },
	{ "name": "pink-body2", "parent": "pink-body", "length": 41.35, "rotation": 86.36, "x": -0.69 },
	{ "name": "pink-body3", "parent": "pink-body2", "length": 47.23, "rotation": 6.82, "x": 41.35 },
	{ "name": "pink-hand-2b", "parent": "pink-body3", "length": 63.67, "rotation": -116.88, "x": 35.35, "y": -43.87 },
	{ "name": "pink-hand-2c", "parent": "pink-hand-2b", "length": 27.89, "rotation": -98.1, "x": 60.98, "y": 1.41 },
	{ "name": "pink-hand-2c2", "parent": "pink-hand-2c", "length": 35.69, "rotation": -18.59, "x": 27.89 },
	{ "name": "pink-hand-1b", "parent": "pink-body3", "length": 64.08, "rotation": 108.07, "x": 39.79, "y": 36.11 },
	{ "name": "pink-hand-1b2", "parent": "pink-hand-1b", "length": 38.96, "rotation": 105.34, "x": 63.6, "y": 0.19 },
	{ "name": "pink-hand-1b3", "parent": "pink-hand-1b2", "length": 22.7, "rotation": 24.7, "x": 38.96 },
	{ "name": "pink-leg-1b", "parent": "pink-body", "length": 68.63, "rotation": -124.02, "x": -15.95, "y": -19.6 },
	{ "name": "pink-leg-1b2", "parent": "pink-leg-1b", "length": 73.51, "rotation": 35.87, "x": 68.63 },
	{ "name": "pink-leg-2b", "parent": "pink-body", "length": 72.94, "rotation": -62.1, "x": 17.7, "y": -16.28 },
	{ "name": "pink-leg-2b2", "parent": "pink-leg-2b", "length": 73.95, "rotation": -27.53, "x": 72.47, "y": -1.9 },
	{ "name": "pink-leg-2b3", "parent": "pink-leg-2b2", "length": 57.69, "rotation": -27.58, "x": 73.95, "transform": "noRotationOrReflection" },
	{
		"name": "pink-leg-1b3",
		"parent": "pink-leg-1b2",
		"length": 59.86,
		"rotation": -159.3,
		"x": 72.1,
		"y": 0.52,
		"transform": "noRotationOrReflection"
	},
	{ "name": "face2", "parent": "pink-body3", "length": 94.82, "rotation": -2.92, "x": 57.4, "y": 0.9 },
	{ "name": "hair", "parent": "face2", "length": 29.1, "rotation": -70.77, "x": 120.11, "y": -87.71 },
	{ "name": "hair2", "parent": "hair", "length": 35.65, "rotation": -13.37, "x": 28.7, "y": 0.14 },
	{ "name": "hair3", "parent": "face2", "length": 37.45, "rotation": 56.23, "x": 137.67, "y": 63.29 },
	{ "name": "hair4", "parent": "hair3", "length": 29.54, "rotation": 11.71, "x": 37.45 },
	{ "name": "body", "parent": "root", "x": 62.38, "y": 418.27 },
	{ "name": "body2", "parent": "body", "length": 91.3, "rotation": 112.9, "y": 0.73 },
	{ "name": "body3", "parent": "body2", "length": 114.22, "rotation": -14.87, "x": 91.3 },
	{ "name": "hand-2b", "parent": "body3", "length": 71.89, "rotation": 92.33, "x": 19.51, "y": -18.3 },
	{ "name": "hand-2b2", "parent": "hand-2b", "length": 72.77, "rotation": -11.42, "x": 71.89 },
	{ "name": "hand-2a", "parent": "hand-2b2", "length": 40.58, "rotation": -7.6, "x": 71.4, "y": 0.65 },
	{ "name": "hand-2a2", "parent": "hand-2a", "length": 47.1, "rotation": -8.98, "x": 39.24, "y": -0.21 },
	{ "name": "hand-1b", "parent": "body3", "length": 93.26, "rotation": 57.59, "x": 39.03, "y": -4.59 },
	{ "name": "hand-1b2", "parent": "hand-1b", "length": 88.96, "rotation": 18.2, "x": 93.26 },
	{ "name": "hand-1a", "parent": "hand-1b2", "length": 61.06, "rotation": 8.09, "x": 88.96 },
	{ "name": "hand-1a2", "parent": "hand-1a", "length": 59.04, "rotation": -0.27, "x": 61.06 },
	{ "name": "tissue", "parent": "hand-1a", "length": 38.96, "rotation": 74.31, "x": 92.7, "y": -17.29 },
	{ "name": "tissue2", "parent": "tissue", "length": 32.13, "rotation": -1.73, "x": 38.96 },
	{ "name": "tissue3", "parent": "tissue2", "length": 28.92, "rotation": -16.84, "x": 32.13 },
	{ "name": "tissue4", "parent": "tissue3", "length": 37.58, "rotation": 8.62, "x": 28.92 },
	{ "name": "tissue5", "parent": "hand-1a", "length": 26.57, "rotation": 92.55, "x": 24.66, "y": 17.32 },
	{ "name": "tissue6", "parent": "tissue5", "length": 25.12, "rotation": -2.89, "x": 26.57 },
	{ "name": "tissue7", "parent": "tissue6", "length": 31.21, "rotation": 30.37, "x": 25.12 },
	{ "name": "face", "parent": "body3", "length": 213.98, "rotation": -15.41, "x": 117.67, "y": -1.43 },
	{ "name": "mouth-drolling", "parent": "face", "x": 64.92, "y": -14.64 },
	{ "name": "heart", "parent": "root", "x": -119.33, "y": 847.68 },
	{ "name": "sweat-2", "parent": "root", "x": -23.94, "y": 974.56 },
	{ "name": "sweat-1", "parent": "root", "x": -63.45, "y": 942.05 },
	{ "name": "pink-body4", "parent": "pink-body3", "length": 36.82, "rotation": 147.14, "x": 4.86, "y": 46.61 },
	{ "name": "pink-body5", "parent": "pink-body4", "length": 40.24, "rotation": -0.61, "x": 36.82 },
	{ "name": "pink-body6", "parent": "pink-body5", "length": 31.11, "rotation": 1.18, "x": 40.41, "y": -0.3 },
	{ "name": "pink-body7", "parent": "pink-body3", "length": 33.29, "rotation": -165.12, "x": 11.44, "y": -45.75 },
	{ "name": "pink-body8", "parent": "pink-body7", "length": 45.55, "rotation": 13.35, "x": 33.29 },
	{ "name": "pink-body9", "parent": "pink-body8", "length": 45.02, "rotation": 7.39, "x": 45.55 },
	{ "name": "pink-body10", "parent": "pink-body3", "length": 25.84, "rotation": 173.77, "x": -27.14, "y": -2.26 },
	{ "name": "pink-body11", "parent": "pink-body10", "length": 34.41, "rotation": 1.91, "x": 25.84 },
	{ "name": "pink-body12", "parent": "pink-body11", "length": 28.57, "rotation": -0.92, "x": 34.41 },
	{ "name": "leg-1b", "parent": "body", "length": 81.06, "rotation": -112.27, "x": -47.81, "y": -0.44 },
	{ "name": "leg-1b2", "parent": "leg-1b", "length": 89.79, "rotation": 23.29, "x": 81.06 },
	{
		"name": "leg-1b3",
		"parent": "leg-1b2",
		"length": 96.87,
		"rotation": -165.84,
		"x": 89.62,
		"y": -0.4,
		"transform": "noRotationOrReflection"
	},
	{ "name": "leg-2b", "parent": "body", "length": 86.99, "rotation": -112.09, "x": 57.53, "y": -9.61 },
	{ "name": "leg-2b2", "parent": "leg-2b", "length": 88.6, "rotation": 23.38, "x": 86.99 },
	{
		"name": "leg-2b3",
		"parent": "leg-2b2",
		"length": 88.66,
		"rotation": -169.58,
		"x": 89.19,
		"y": 0.08,
		"transform": "noRotationOrReflection"
	},
	{ "name": "target1", "parent": "root", "x": 88.94, "y": 239.11, "color": "ff3f00ff" },
	{ "name": "target2", "parent": "root", "x": -14.27, "y": 252.68, "color": "ff3f00ff" },
	{ "name": "target3", "parent": "root", "x": 460.7, "y": 680.89, "color": "ff3f00ff" },
	{ "name": "target4", "parent": "root", "x": 358.35, "y": 686.53, "color": "ff3f00ff" }
],
"slots": [
	{ "name": "Layer 0", "bone": "root" },
	{ "name": "shadow", "bone": "root", "attachment": "shadow" },
	{ "name": "tv", "bone": "root", "attachment": "tv" },
	{ "name": "leg-1a", "bone": "root", "attachment": "leg-1a" },
	{ "name": "leg-1b", "bone": "leg-1b", "attachment": "leg-1b" },
	{ "name": "hand-1b2", "bone": "hand-1b", "attachment": "hand-1b" },
	{ "name": "hand-1b", "bone": "hand-1b" },
	{ "name": "hand-1a3", "bone": "hand-1a" },
	{ "name": "hand-1a2", "bone": "hand-1a" },
	{ "name": "hand-1a", "bone": "hand-1a" },
	{ "name": "hand-1a-hold", "bone": "hand-1a", "attachment": "hand-1a" },
	{ "name": "tissue", "bone": "tissue5", "attachment": "tissue" },
	{ "name": "body", "bone": "body", "attachment": "body" },
	{ "name": "leg-2a", "bone": "root", "attachment": "leg-2a" },
	{ "name": "leg-2b", "bone": "leg-2b", "attachment": "leg-2b" },
	{ "name": "hand-2b2", "bone": "hand-2b", "attachment": "hand-2b" },
	{ "name": "hand-2b", "bone": "hand-2b" },
	{ "name": "hand-2a", "bone": "hand-2a", "attachment": "hand-2a" },
	{ "name": "hand-2a-hold", "bone": "root" },
	{ "name": "face", "bone": "face", "attachment": "face" },
	{ "name": "eye-1", "bone": "face", "attachment": "eye-1" },
	{ "name": "eye-2", "bone": "face", "attachment": "eye-2" },
	{ "name": "iris-1", "bone": "face", "attachment": "iris-1" },
	{ "name": "iris-2", "bone": "face", "attachment": "iris-2" },
	{ "name": "iris-scare-2", "bone": "face", "attachment": "iris-scare-2" },
	{ "name": "iris-scare-1", "bone": "face", "attachment": "iris-scare-1" },
	{ "name": "blush", "bone": "face", "attachment": "blush" },
	{ "name": "lid-2", "bone": "face", "attachment": "lid-2" },
	{ "name": "lid-1", "bone": "face", "attachment": "lid-1" },
	{ "name": "lid-under-1", "bone": "face", "attachment": "lid-under-1" },
	{ "name": "lid-under-2", "bone": "face", "attachment": "lid-under-2" },
	{ "name": "mouth-drolling", "bone": "mouth-drolling", "attachment": "mouth-drolling" },
	{ "name": "mouth-kiss", "bone": "root" },
	{ "name": "mouth-scare", "bone": "root" },
	{ "name": "brown-1", "bone": "face", "attachment": "brown-1" },
	{ "name": "brown-2", "bone": "face", "attachment": "brown-2" },
	{ "name": "heart", "bone": "heart", "attachment": "heart" },
	{ "name": "sweat-1", "bone": "sweat-1", "attachment": "sweat-1" },
	{ "name": "sweat-2", "bone": "sweat-2", "attachment": "sweat-2" },
	{ "name": "pink-shadow", "bone": "root", "attachment": "pink-shadow" },
	{ "name": "pink-leg-1a", "bone": "root", "attachment": "pink-leg-1a" },
	{ "name": "pink-leg-1b", "bone": "pink-leg-1b", "attachment": "pink-leg-1b" },
	{ "name": "pink-leg-2a", "bone": "root", "attachment": "pink-leg-2a" },
	{ "name": "pink-leg-2b", "bone": "pink-leg-2b", "attachment": "pink-leg-2b" },
	{ "name": "pink-body", "bone": "pink-body", "attachment": "pink-body" },
	{ "name": "face2", "bone": "face2", "attachment": "face2" },
	{ "name": "eye-2 copy", "bone": "face2", "attachment": "eye-2 copy" },
	{ "name": "eye-2 copy 2", "bone": "face2", "attachment": "eye-2 copy 2" },
	{ "name": "iris-22", "bone": "face2", "attachment": "iris-22" },
	{ "name": "iris-11", "bone": "face2", "attachment": "iris-11" },
	{ "name": "hair", "bone": "hair3", "attachment": "hair" },
	{ "name": "Layer 46", "bone": "face2", "attachment": "Layer 46" },
	{ "name": "pink-hand-1c", "bone": "pink-hand-1b2", "attachment": "pink-hand-1c" },
	{ "name": "pink-hand-1b2", "bone": "pink-hand-1b", "attachment": "pink-hand-1b" },
	{ "name": "pink-hand-1b", "bone": "pink-hand-1b" },
	{ "name": "pink-hand-1a", "bone": "pink-hand-1b3", "attachment": "pink-hand-1a" },
	{ "name": "pink-hand-2c2", "bone": "pink-hand-2c", "attachment": "pink-hand-2c" },
	{ "name": "pink-hand-2c", "bone": "pink-hand-2c" },
	{ "name": "pink-hand-2b2", "bone": "pink-hand-2b", "attachment": "pink-hand-2b" },
	{ "name": "pink-hand-2b", "bone": "pink-hand-2b" },
	{ "name": "pink-hand-2a", "bone": "pink-hand-2c2", "attachment": "pink-hand-2a" }
],
"ik": [
	{
		"name": "target1",
		"bones": [ "leg-2b", "leg-2b2" ],
		"target": "target1"
	},
	{
		"name": "target2",
		"order": 1,
		"bones": [ "leg-1b", "leg-1b2" ],
		"target": "target2"
	},
	{
		"name": "target3",
		"order": 2,
		"bones": [ "pink-leg-2b", "pink-leg-2b2" ],
		"target": "target3",
		"bendPositive": false
	},
	{
		"name": "target4",
		"order": 3,
		"bones": [ "pink-leg-1b", "pink-leg-1b2" ],
		"target": "target4"
	}
],
"skins": [
	{
		"name": "default",
		"attachments": {
			"Layer 46": {
				"Layer 46": { "x": 25.35, "y": -30.35, "rotation": -90.26, "width": 27, "height": 20 }
			},
			"blush": {
				"blush": { "x": 126.85, "y": 0.2, "rotation": -82.62, "width": 250, "height": 32 }
			},
			"body": {
				"body": {
					"type": "mesh",
					"uvs": [ 0.59354, 0.01971, 0.66612, 0.11939, 0.64561, 0.2066, 0.69926, 0.31749, 0.81602, 0.40471, 0.94541, 0.4832, 1, 0.61901, 1, 0.69601, 0.96058, 0.80718, 0.85593, 0.91245, 0.69645, 0.9823, 0.47884, 1, 0.27054, 0.91885, 0.15121, 0.82262, 0.04492, 0.67874, 0, 0.53947, 0, 0.39983, 0.04826, 0.27815, 0.12531, 0.13973, 0.25244, 0.03782, 0.41232, 0, 0.64632, 0.80324, 0.52117, 0.71455, 0.43131, 0.61319, 0.34788, 0.50423, 0.30616, 0.38007, 0.32542, 0.19255 ],
					"triangles": [ 14, 15, 24, 23, 24, 3, 15, 25, 24, 15, 16, 25, 24, 25, 3, 2, 25, 26, 25, 2, 3, 16, 17, 25, 2, 26, 1, 26, 20, 0, 25, 17, 26, 26, 17, 18, 1, 26, 0, 18, 19, 26, 26, 19, 20, 11, 21, 10, 11, 22, 21, 11, 12, 22, 10, 21, 9, 12, 13, 22, 9, 21, 8, 13, 23, 22, 13, 14, 23, 8, 21, 7, 7, 21, 6, 6, 21, 22, 22, 4, 5, 22, 23, 4, 22, 5, 6, 14, 24, 23, 23, 3, 4 ],
					"vertices": [ 1, 23, 143.68, -58.55, 1, 2, 22, 179.87, -97.8, 1.5E-4, 23, 110.71, -71.78, 0.99985, 2, 22, 156.99, -82.7, 0.01474, 23, 84.72, -63.07, 0.98526, 2, 22, 120.33, -81.42, 0.17986, 23, 48.96, -71.24, 0.82014, 2, 22, 84.42, -97.18, 0.54399, 23, 18.3, -95.69, 0.45601, 2, 22, 49.79, -116.82, 0.77265, 23, -10.13, -123.56, 0.22735, 2, 22, 5.95, -112.77, 0.90399, 23, -53.54, -130.89, 0.09601, 2, 22, -15.96, -103.51, 0.94727, 23, -77.1, -127.57, 0.05273, 2, 22, -43.87, -81.28, 0.98619, 23, -109.77, -113.25, 0.01381, 2, 22, -63.89, -45.1, 0.99973, 23, -138.41, -83.42, 2.7E-4, 1, 22, -68.64, -0.86, 1, 2, 22, -53.01, 50.18, 0.99999, 23, -152.35, 11.46, 1.0E-5, 2, 22, -10.14, 87.25, 0.9671, 23, -120.43, 58.29, 0.0329, 2, 22, 28.58, 102.5, 0.85002, 23, -86.92, 82.97, 0.14998, 2, 22, 79.63, 109.09, 0.5417, 23, -39.27, 102.44, 0.4583, 2, 22, 123.54, 102.44, 0.2403, 23, 4.87, 107.28, 0.7597, 2, 22, 163.29, 85.65, 0.05393, 23, 47.6, 101.26, 0.94607, 2, 22, 193.34, 60.17, 0.00218, 23, 83.18, 84.35, 0.99782, 1, 23, 122.91, 59.76, 1, 1, 23, 149.76, 24.64, 1, 1, 23, 155.88, -15.62, 1, 2, 22, -12.91, -11.12, 0.99976, 23, -97.86, -37.49, 2.4E-4, 1, 22, 24.22, 6.35, 1, 2, 22, 61.6, 14.36, 0.97682, 23, -32.38, 6.26, 0.02318, 2, 22, 100.54, 20.01, 0.21218, 23, 3.8, 21.71, 0.78782, 1, 23, 43.21, 26.43, 1, 1, 23, 99.93, 13.69, 1 ],
					"hull": 21,
					"edges": [ 32, 34, 34, 36, 36, 38, 38, 40, 40, 0, 0, 2, 2, 4, 4, 6, 6, 8, 8, 10, 10, 12, 30, 32, 30, 28, 28, 26, 26, 24, 24, 22, 22, 20, 20, 18, 18, 16, 12, 14, 16, 14 ],
					"width": 244,
					"height": 309
				}
			},
			"brown-1": {
				"brown-1": {
					"type": "mesh",
					"uvs": [ 1, 1, 0, 1, 0, 0, 1, 0 ],
					"triangles": [ 1, 2, 3, 1, 3, 0 ],
					"vertices": [ 242.22, 51.45, 234.64, 109.96, 279.26, 115.74, 286.84, 57.23 ],
					"hull": 4,
					"edges": [ 0, 2, 2, 4, 4, 6, 0, 6 ],
					"width": 59,
					"height": 45
				}
			},
			"brown-2": {
				"brown-2": {
					"type": "mesh",
					"uvs": [ 1, 1, 0, 1, 0, 0, 1, 0 ],
					"triangles": [ 1, 2, 3, 1, 3, 0 ],
					"vertices": [ 270.73, -83, 261.48, -11.6, 299.16, -6.72, 308.42, -78.12 ],
					"hull": 4,
					"edges": [ 0, 2, 2, 4, 4, 6, 0, 6 ],
					"width": 72,
					"height": 38
				}
			},
			"eye-1": {
				"eye-1": {
					"type": "mesh",
					"uvs": [ 1, 1, 0, 1, 0, 0, 1, 0 ],
					"triangles": [ 1, 2, 3, 1, 3, 0 ],
					"vertices": [ 143.86, -115.58, 128.19, 5.41, 248.18, 20.96, 263.86, -100.03 ],
					"hull": 4,
					"edges": [ 0, 2, 2, 4, 4, 6, 0, 6 ],
					"width": 122,
					"height": 121
				}
			},
			"eye-2": {
				"eye-2": {
					"type": "mesh",
					"uvs": [ 1, 1, 0, 1, 0, 0, 1, 0 ],
					"triangles": [ 1, 2, 3, 1, 3, 0 ],
					"vertices": [ 135.86, 8.42, 122.24, 113.54, 234.31, 128.06, 247.93, 22.94 ],
					"hull": 4,
					"edges": [ 0, 2, 2, 4, 4, 6, 0, 6 ],
					"width": 106,
					"height": 113
				}
			},
			"eye-2 copy": {
				"eye-2 copy": { "x": 78.87, "y": -27.59, "rotation": -90.26, "width": 55, "height": 67 }
			},
			"eye-2 copy 2": {
				"eye-2 copy 2": { "x": 79.17, "y": 38.41, "rotation": -90.26, "width": 55, "height": 67 }
			},
			"face": {
				"face": { "x": 129.36, "y": -7.54, "rotation": -82.62, "width": 308, "height": 283 }
			},
			"face2": {
				"face2": { "x": 66.49, "y": -1.54, "rotation": -90.26, "width": 175, "height": 170 }
			},
			"hair": {
				"hair": {
					"type": "mesh",
					"uvs": [ 0.12788, 0.02774, 0.16453, 0.06533, 0.20601, 0.13375, 0.2422, 0.22568, 0.28725, 0.16528, 0.30523, 0.2924, 0.37783, 0.25583, 0.46481, 0.2628, 0.56545, 0.27847, 0.65891, 0.37425, 0.73654, 0.29066, 0.75523, 0.423, 0.80449, 0.32263, 0.87512, 0.2592, 0.93966, 0.24603, 0.98494, 0.29561, 0.9938, 0.39587, 0.99255, 0.52279, 0.97703, 0.66333, 0.94276, 0.76992, 0.89512, 0.72477, 0.83644, 0.69299, 0.78949, 0.68463, 0.79433, 0.82845, 0.7819, 1, 0.77497, 1, 0.72444, 0.97441, 0.70626, 0.87153, 0.61516, 0.83702, 0.53096, 0.80817, 0.43485, 0.83289, 0.33633, 0.80088, 0.27318, 0.81691, 0.22386, 0.8679, 0.20762, 0.96551, 0.17154, 0.9728, 0.1541, 0.87664, 0.1541, 0.73824, 0.17127, 0.5932, 0.2033, 0.4613, 0.14192, 0.4432, 0.07199, 0.44578, 0.01167, 0.47552, 0, 0.30796, 0.03394, 0.13304, 0.076, 0 ],
					"triangles": [ 39, 3, 5, 21, 22, 11, 31, 5, 6, 39, 5, 31, 32, 38, 39, 38, 33, 37, 39, 31, 32, 30, 31, 6, 32, 33, 38, 36, 37, 33, 34, 36, 33, 35, 36, 34, 9, 10, 11, 28, 29, 9, 27, 28, 9, 9, 22, 27, 22, 9, 11, 27, 22, 23, 26, 27, 23, 25, 26, 23, 24, 25, 23, 29, 7, 8, 29, 8, 9, 7, 30, 6, 29, 30, 7, 16, 14, 15, 14, 17, 13, 16, 17, 14, 13, 20, 21, 13, 17, 20, 18, 20, 17, 19, 20, 18, 21, 12, 13, 21, 11, 12, 3, 4, 5, 40, 0, 1, 40, 1, 2, 40, 2, 3, 39, 40, 3, 44, 40, 41, 0, 44, 45, 40, 44, 0, 43, 44, 41, 42, 43, 41 ],
					"vertices": [ 2, 20, 7.31, -23.15, 0.78933, 19, 49.31, -21.18, 0.21067, 2, 20, -3.87, -22.93, 0.43503, 19, 38.32, -23.24, 0.56497, 3, 20, -17.64, -19.89, 0.08452, 19, 24.22, -23.05, 0.91548, 17, -132.96, 99.52, 0, 3, 20, -31.04, -13.76, 6.0E-5, 19, 9.85, -19.78, 0.99499, 17, -126.93, 86.08, 0.00495, 2, 19, 3.16, -32.61, 0.98525, 17, -112.66, 88.46, 0.01475, 1, 16, 151.77, 42.81, 1, 1, 16, 155.92, 22.39, 1, 1, 16, 155, -2.05, 1, 1, 16, 153.05, -30.32, 1, 1, 16, 141.82, -56.53, 1, 1, 16, 151.42, -78.39, 1, 1, 16, 136.05, -83.57, 1, 2, 17, 18.27, 22.77, 0.89316, 18, -15.37, 19.6, 0.10684, 2, 17, 39.44, 23.09, 0.26779, 18, 5.14, 24.81, 0.73221, 2, 17, 57.05, 18.48, 0.01381, 18, 23.34, 24.39, 0.98619, 1, 18, 35.38, 17.32, 1, 1, 18, 36.61, 5.49, 1, 1, 18, 34.69, -9.11, 1, 2, 17, 50.8, -30.66, 0.03933, 18, 28.62, -24.86, 0.96067, 2, 17, 37.59, -39.1, 0.1196, 18, 17.73, -36.12, 0.8804, 2, 17, 26.72, -29.7, 0.31578, 18, 4.98, -29.49, 0.68422, 2, 17, 12.41, -20.73, 0.82321, 18, -11.03, -24.07, 0.17679, 1, 16, 105.65, -93.06, 1, 1, 16, 88.96, -94.34, 1, 1, 16, 69.08, -90.76, 1, 1, 16, 69.09, -88.81, 1, 1, 16, 72.12, -74.63, 1, 1, 16, 84.08, -69.57, 1, 1, 16, 88.2, -44, 1, 1, 16, 91.65, -20.35, 1, 1, 16, 88.91, 6.67, 1, 1, 16, 92.75, 34.34, 1, 1, 16, 90.97, 52.09, 1, 1, 16, 85.12, 65.98, 1, 1, 16, 73.81, 70.59, 1, 1, 16, 73.02, 80.73, 1, 1, 16, 84.19, 85.58, 1, 1, 16, 100.25, 85.51, 1, 1, 16, 117.05, 80.61, 1, 1, 16, 132.31, 71.54, 1, 2, 20, -14.25, 20.13, 0.11797, 19, 19.42, 16.82, 0.88203, 2, 20, 3.89, 27.71, 0.74175, 19, 35.64, 27.92, 0.25825, 2, 20, 18.34, 37.2, 0.94598, 19, 47.86, 40.15, 0.05402, 2, 20, 28.61, 20.37, 0.99384, 19, 61.33, 25.76, 0.00616, 1, 20, 27.29, -2.01, 1, 2, 20, 22.04, -20.72, 0.99087, 19, 63.24, -15.82, 0.00913 ],
					"hull": 46,
					"edges": [ 6, 4, 4, 2, 2, 0, 0, 90, 90, 88, 88, 86, 86, 84, 84, 82, 82, 80, 80, 78, 78, 76, 76, 74, 74, 72, 72, 70, 70, 68, 68, 66, 66, 64, 64, 62, 62, 60, 60, 58, 58, 56, 56, 54, 54, 52, 52, 50, 6, 8, 8, 10, 10, 12, 12, 14, 14, 16, 16, 18, 18, 20, 20, 22, 22, 24, 24, 26, 26, 28, 44, 46, 48, 50, 46, 48, 44, 42, 42, 40, 40, 38, 38, 36, 36, 34, 34, 32, 30, 28, 32, 30 ],
					"width": 281,
					"height": 116
				}
			},
			"hand-1a-hold": {
				"hand-1a": { "x": 53.66, "y": -4.67, "rotation": -153.71, "width": 162, "height": 148 },
				"hand-1a-hold": {
					"type": "mesh",
					"uvs": [ 1, 1, 0, 1, 0, 0, 1, 0 ],
					"triangles": [ 1, 2, 3, 1, 3, 0 ],
					"vertices": [ -21.27, 44.91, 110.66, 40.52, 106.94, -71.42, -24.99, -67.03 ],
					"hull": 4,
					"edges": [ 0, 2, 2, 4, 4, 6, 0, 6 ],
					"width": 132,
					"height": 112
				}
			},
			"hand-1b2": {
				"hand-1b": {
					"type": "mesh",
					"uvs": [ 0.23035, 0.06886, 0.3829, 0.16496, 0.53049, 0.27667, 0.61075, 0.35356, 0.7108, 0.44865, 0.80805, 0.56276, 0.90308, 0.68887, 1, 0.82729, 1, 1, 0.8771, 1, 0.73333, 0.79922, 0.64917, 0.69054, 0.55976, 0.59205, 0.47911, 0.50884, 0.38969, 0.42394, 0.27924, 0.32884, 0.13372, 0.19469, 0, 0.10809, 0, 0, 0.0964, 0 ],
					"triangles": [ 9, 7, 8, 7, 10, 6, 7, 9, 10, 10, 11, 6, 11, 5, 6, 11, 12, 5, 12, 4, 5, 12, 13, 4, 13, 3, 4, 13, 14, 3, 14, 2, 3, 14, 15, 2, 15, 16, 1, 15, 1, 2, 1, 16, 0, 17, 19, 16, 16, 19, 0, 17, 18, 19 ],
					"vertices": [ 1, 29, 66.62, -17.72, 1, 1, 29, 38.6, -18.37, 1, 2, 29, 9.82, -16.55, 0.97722, 28, 107.75, -12.65, 0.02278, 2, 29, -7.29, -13.44, 0.27253, 28, 90.53, -15.04, 0.72747, 1, 28, 69.16, -18.09, 1, 1, 28, 45.65, -18.95, 1, 1, 28, 20.83, -18.39, 1, 1, 28, -5.72, -16.87, 1, 1, 28, -27.53, -0.18, 1, 1, 28, -16.03, 14.85, 1, 1, 28, 22.78, 13.03, 1, 1, 28, 44.38, 12.82, 1, 2, 29, -22.22, 22.29, 3.0E-4, 28, 65.18, 14.24, 0.9997, 2, 29, -4.5, 18.39, 0.21449, 28, 83.24, 16.06, 0.78551, 2, 29, 14.49, 15.02, 0.9404, 28, 102.33, 18.8, 0.0596, 1, 29, 37.06, 12.15, 1, 1, 29, 67.6, 7.2, 1, 1, 29, 92.38, 7.46, 1, 1, 29, 102.08, -6.72, 1, 1, 29, 89.83, -15.1, 1 ],
					"hull": 20,
					"edges": [ 34, 36, 34, 32, 32, 30, 30, 28, 28, 26, 26, 24, 24, 22, 22, 20, 16, 18, 20, 18, 36, 38, 38, 0, 0, 2, 2, 4, 4, 6, 6, 8, 8, 10, 10, 12, 16, 14, 12, 14 ],
					"width": 154,
					"height": 159
				}
			},
			"hand-2a": {
				"hand-2a": {
					"type": "mesh",
					"uvs": [ 0.77668, 0.08383, 0.8207, 0.16546, 0.77707, 0.23078, 0.73917, 0.29259, 0.7785, 0.34387, 0.88412, 0.30172, 0.98431, 0.41427, 0.98971, 0.5716, 0.97023, 0.67099, 0.87423, 0.75814, 0.75205, 0.73242, 0.65168, 0.79385, 0.52223, 0.79956, 0.49023, 0.90814, 0.44514, 1, 0.29386, 1, 0.18219, 0.87555, 0.12963, 0.7094, 0, 0.63824, 0, 0.50965, 0.07309, 0.35361, 0.11555, 0.14644, 0.30594, 0.1155, 0.42921, 0.23388, 0.54153, 0.26347, 0.5417, 0.18657, 0.58322, 0.07975, 0.68451, 0.03571 ],
					"triangles": [ 4, 6, 7, 6, 4, 5, 7, 10, 4, 8, 10, 7, 9, 10, 8, 4, 11, 24, 10, 11, 4, 12, 24, 11, 16, 17, 12, 13, 16, 12, 15, 16, 13, 14, 15, 13, 2, 0, 1, 26, 0, 2, 0, 26, 27, 2, 25, 26, 3, 25, 2, 24, 25, 3, 17, 18, 19, 20, 22, 23, 22, 20, 21, 17, 20, 23, 17, 19, 20, 3, 4, 24, 12, 23, 24, 17, 23, 12 ],
					"vertices": [ 3, 27, -23.04, -78.38, 0.69701, 26, 4.25, -74.03, 0.05002, 25, 65.82, -73.29, 0.25297, 3, 27, -34.12, -67.51, 0.67062, 26, -5, -61.57, 0.06227, 25, 58.3, -59.71, 0.26711, 3, 27, -30.59, -54.87, 0.62208, 26, 0.46, -49.63, 0.08813, 25, 65.29, -48.6, 0.2898, 3, 27, -27.78, -43.08, 0.45421, 26, 5.08, -38.42, 0.15184, 25, 71.35, -38.1, 0.39395, 3, 27, -36.58, -36.84, 0.16726, 26, -2.64, -30.89, 0.10266, 25, 64.7, -29.61, 0.73008, 3, 27, -51.04, -48.87, 0.0247, 26, -18.8, -40.51, 0.00124, 25, 47.41, -37.02, 0.97406, 3, 27, -72.52, -35.87, 3.3E-4, 26, -37.99, -24.32, 1.0E-5, 25, 30.53, -18.42, 0.99966, 2, 26, -42.86, 1.68, 0.01437, 25, 29.14, 7.99, 0.98563, 2, 26, -42.2, 18.67, 0.11109, 25, 32.04, 24.74, 0.88891, 2, 26, -28.75, 35.53, 0.32769, 25, 47.61, 39.68, 0.67231, 2, 26, -8.17, 34.3, 0.73071, 25, 67.84, 35.74, 0.26929, 2, 26, 6.65, 47, 0.9792, 25, 84.21, 46.36, 0.0208, 2, 27, -19.49, 48.93, 0.00603, 26, 27.62, 51.17, 0.99397, 3, 27, -19.99, 67.92, 0.00525, 26, 30.09, 70, 0.99475, 25, 110.48, 66.06, 0, 3, 27, -17.58, 84.88, 0.00592, 26, 35.12, 86.38, 0.99408, 25, 117.63, 81.63, 0, 3, 27, 6.2, 92.45, 0.04477, 26, 59.79, 90.14, 0.95523, 25, 142.59, 82.09, 0, 3, 27, 30.1, 78.11, 0.18143, 26, 81.16, 72.25, 0.81857, 25, 161.4, 61.53, 0, 3, 27, 46.83, 54.14, 0.5658, 26, 93.94, 45.97, 0.4342, 25, 170.6, 33.79, 0, 3, 27, 70.83, 49.23, 0.82619, 26, 116.89, 37.37, 0.17381, 25, 192.21, 22.23, 0, 3, 27, 77.38, 28.65, 0.91305, 26, 120.15, 16.02, 0.08695, 25, 192.61, 0.64, 0, 3, 27, 73.84, 0.01, 0.99566, 26, 112.18, -11.72, 0.00434, 25, 181.04, -25.8, 0, 1, 27, 77.72, -35.28, 1, 1, 27, 49.36, -49.76, 1, 3, 27, 23.95, -36.97, 0.98358, 26, 57.12, -40.46, 0.002, 25, 122.67, -47.01, 0.01442, 3, 27, 4.78, -37.85, 0.79077, 26, 38.05, -38.34, 0.08312, 25, 104.05, -42.38, 0.1261, 3, 27, 8.67, -50.17, 0.72912, 26, 39.97, -51.12, 0.07181, 25, 104.26, -55.3, 0.19907, 3, 27, 7.58, -69.35, 0.72439, 26, 35.91, -69.89, 0.04893, 25, 97.75, -73.37, 0.22668, 3, 27, -6.1, -81.47, 0.71679, 26, 20.5, -79.73, 0.04373, 25, 81.17, -81.08, 0.23948 ],
					"hull": 28,
					"edges": [ 48, 46, 46, 44, 44, 42, 42, 40, 40, 38, 36, 38, 36, 34, 34, 32, 32, 30, 28, 30, 28, 26, 26, 24, 24, 22, 22, 20, 20, 18, 18, 16, 16, 14, 14, 12, 12, 10, 8, 10, 8, 6, 6, 4, 4, 2, 48, 50, 50, 52, 52, 54, 54, 0, 0, 2 ],
					"width": 165,
					"height": 168
				}
			},
			"hand-2a-hold": {
				"hand-2a-hold": { "x": 464.5, "y": -839.5, "width": 125, "height": 111 }
			},
			"hand-2b2": {
				"hand-2b": { "x": 94.8, "y": -11.39, "rotation": 169.65, "width": 192, "height": 47 }
			},
			"heart": {
				"heart": { "x": -1.23, "y": 5.95, "width": 57, "height": 66 }
			},
			"iris-1": {
				"iris-1": {
					"type": "mesh",
					"uvs": [ 1, 1, 0, 1, 0, 0, 1, 0 ],
					"triangles": [ 1, 2, 3, 1, 3, 0 ],
					"vertices": [ 173.22, 31.41, 169.24, 62.16, 196.01, 65.63, 200, 34.88 ],
					"hull": 4,
					"edges": [ 0, 2, 2, 4, 4, 6, 0, 6 ],
					"width": 31,
					"height": 27
				}
			},
			"iris-11": {
				"iris-11": { "x": 64.42, "y": -16.53, "rotation": -90.26, "width": 13, "height": 18 }
			},
			"iris-2": {
				"iris-2": {
					"type": "mesh",
					"uvs": [ 1, 1, 0, 1, 0, 0, 1, 0 ],
					"triangles": [ 1, 2, 3, 1, 3, 0 ],
					"vertices": [ 174.64, -41.79, 170.14, -7.08, 203.86, -2.71, 208.36, -37.42 ],
					"hull": 4,
					"edges": [ 0, 2, 2, 4, 4, 6, 0, 6 ],
					"width": 35,
					"height": 34
				}
			},
			"iris-22": {
				"iris-22": { "x": 65.2, "y": 45.97, "rotation": -90.26, "width": 14, "height": 17 }
			},
			"iris-scare-1": {
				"iris-scare-1": {
					"type": "mesh",
					"uvs": [ 1, 1, 0, 1, 0, 0, 1, 0 ],
					"triangles": [ 1, 2, 3, 1, 3, 0 ],
					"vertices": [ 193.89, -93.51, 191.83, -77.64, 212.66, -74.94, 214.71, -90.81 ],
					"hull": 4,
					"edges": [ 0, 2, 2, 4, 4, 6, 0, 6 ],
					"width": 16,
					"height": 21
				}
			},
			"iris-scare-2": {
				"iris-scare-2": {
					"type": "mesh",
					"uvs": [ 1, 1, 0, 1, 0, 0, 1, 0 ],
					"triangles": [ 1, 2, 3, 1, 3, 0 ],
					"vertices": [ 175.07, 36.15, 172.76, 54, 197.55, 57.21, 199.86, 39.36 ],
					"hull": 4,
					"edges": [ 0, 2, 2, 4, 4, 6, 0, 6 ],
					"width": 18,
					"height": 25
				}
			},
			"leg-1a": {
				"leg-1a": {
					"type": "mesh",
					"uvs": [ 1, 0.13856, 1, 0.25705, 0.94524, 0.31386, 1, 0.5265, 1, 0.66609, 0.9606, 0.82679, 0.77424, 0.94687, 0.52798, 1, 0.28299, 1, 0, 0.88121, 0, 0.72615, 0.08509, 0.46644, 0.27325, 0.29925, 0.4678, 0.32523, 0.39485, 0.20349, 0.52924, 0, 0.83644, 0 ],
					"triangles": [ 16, 13, 15, 13, 16, 2, 2, 3, 13, 13, 14, 15, 1, 2, 0, 2, 16, 0, 6, 7, 13, 8, 10, 11, 11, 12, 8, 7, 8, 13, 8, 12, 13, 3, 6, 13, 4, 5, 6, 8, 9, 10, 3, 4, 6 ],
					"vertices": [ 2, 55, -65.87, -48.79, 0.00132, 54, 49.28, 52.23, 0.99868, 2, 55, -61.68, -32.62, 0.01723, 54, 65.98, 51.94, 0.98277, 2, 55, -50.12, -26.12, 0.07721, 54, 75, 42.22, 0.92279, 2, 55, -49.67, 14.47, 0.52414, 54, 114.57, 51.27, 0.47586, 2, 55, -43.59, 38.23, 0.75791, 54, 139.1, 50.93, 0.24209, 2, 55, -30.47, 61.63, 0.92528, 54, 164.92, 43.64, 0.07472, 2, 55, 5.66, 71.11, 0.99998, 54, 182.59, 10.74, 2.0E-5, 1, 55, 49.21, 67.38, 1, 1, 55, 90.71, 56.6, 1, 1, 55, 134.53, 28.29, 1, 1, 55, 129.15, 7.58, 1, 2, 55, 105.66, -23.68, 0.98571, 54, 113.83, -108.66, 0.01429, 2, 55, 67.39, -40.23, 0.87177, 54, 88.78, -75.33, 0.12823, 2, 55, 32.81, -38.71, 0.3919, 54, 82.17, -41.35, 0.6081, 2, 55, 39.49, -64.23, 0.11546, 54, 58.92, -53.82, 0.88454, 2, 55, 9.1, -87.86, 0.0079, 54, 28.84, -29.8, 0.9921, 1, 54, 29.62, 23.95, 1 ],
					"hull": 17,
					"edges": [ 26, 24, 24, 22, 22, 20, 26, 28, 28, 30, 30, 32, 32, 0, 0, 2, 4, 2, 4, 6, 6, 8, 8, 10, 10, 12, 12, 14, 14, 16, 18, 20, 16, 18 ],
					"width": 175,
					"height": 138
				}
			},
			"leg-1b": {
				"leg-1b": {
					"type": "mesh",
					"uvs": [ 1, 0.14646, 0.7319, 0.30209, 0.62269, 0.47047, 0.60328, 0.63886, 0.59843, 0.82, 0.58872, 1, 0, 1, 0, 0.79831, 0, 0.59038, 0, 0.42586, 0.11549, 0.26382, 0.30478, 0.10819, 0.53533, 0, 1, 0 ],
					"triangles": [ 3, 8, 2, 8, 9, 2, 9, 10, 2, 2, 10, 1, 10, 11, 1, 11, 12, 1, 1, 12, 0, 12, 13, 0, 5, 6, 4, 6, 7, 4, 4, 7, 3, 7, 8, 3 ],
					"vertices": [ 1, 53, -1.62, 27.83, 1, 1, 53, 29.18, 16.69, 1, 2, 54, -14.95, 26.42, 0.03473, 53, 56.88, 18.36, 0.96527, 2, 54, 11.29, 24.37, 0.72351, 53, 81.79, 26.84, 0.27649, 2, 54, 39.53, 23.47, 0.99965, 53, 108.09, 37.18, 3.5E-4, 1, 54, 67.59, 22.17, 1, 1, 54, 66.74, -26.1, 1, 2, 54, 35.28, -25.54, 0.99994, 53, 123.56, -9.51, 6.0E-5, 2, 54, 2.85, -24.96, 0.60591, 53, 93.54, -21.8, 0.39409, 2, 54, -22.82, -24.5, 0.0262, 53, 69.79, -31.53, 0.9738, 1, 53, 42.81, -32.35, 1, 1, 53, 14.46, -27.18, 1, 1, 53, -8.32, -16.09, 1, 1, 53, -22.76, 19.17, 1 ],
					"hull": 14,
					"edges": [ 18, 20, 20, 22, 24, 26, 22, 24, 16, 18, 12, 14, 14, 16, 10, 12, 10, 8, 8, 6, 6, 4, 4, 2, 0, 26, 2, 0 ],
					"width": 82,
					"height": 156
				}
			},
			"leg-2a": {
				"leg-2a": {
					"type": "mesh",
					"uvs": [ 1, 0.13345, 1, 0.2648, 0.93885, 0.30397, 1, 0.51597, 0.96248, 0.86162, 0.6263, 1, 0.24107, 1, 0, 0.90533, 0, 0.66256, 0.10771, 0.42528, 0.28809, 0.30984, 0.46003, 0.31625, 0.39429, 0.16875, 0.5224, 0, 0.83891, 0 ],
					"triangles": [ 2, 11, 14, 11, 13, 14, 11, 12, 13, 1, 2, 0, 2, 14, 0, 2, 3, 11, 4, 5, 3, 6, 11, 5, 6, 8, 9, 11, 6, 10, 6, 9, 10, 6, 7, 8, 3, 5, 11 ],
					"vertices": [ 2, 58, -56.92, -31.91, 0.03935, 57, 48, 50.68, 0.96065, 2, 58, -53.41, -14.13, 0.10203, 57, 66.12, 50.28, 0.89797, 2, 58, -41.86, -10.9, 0.23794, 57, 71.28, 39.46, 0.76206, 2, 58, -46.7, 19.88, 0.08847, 57, 100.77, 49.5, 0.91153, 2, 58, -31.03, 65.41, 0.184, 57, 148.31, 41.86, 0.816, 1, 58, 30.39, 72.76, 1, 1, 58, 96.53, 59.71, 1, 1, 58, 135.39, 38.73, 1, 1, 58, 128.91, 5.86, 1, 1, 58, 104.08, -22.62, 1, 2, 58, 70.03, -32.14, 0.99157, 57, 69.53, -74.42, 0.00843, 2, 58, 40.68, -25.45, 0.67652, 57, 71.09, -44.35, 0.32348, 2, 58, 48.02, -47.64, 0.27842, 57, 50.48, -55.4, 0.72158, 2, 58, 21.52, -66.15, 0.07805, 57, 27.7, -32.46, 0.92195, 1, 57, 28.95, 22.92, 1 ],
					"hull": 15,
					"edges": [ 22, 24, 24, 26, 22, 20, 20, 18, 18, 16, 14, 16, 14, 12, 10, 12, 10, 8, 4, 6, 4, 2, 26, 28, 2, 0, 28, 0, 6, 8 ],
					"width": 175,
					"height": 138
				}
			},
			"leg-2b": {
				"leg-2b": {
					"type": "mesh",
					"uvs": [ 1, 0.15108, 0.80739, 0.24184, 0.68154, 0.33723, 0.61422, 0.47877, 0.59959, 0.62646, 0.60252, 0.788, 0.6113, 1, 0, 1, 0, 0.82272, 0, 0.66607, 0, 0.53809, 0.07364, 0.34706, 0.21537, 0.17132, 0.42615, 0.04524, 0.68054, 0, 1, 0 ],
					"triangles": [ 4, 10, 3, 10, 11, 3, 3, 11, 2, 11, 12, 2, 2, 12, 1, 12, 13, 1, 13, 14, 1, 1, 14, 0, 14, 15, 0, 6, 8, 5, 6, 7, 8, 8, 9, 5, 9, 4, 5, 9, 10, 4 ],
					"vertices": [ 1, 56, 4.86, 26.83, 1, 1, 56, 23.92, 17.52, 1, 1, 56, 41.59, 13.56, 1, 2, 57, -14.34, 24.45, 0.04172, 56, 64.12, 16.75, 0.95828, 2, 57, 8.67, 22.73, 0.65912, 56, 85.92, 24.3, 0.34088, 2, 57, 33.87, 22.4, 0.99711, 56, 109.18, 34, 0.00289, 1, 57, 66.95, 22.38, 1, 1, 57, 65.82, -27.74, 1, 1, 57, 38.17, -27.11, 1, 2, 57, 13.74, -26.56, 0.9543, 56, 110.14, -18.93, 0.0457, 2, 57, -6.22, -26.11, 0.46528, 56, 91.64, -26.44, 0.53472, 2, 57, -35.88, -19.41, 8.5E-4, 56, 61.76, -32.05, 0.99915, 1, 56, 31.98, -31.6, 1, 1, 56, 7.26, -22.98, 1, 1, 56, -7.13, -6.31, 1, 1, 56, -16.98, 17.97, 1 ],
					"hull": 16,
					"edges": [ 14, 16, 16, 18, 18, 20, 20, 22, 22, 24, 24, 26, 28, 30, 26, 28, 0, 30, 2, 0, 2, 4, 4, 6, 6, 8, 8, 10, 12, 14, 10, 12 ],
					"width": 82,
					"height": 156
				}
			},
			"lid-1": {
				"lid-1": { "x": 219.5, "y": -41.75, "rotation": -82.62, "width": 113, "height": 59 }
			},
			"lid-2": {
				"lid-2": { "x": 207.55, "y": 66.11, "rotation": -82.62, "width": 110, "height": 55 }
			},
			"lid-under-1": {
				"lid-under-1": {
					"type": "mesh",
					"uvs": [ 1, 1, 0, 1, 0, 0, 1, 0 ],
					"triangles": [ 1, 2, 3, 1, 3, 0 ],
					"vertices": [ 139.47, 35.11, 131.11, 99.57, 149.96, 102.01, 158.31, 37.55 ],
					"hull": 4,
					"edges": [ 0, 2, 2, 4, 4, 6, 0, 6 ],
					"width": 65,
					"height": 19
				}
			},
			"lid-under-2": {
				"lid-under-2": {
					"type": "mesh",
					"uvs": [ 1, 1, 0, 1, 0, 0, 1, 0 ],
					"triangles": [ 1, 2, 3, 1, 3, 0 ],
					"vertices": [ 147.92, -107.99, 138.54, -35.6, 163.34, -32.38, 172.72, -104.78 ],
					"hull": 4,
					"edges": [ 0, 2, 2, 4, 4, 6, 0, 6 ],
					"width": 73,
					"height": 25
				}
			},
			"mouth-drolling": {
				"mouth-drolling": { "x": 2.19, "y": 5.08, "rotation": -82.62, "width": 146, "height": 79 },
				"mouth-kiss": { "x": -3.01, "y": 56.84, "rotation": -82.62, "width": 38, "height": 58 },
				"mouth-scare": { "x": 0.91, "y": 17.13, "rotation": -82.62, "width": 102, "height": 73 }
			},
			"pink-body": {
				"pink-body": {
					"type": "mesh",
					"uvs": [ 0.45184, 0.01921, 0.56473, 0.0546, 0.6618, 0.09942, 0.69556, 0.21029, 0.72827, 0.34121, 0.77258, 0.46388, 0.82217, 0.58065, 0.87281, 0.66911, 0.93822, 0.74931, 1, 0.80829, 1, 0.90503, 0.9167, 0.98107, 0.7707, 0.98406, 0.65072, 0.97499, 0.51611, 1, 0.38612, 0.98097, 0.26099, 0.96472, 0.14957, 0.92772, 0.04946, 0.89522, 0, 0.84373, 0, 0.76912, 0.06952, 0.64097, 0.13213, 0.52466, 0.18608, 0.42235, 0.24195, 0.31035, 0.28337, 0.17897, 0.29964, 0.05765, 0.37127, 0, 0.22342, 0.76624, 0.28501, 0.63617, 0.35003, 0.48697, 0.39452, 0.31673, 0.6409, 0.7605, 0.6084, 0.63043, 0.57589, 0.47166, 0.55535, 0.2823, 0.46042, 0.78222, 0.45836, 0.64698 ],
					"triangles": [ 31, 35, 34, 0, 26, 27, 0, 25, 26, 35, 0, 1, 35, 1, 2, 35, 2, 3, 31, 25, 0, 31, 0, 35, 24, 25, 31, 35, 3, 4, 30, 31, 34, 37, 30, 34, 37, 34, 33, 29, 30, 37, 36, 37, 33, 36, 33, 32, 29, 36, 28, 37, 36, 29, 14, 36, 32, 36, 15, 28, 16, 28, 15, 14, 15, 36, 32, 13, 14, 8, 9, 10, 13, 32, 12, 7, 12, 32, 12, 7, 8, 10, 11, 8, 8, 11, 12, 33, 34, 5, 33, 5, 6, 32, 33, 6, 32, 6, 7, 34, 35, 4, 34, 4, 5, 30, 24, 31, 23, 24, 30, 29, 23, 30, 21, 22, 29, 28, 21, 29, 20, 21, 28, 22, 23, 29, 18, 19, 20, 28, 18, 20, 17, 18, 28, 17, 28, 16 ],
					"vertices": [ 1, 3, 70.17, 0.96, 1, 1, 3, 61.91, -23.23, 1, 1, 3, 52.01, -43.87, 1, 1, 3, 30.02, -50.02, 1, 2, 47, 9.63, 7.76, 0.624, 3, 4.13, -55.73, 0.376, 2, 47, 35.36, 9.53, 0.3778, 48, 4.22, 8.8, 0.6222, 1, 48, 29.29, 6.16, 1, 2, 48, 49.76, 6.59, 0.06206, 49, 5.03, 5.99, 0.93794, 1, 49, 26.15, 7.31, 1, 1, 49, 43.55, 10.6, 1, 3, 49, 58.26, -1.22, 0.99567, 52, 11.46, 113.44, 0.00423, 51, 47.7, 113.24, 1.0E-4, 3, 49, 58.44, -24.67, 0.93904, 52, 26.94, 95.82, 0.05209, 51, 62.89, 95.38, 0.00888, 4, 48, 90.58, -44.42, 0.01467, 49, 38.95, -49.84, 0.68243, 52, 28.67, 64.04, 0.24443, 51, 64.11, 63.57, 0.05847, 4, 48, 75.44, -65.82, 0.03073, 49, 21.18, -69.11, 0.31042, 52, 27.85, 37.84, 0.57698, 51, 62.86, 37.38, 0.08186, 3, 48, 64.31, -93.4, 0.002, 49, 6.6, -95.04, 0.02376, 52, 33.78, 8.69, 0.97425, 4, 46, 14, 83.92, 0.07655, 45, 52.69, 83.89, 0.03364, 52, 31.1, -19.77, 0.85133, 51, 65.18, -20.27, 0.03848, 4, 46, 24.51, 58.54, 0.32067, 45, 63.71, 58.74, 0.10662, 52, 28.92, -47.14, 0.45767, 51, 62.56, -47.6, 0.11504, 4, 46, 30.02, 33.81, 0.66347, 45, 69.73, 34.13, 0.09062, 52, 22.58, -71.68, 0.17733, 51, 55.83, -72.03, 0.06859, 4, 46, 35.11, 11.66, 0.95279, 45, 75.27, 12.08, 0.00847, 52, 17.04, -93.71, 0.02809, 51, 49.93, -93.98, 0.01065, 1, 46, 31.58, -2.64, 1, 1, 46, 18.87, -9.72, 1, 2, 46, -10.33, -8.64, 0.00915, 45, 30.26, -9.15, 0.99085, 2, 45, 3.79, -8.8, 0.8346, 44, 40.52, -8.84, 0.1654, 2, 44, 17.36, -8.5, 0.704, 3, -5.11, 63.17, 0.296, 4, 44, -7.65, -8.73, 0.36155, 47, -28.96, -91.16, 0.0133, 50, -37.25, -56.43, 0.00115, 3, 16.02, 49.8, 0.624, 1, 3, 41.1, 39.36, 1, 1, 3, 64.52, 34.5, 1, 1, 3, 74.88, 18.29, 1, 6, 46, -5.32, 32.56, 0.28151, 45, 34.43, 32.14, 0.38525, 44, 71.59, 31.77, 0.00929, 52, -9.47, -56.73, 0.13157, 51, 24.03, -56.57, 0.17448, 50, 51.73, -55.73, 0.0179, 6, 46, -34.01, 31.95, 0.02796, 45, 5.75, 30.94, 0.36869, 44, 42.9, 30.88, 0.19754, 52, -35.3, -44.22, 0.02299, 51, -1.6, -43.65, 0.21504, 50, 25.69, -43.68, 0.16779, 5, 45, -26.52, 28.51, 0.02377, 44, 10.61, 28.79, 0.5154, 47, 11.09, -79.44, 0.00552, 51, -30.97, -30.06, 0.0253, 50, -4.12, -31.07, 0.43001, 4, 44, -23.03, 20.78, 0.33484, 47, -17.47, -59.93, 0.11996, 50, -37.79, -23.15, 0.1372, 3, 12.93, 16.65, 0.408, 5, 48, 38.63, -45.85, 0.22718, 49, -12.76, -44.58, 0.17242, 52, -13.87, 34.19, 0.14808, 51, 21.09, 34.41, 0.38444, 50, 45.77, 35.09, 0.06789, 6, 47, 55.14, -34.56, 0.029, 48, 13.29, -38.68, 0.31471, 49, -36.97, -34.21, 0.01946, 52, -38.96, 26.19, 0.00573, 51, -4.13, 26.81, 0.23545, 50, 20.82, 26.66, 0.39566, 5, 44, -16.36, 70.09, 0.00954, 47, 23.51, -31.7, 0.3566, 48, -16.83, -28.59, 0.06175, 51, -34.94, 19.11, 0.00172, 50, -9.72, 17.94, 0.57038, 4, 44, -46.23, 47.92, 0.0816, 47, -12.98, -24.51, 0.32179, 50, -46.36, 11.5, 0.08461, 3, 17.69, -18.73, 0.512, 5, 46, -27.74, 79.21, 0.00521, 45, 11.06, 78.33, 0.01008, 44, 48.72, 78.2, 8.5E-4, 52, -8.22, -4.98, 0.02239, 51, 26.11, -4.85, 0.96146, 5, 46, -50.56, 65.99, 0.00105, 45, -11.49, 64.64, 0.01362, 44, 26.02, 64.76, 0.01389, 51, -0.25, -5.82, 0.49713, 50, 25.78, -5.83, 0.47431 ],
					"hull": 28,
					"edges": [ 40, 42, 42, 44, 44, 46, 46, 48, 48, 50, 50, 52, 52, 54, 38, 40, 38, 36, 36, 34, 34, 32, 32, 30, 30, 28, 28, 26, 26, 24, 24, 22, 22, 20, 54, 0, 0, 2, 2, 4, 4, 6, 6, 8, 8, 10, 10, 12, 12, 14, 14, 16, 20, 18, 16, 18 ],
					"width": 218,
					"height": 195
				}
			},
			"pink-hand-1a": {
				"pink-hand-1a": {
					"type": "mesh",
					"uvs": [ 1, 1, 0, 1, 0, 0, 1, 0 ],
					"triangles": [ 1, 2, 3, 1, 3, 0 ],
					"vertices": [ 63.2, -11.53, -1.7, -47.07, -32.44, 9.07, 32.46, 44.61 ],
					"hull": 4,
					"edges": [ 0, 2, 2, 4, 4, 6, 0, 6 ],
					"width": 74,
					"height": 64
				}
			},
			"pink-hand-1b2": {
				"pink-hand-1b": { "x": 31.35, "y": 1.73, "rotation": 158.75, "width": 79, "height": 50 }
			},
			"pink-hand-1c": {
				"pink-hand-1c": { "x": 28.15, "y": 26.59, "rotation": 53.41, "width": 92, "height": 50 }
			},
			"pink-hand-2a": {
				"pink-hand-2a": { "x": 23.26, "y": 1.59, "rotation": 140.39, "width": 74, "height": 64 }
			},
			"pink-hand-2b2": {
				"pink-hand-2b": { "x": 32.97, "y": 0.3, "rotation": 23.7, "width": 79, "height": 50 }
			},
			"pink-hand-2c2": {
				"pink-hand-2c": { "x": 23.44, "y": -25, "rotation": 121.8, "width": 92, "height": 50 }
			},
			"pink-leg-1a": {
				"pink-leg-1a": {
					"type": "mesh",
					"uvs": [ 1, 0.14133, 1, 0.24483, 0.94229, 0.30425, 1, 0.53808, 1, 0.80258, 0.80362, 0.93227, 0.53687, 1, 0.26083, 1, 0, 0.87818, 0, 0.6956, 0.1146, 0.43123, 0.27247, 0.3053, 0.45716, 0.31897, 0.38707, 0.172, 0.54957, 0, 0.85352, 0 ],
					"triangles": [ 5, 6, 12, 3, 5, 12, 4, 5, 3, 2, 14, 15, 14, 2, 12, 12, 13, 14, 1, 2, 0, 2, 15, 0, 7, 9, 10, 6, 7, 12, 7, 11, 12, 7, 10, 11, 7, 8, 9, 3, 12, 2 ],
					"vertices": [ 2, 15, -41.04, -20.39, 0.31518, 11, 39.45, 32.67, 0.68482, 2, 15, -37.94, -12.26, 0.38109, 11, 48.14, 32.39, 0.61891, 2, 15, -30.39, -9.8, 0.50693, 11, 52.93, 26.06, 0.49307, 2, 15, -29.16, 10.75, 0.68382, 11, 72.76, 31.6, 0.31618, 2, 15, -21.25, 31.51, 0.2174, 11, 94.97, 30.88, 0.7826, 2, 15, 2.27, 34.2, 0.00514, 11, 105.18, 9.53, 0.99486, 2, 15, 30.96, 29.35, 0.64014, 11, 109.94, -19.18, 0.35986, 2, 15, 58.56, 18.83, 0.98756, 11, 108.99, -48.7, 0.01244, 1, 15, 80.99, -0.68, 1, 1, 15, 75.53, -15.01, 1, 2, 15, 56.16, -31.39, 0.99669, 11, 60.73, -62.8, 0.00331, 2, 15, 36.6, -35.26, 0.93299, 11, 50.71, -45.58, 0.06701, 2, 15, 18.55, -27.14, 0.47346, 11, 52.49, -25.86, 0.52654, 2, 15, 21.16, -41.35, 0.13025, 11, 39.91, -32.96, 0.86975, 2, 15, -0.24, -48.65, 0.00822, 11, 26.03, -15.12, 0.99178, 2, 15, -30.62, -37.06, 0.10704, 11, 27.08, 17.39, 0.89296 ],
					"hull": 16,
					"edges": [ 24, 22, 22, 20, 20, 18, 16, 18, 16, 14, 12, 14, 12, 10, 10, 8, 8, 6, 4, 6, 24, 26, 26, 28, 28, 30, 30, 0, 0, 2, 4, 2 ],
					"width": 107,
					"height": 84
				}
			},
			"pink-leg-1b": {
				"pink-leg-1b": {
					"type": "mesh",
					"uvs": [ 1, 0.20057, 0.78515, 0.31591, 0.64486, 0.44828, 0.59456, 0.58066, 0.58133, 0.72746, 0.59192, 0.84411, 0.60515, 1, 0, 1, 0, 0.82657, 0, 0.70541, 0, 0.48793, 0.0817, 0.35745, 0.24483, 0.21143, 0.44562, 0.09182, 0.74052, 0, 1, 0 ],
					"triangles": [ 3, 10, 2, 10, 11, 2, 11, 12, 2, 2, 12, 1, 12, 13, 1, 1, 13, 0, 0, 13, 14, 14, 15, 0, 7, 5, 6, 7, 8, 5, 8, 4, 5, 8, 9, 4, 4, 9, 3, 9, 10, 3 ],
					"vertices": [ 1, 10, 20.75, 12.23, 1, 1, 10, 36.73, 9.8, 1, 2, 11, -6.71, 19.04, 0.06193, 10, 52.03, 11.5, 0.93807, 2, 11, 6.83, 16.04, 0.62335, 10, 64.77, 17, 0.37665, 2, 11, 21.92, 14.87, 0.98495, 10, 77.68, 24.9, 0.01505, 1, 11, 33.95, 15.03, 1, 1, 11, 50.02, 15.18, 1, 2, 11, 49.02, -15.66, 0.99999, 10, 117.53, 16.03, 1.0E-5, 2, 11, 31.17, -15.09, 0.99997, 10, 102.73, 6.04, 3.0E-5, 2, 11, 18.7, -14.69, 0.99997, 10, 92.38, -0.95, 3.0E-5, 2, 11, -3.69, -13.96, 0.53003, 10, 73.82, -13.48, 0.46997, 2, 11, -16.99, -9.37, 0.02716, 10, 60.34, -17.54, 0.97284, 1, 10, 43.22, -19.06, 1, 1, 10, 27.28, -17.47, 1, 1, 10, 11.03, -10.29, 1, 1, 10, 3.63, 0.68, 1 ],
					"hull": 16,
					"edges": [ 14, 16, 16, 18, 18, 20, 20, 22, 22, 24, 24, 26, 28, 30, 26, 28, 12, 14, 10, 12, 10, 8, 8, 6, 6, 4, 4, 2, 0, 30, 2, 0 ],
					"width": 51,
					"height": 103
				}
			},
			"pink-leg-2a": {
				"pink-leg-2a": {
					"type": "mesh",
					"uvs": [ 0.50836, 0.04801, 0.60182, 0.20801, 0.542, 0.32801, 0.68057, 0.3135, 0.81575, 0.36801, 0.9203, 0.48766, 0.97944, 0.66051, 1, 0.81906, 0.92535, 0.91635, 0.74802, 0.97987, 0.47356, 0.98567, 0.22902, 0.94276, 0.05135, 0.84212, 0, 0.66448, 0.02612, 0.42095, 0.0663, 0.31271, 0, 0.24095, 0, 0.1633, 0.09621, 0.04683, 0.28967, 0, 0.20081, 0.67376, 0.38121, 0.74868, 0.59323, 0.75805, 0.77735, 0.71591 ],
					"triangles": [ 23, 3, 4, 23, 4, 5, 23, 5, 6, 22, 2, 3, 22, 3, 23, 21, 2, 22, 23, 6, 7, 8, 23, 7, 9, 22, 23, 9, 23, 8, 10, 21, 22, 10, 22, 9, 11, 21, 10, 21, 20, 2, 15, 16, 17, 18, 15, 17, 2, 0, 1, 19, 15, 18, 19, 2, 15, 2, 19, 0, 2, 20, 15, 14, 15, 20, 13, 14, 20, 12, 13, 20, 12, 20, 11, 11, 20, 21 ],
					"vertices": [ 1, 13, 33, 23.83, 1, 1, 13, 46.66, 33.74, 1, 2, 13, 56.82, 27.28, 0.57121, 14, 15.64, 28.15, 0.42879, 2, 13, 55.68, 42.11, 0.11339, 14, 28.09, 36.3, 0.88661, 2, 13, 60.41, 56.54, 0.02773, 14, 43.01, 39.12, 0.97227, 2, 13, 70.65, 67.67, 0.00263, 14, 57.69, 35.51, 0.99737, 1, 14, 70.26, 25.61, 1, 1, 14, 78.61, 14.81, 1, 1, 14, 75.53, 3.74, 1, 1, 14, 61.42, -10.05, 1, 2, 13, 112.67, 19.59, 0.24, 14, 35.84, -24.48, 0.76, 1, 13, 108.86, -6.55, 1, 2, 13, 100.18, -25.5, 0.80958, 14, -9.69, -35.28, 0.19042, 1, 13, 85.05, -30.9, 1, 2, 13, 64.37, -27.97, 0.96626, 14, -29.13, -5.1, 0.03374, 2, 13, 55.19, -23.61, 0.99971, 14, -29.73, 5.04, 2.9E-4, 1, 13, 49.05, -30.67, 1, 2, 13, 42.45, -30.63, 1, 14, -42.02, 12.83, 0, 2, 13, 32.62, -20.27, 1, 14, -37.69, 26.43, 0, 2, 13, 28.77, 0.46, 0.99993, 14, -21.38, 39.8, 7.0E-5, 2, 13, 85.98, -9.42, 0.70505, 14, -2.45, -15.08, 0.29495, 2, 13, 92.47, 9.84, 0.0012, 14, 17.55, -11.48, 0.9988, 1, 14, 37.88, -1.37, 1, 2, 13, 89.95, 52.25, 2.4E-4, 14, 53.49, 11.17, 0.99976 ],
					"hull": 20,
					"edges": [ 4, 2, 2, 0, 0, 38, 38, 36, 36, 34, 32, 34, 30, 32, 30, 28, 28, 26, 26, 24, 24, 22, 22, 20, 20, 18, 18, 16, 16, 14, 4, 6, 6, 8, 8, 10, 10, 12, 12, 14 ],
					"width": 107,
					"height": 85
				}
			},
			"pink-leg-2b": {
				"pink-leg-2b": {
					"type": "mesh",
					"uvs": [ 0.75093, 0.11537, 0.91733, 0.2784, 1, 0.4805, 1, 0.66644, 1, 0.81465, 1, 1, 0.54101, 1, 0.40789, 0.93995, 0.40533, 0.79713, 0.40277, 0.64084, 0.39253, 0.48993, 0.32085, 0.34172, 0.18261, 0.2272, 0, 0.15983, 0, 0, 0.54101, 0 ],
					"triangles": [ 6, 4, 5, 4, 6, 8, 6, 7, 8, 8, 3, 4, 8, 9, 3, 9, 2, 3, 9, 10, 2, 10, 1, 2, 10, 11, 1, 11, 0, 1, 11, 12, 0, 12, 15, 0, 15, 12, 14, 12, 13, 14 ],
					"vertices": [ 1, 12, 47.26, 17.33, 1, 1, 12, 64.84, 17.43, 1, 2, 12, 83.74, 12.1, 0.71745, 13, 3.52, 17.62, 0.28255, 2, 12, 99.35, 3.84, 0.10572, 13, 21.19, 17.51, 0.89428, 2, 12, 111.8, -2.75, 0.0045, 13, 35.27, 17.42, 0.9955, 2, 12, 127.36, -10.99, 0, 13, 52.88, 17.31, 1, 1, 13, 52.73, -5.64, 1, 1, 13, 46.98, -12.26, 1, 1, 13, 33.41, -12.3, 1, 1, 13, 18.57, -12.33, 1, 2, 12, 70.32, -15.16, 0.09893, 13, 4.23, -12.76, 0.90107, 2, 12, 56.2, -11.74, 0.84457, 13, -9.88, -16.25, 0.15543, 2, 12, 43.35, -12.76, 0.99824, 13, -20.8, -23.09, 0.00176, 1, 12, 33.43, -17.83, 1, 1, 12, 20.01, -10.73, 1, 1, 12, 32.66, 13.18, 1 ],
					"hull": 16,
					"edges": [ 26, 28, 26, 24, 24, 22, 22, 20, 20, 18, 18, 16, 16, 14, 10, 12, 14, 12, 10, 8, 8, 6, 6, 4, 4, 2, 2, 0, 28, 30, 0, 30 ],
					"width": 50,
					"height": 95
				}
			},
			"pink-shadow": {
				"pink-shadow": { "x": 397.94, "y": 654.13, "width": 328, "height": 61 }
			},
			"shadow": {
				"shadow": { "x": 17.94, "y": 187.13, "width": 488, "height": 89 }
			},
			"sweat-1": {
				"sweat-1": { "x": 0.79, "y": -1.71, "width": 36, "height": 25 }
			},
			"sweat-2": {
				"sweat-2": { "x": -1.48, "y": 0.3, "width": 21, "height": 37 }
			},
			"tissue": {
				"tissue": {
					"type": "mesh",
					"uvs": [ 0.39058, 0.04013, 0.56455, 0.10074, 0.65883, 0.21061, 0.74921, 0.30531, 0.76282, 0.42528, 0.75602, 0.54398, 0.76574, 0.66773, 0.85612, 0.71824, 0.94554, 0.76117, 1, 0.86006, 0.82902, 0.94654, 0.6918, 0.97669, 0.55629, 0.95918, 0.43223, 0.95828, 0.30201, 0.91287, 0.19509, 0.93068, 0.10805, 0.96719, 0.0539, 1, 0, 1, 0, 0.90543, 0.05385, 0.75959, 0.13492, 0.64129, 0.1898, 0.50842, 0.20601, 0.33665, 0.22098, 0.17947, 0.28957, 0, 0.30464, 0.69773, 0.34857, 0.55627, 0.38104, 0.31554, 0.5434, 0.76722, 0.52621, 0.60591, 0.55486, 0.35773 ],
					"triangles": [ 10, 6, 7, 10, 7, 8, 10, 8, 9, 11, 12, 29, 29, 6, 11, 13, 29, 12, 10, 11, 6, 30, 6, 29, 5, 30, 31, 6, 30, 5, 31, 1, 2, 4, 31, 3, 31, 2, 3, 5, 31, 4, 21, 22, 26, 26, 15, 21, 26, 14, 15, 29, 13, 26, 29, 26, 30, 14, 26, 13, 0, 24, 25, 28, 0, 1, 28, 24, 0, 23, 24, 28, 31, 28, 1, 27, 28, 31, 27, 23, 28, 22, 23, 27, 30, 27, 31, 26, 22, 27, 26, 27, 30, 15, 20, 21, 16, 19, 20, 15, 16, 20, 17, 18, 19, 16, 17, 19 ],
					"vertices": [ 2, 32, -7.42, 11.41, 0.92318, 36, -41.08, -53.27, 0.07682, 2, 32, -6.73, 43.46, 0.50287, 36, -30.4, -23.04, 0.49713, 3, 33, -36.98, 62.26, 0.00253, 32, 3.88, 63.35, 0.17103, 36, -14.09, -7.48, 0.82644, 1, 36, 0.1, 7.56, 1, 1, 36, 16.67, 8.69, 1, 2, 36, 32.79, 6.22, 8.0E-5, 37, 5.9, 6.53, 0.99992, 2, 37, 22.9, 7.79, 0.54841, 38, 2.02, 7.85, 0.45159, 2, 37, 30.25, 23.69, 0.00149, 38, 16.4, 17.84, 0.99851, 1, 38, 29.82, 28.24, 1, 1, 38, 46.44, 29.3, 1, 3, 33, 52.06, 118.43, 5.0E-5, 34, -15.24, 119.13, 7.6E-4, 38, 40.4, -2.8, 0.99919, 5, 35, -12.2, 103.7, 0.00226, 33, 62.57, 96, 0.01283, 34, 1.32, 100.71, 0.04902, 37, 64.85, -6.52, 0.00757, 38, 30.98, -25.71, 0.92832, 6, 35, -4.68, 80.66, 0.01989, 33, 66.72, 72.12, 0.0562, 34, 12.21, 79.05, 0.18885, 36, 86.74, -33.64, 5.0E-5, 37, 61.79, -30.57, 0.09792, 38, 16.18, -44.91, 0.6371, 6, 35, 4.1, 60.4, 0.07274, 33, 72.51, 50.81, 0.08152, 34, 23.92, 60.33, 0.35934, 36, 84.9, -55.65, 5.9E-4, 37, 61.06, -52.64, 0.12094, 38, 4.4, -63.59, 0.36486, 6, 35, 7.74, 36.68, 0.28022, 33, 72.72, 26.81, 0.0455, 34, 31.08, 37.42, 0.47046, 36, 76.9, -78.27, 5.6E-4, 37, 54.21, -75.64, 0.06474, 38, -13.14, -79.96, 0.13853, 5, 35, 17.64, 20.24, 0.76112, 33, 80.16, 9.13, 0.00167, 34, 43.33, 22.65, 0.19509, 37, 56.13, -94.73, 0.01353, 38, -21.14, -97.41, 0.02859, 4, 35, 28.46, 8.07, 0.99232, 34, 55.85, 12.24, 0.00556, 37, 60.7, -110.35, 6.2E-4, 38, -25.09, -113.2, 0.0015, 3, 35, 36.46, 1.06, 1, 37, 64.93, -120.11, 0, 38, -26.38, -123.76, 0, 1, 35, 40.32, -7.72, 1, 1, 35, 28.46, -12.94, 1, 2, 35, 6.31, -12.21, 0.94859, 34, 36.99, -11.13, 0.05141, 1, 34, 15.57, -7.62, 1, 2, 33, 24.68, -7.26, 0.96253, 34, -5.03, -9.11, 0.03747, 2, 33, 1.23, -10.78, 0.533, 32, 39.87, -10.81, 0.467, 1, 32, 18.32, -13.36, 1, 1, 32, -8.47, -7.36, 1, 7, 35, -19.42, 25.23, 0.05147, 33, 44.2, 19.37, 0.20275, 32, 83.73, 18.03, 0.00118, 34, 5.93, 22.04, 0.59728, 36, 47.55, -75.52, 0.01646, 37, 24.76, -74.36, 0.06153, 38, -37.91, -63.98, 0.06934, 7, 35, -40.31, 24.59, 0.00108, 33, 23.43, 21.72, 0.61719, 32, 63.04, 21, 0.04996, 34, -14.62, 18.27, 0.15107, 36, 28.84, -66.21, 0.06979, 37, 5.6, -66.02, 0.07715, 38, -50.22, -47.09, 0.03376, 5, 33, -9.89, 18.46, 0.13038, 32, 29.63, 18.75, 0.7067, 36, -3.59, -57.89, 0.14497, 37, -27.21, -59.33, 0.01775, 38, -75.15, -24.74, 1.9E-4, 7, 35, -27.82, 67.97, 0.01301, 33, 41.99, 62.87, 0.10408, 32, 82.84, 61.57, 0.0042, 34, -8.78, 63.03, 0.17418, 36, 60.34, -33.88, 0.0328, 37, 35.44, -32.14, 0.25023, 38, -7.35, -32.95, 0.4215, 7, 35, -46.82, 56.27, 0.00208, 33, 21.52, 54.01, 0.19258, 32, 62.11, 53.33, 0.04743, 34, -25.81, 48.62, 0.10344, 36, 38.07, -35.22, 0.18994, 37, 13.26, -34.59, 0.35051, 38, -27.72, -23.85, 0.11402, 6, 33, -12.61, 49.82, 0.08032, 32, 27.87, 50.18, 0.24159, 34, -57.25, 34.72, 0.00396, 36, 4.57, -27.49, 0.62484, 37, -20.58, -28.56, 0.04922, 38, -53.88, -1.54, 8.0E-5 ],
					"hull": 26,
					"edges": [ 36, 38, 38, 40, 40, 42, 42, 44, 44, 46, 46, 48, 48, 50, 50, 0, 0, 2, 2, 4, 4, 6, 6, 8, 8, 10, 10, 12, 12, 14, 14, 16, 16, 18, 34, 36, 32, 34, 32, 30, 30, 28, 28, 26, 26, 24, 24, 22, 22, 20, 20, 18 ],
					"width": 178,
					"height": 137
				}
			},
			"tv": {
				"tv": { "x": -354.56, "y": 580.13, "width": 353, "height": 555 }
			}
		}
	}
],
"animations": {
	"finish": {
		"slots": {
			"blush": {
				"attachment": [
					{ "name": null }
				]
			},
			"hand-1a-hold": {
				"attachment": [
					{ "name": "hand-1a-hold" }
				]
			},
			"heart": {
				"attachment": [
					{ "name": null }
				]
			},
			"iris-1": {
				"attachment": [
					{ "name": null }
				]
			},
			"iris-2": {
				"attachment": [
					{ "name": null }
				]
			},
			"lid-1": {
				"attachment": [
					{ "name": null }
				]
			},
			"lid-2": {
				"attachment": [
					{ "name": null }
				]
			},
			"mouth-drolling": {
				"attachment": [
					{ "name": "mouth-scare" }
				]
			},
			"sweat-1": {
				"attachment": [
					{ "name": null }
				]
			},
			"sweat-2": {
				"attachment": [
					{ "name": null }
				]
			}
		},
		"bones": {
			"pink-body7": {
				"rotate": [
					{ "angle": 7.42, "curve": 0.25, "c3": 0.75 },
					{ "time": 0.6667, "angle": -4.1 }
				]
			},
			"face2": {
				"translate": [
					{ "x": -5.06, "y": 2.89, "curve": 0.25, "c3": 0.75 },
					{ "time": 0.6667 }
				]
			},
			"pink-leg-2b": {
				"rotate": [
					{ "angle": -1.06 }
				],
				"translate": [
					{ "curve": 0.25, "c3": 0.75 },
					{ "time": 0.1667, "x": -1.03, "y": -3.6, "curve": 0.25, "c3": 0.75 },
					{ "time": 0.3333, "curve": 0.25, "c3": 0.75 },
					{ "time": 0.5, "x": -1.03, "y": -3.6, "curve": 0.25, "c3": 0.75 },
					{ "time": 0.6667, "curve": 0.25, "c3": 0.75 },
					{ "time": 0.8333, "x": -1.03, "y": -3.6, "curve": 0.25, "c3": 0.75 },
					{ "time": 1, "curve": 0.25, "c3": 0.75 },
					{ "time": 1.1667, "x": -1.03, "y": -3.6, "curve": 0.25, "c3": 0.75 },
					{ "time": 1.3333 }
				]
			},
			"pink-leg-2b3": {
				"rotate": [
					{ "curve": 0.25, "c3": 0.75 },
					{ "time": 0.1667, "angle": 21.4, "curve": 0.25, "c3": 0.75 },
					{ "time": 0.3333, "curve": 0.25, "c3": 0.75 },
					{ "time": 0.5, "angle": 21.4, "curve": 0.25, "c3": 0.75 },
					{ "time": 0.6667, "curve": 0.25, "c3": 0.75 },
					{ "time": 0.8333, "angle": 21.4, "curve": 0.25, "c3": 0.75 },
					{ "time": 1, "curve": 0.25, "c3": 0.75 },
					{ "time": 1.1667, "angle": 21.4, "curve": 0.25, "c3": 0.75 },
					{ "time": 1.3333 }
				]
			},
			"pink-body4": {
				"rotate": [
					{ "angle": 7.42, "curve": 0.25, "c3": 0.75 },
					{ "time": 0.6667, "angle": -4.1 }
				]
			},
			"pink-body10": {
				"rotate": [
					{ "angle": 7.42, "curve": 0.25, "c3": 0.75 },
					{ "time": 0.6667, "angle": -4.1 }
				]
			},
			"tissue4": {
				"rotate": [
					{ "angle": 12.83, "curve": 0.375, "c2": 0.62, "c3": 0.716 },
					{ "time": 0.0667, "angle": 16.54, "curve": 0.25, "c3": 0.75 },
					{ "time": 0.4, "angle": -12, "curve": 0.25, "c3": 0.75 },
					{ "time": 0.7333, "angle": 16.54, "curve": 0.25, "c3": 0.75 },
					{ "time": 1.0667, "angle": -12, "curve": 0.243, "c3": 0.68, "c4": 0.71 },
					{ "time": 1.3333, "angle": 12.83 }
				]
			},
			"tissue7": {
				"rotate": [
					{ "angle": 12.83, "curve": 0.375, "c2": 0.62, "c3": 0.716 },
					{ "time": 0.0667, "angle": 16.54, "curve": 0.25, "c3": 0.75 },
					{ "time": 0.4, "angle": -12, "curve": 0.25, "c3": 0.75 },
					{ "time": 0.7333, "angle": 16.54, "curve": 0.25, "c3": 0.75 },
					{ "time": 1.0667, "angle": -12, "curve": 0.243, "c3": 0.68, "c4": 0.71 },
					{ "time": 1.3333, "angle": 12.83 }
				]
			},
			"tissue": {
				"rotate": [
					{ "angle": -5.09, "curve": 0.382, "c2": 0.58, "c3": 0.731 },
					{ "time": 0.1, "angle": -12, "curve": 0.25, "c3": 0.75 },
					{ "time": 0.4333, "angle": 16.54, "curve": 0.25, "c3": 0.75 },
					{ "time": 0.7667, "angle": -12, "curve": 0.25, "c3": 0.75 },
					{ "time": 1.1, "angle": 16.54, "curve": 0.243, "c3": 0.655, "c4": 0.63 },
					{ "time": 1.3333, "angle": -5.09 }
				]
			},
			"hand-1b": {
				"rotate": [
					{ "angle": -5.76 }
				],
				"translate": [
					{ "x": 2.81, "y": 6.04, "curve": 0.375, "c2": 0.5, "c3": 0.75 },
					{ "time": 0.3333, "x": -15.46, "y": -33.21, "curve": 0.25, "c3": 0.75 },
					{ "time": 0.6667, "x": 21.08, "y": 45.29, "curve": 0.25, "c3": 0.75 },
					{ "time": 1, "x": -15.46, "y": -33.21, "curve": 0.25, "c3": 0.75 },
					{ "time": 1.3333, "x": 21.08, "y": 45.29 }
				]
			},
			"tissue5": {
				"rotate": [
					{ "angle": 6.04, "curve": 0.363, "c2": 0.44, "c3": 0.755 },
					{ "time": 0.2, "angle": -12, "curve": 0.25, "c3": 0.75 },
					{ "time": 0.5333, "angle": 16.54, "curve": 0.25, "c3": 0.75 },
					{ "time": 0.8667, "angle": -12, "curve": 0.25, "c3": 0.75 },
					{ "time": 1.2, "angle": 16.54, "curve": 0.258, "c3": 0.619, "c4": 0.45 },
					{ "time": 1.3333, "angle": 6.04 }
				]
			},
			"pink-body11": {
				"rotate": [
					{ "angle": 4.63, "curve": 0.382, "c2": 0.58, "c3": 0.731 },
					{ "time": 0.2, "angle": 7.42, "curve": 0.243, "c3": 0.655, "c4": 0.63 },
					{ "time": 0.6667, "angle": -1.31, "curve": 0.382, "c2": 0.58, "c3": 0.731 },
					{ "time": 0.8667, "angle": 7.42, "curve": 0.243, "c3": 0.655, "c4": 0.63 },
					{ "time": 1.3333, "angle": -1.31 }
				]
			},
			"pink-body5": {
				"rotate": [
					{ "angle": 4.63, "curve": 0.382, "c2": 0.58, "c3": 0.731 },
					{ "time": 0.2, "angle": 7.42, "curve": 0.243, "c3": 0.655, "c4": 0.63 },
					{ "time": 0.6667, "angle": -1.31, "curve": 0.382, "c2": 0.58, "c3": 0.731 },
					{ "time": 0.8667, "angle": 7.42, "curve": 0.243, "c3": 0.655, "c4": 0.63 },
					{ "time": 1.3333, "angle": -1.31 }
				]
			},
			"pink-body8": {
				"rotate": [
					{ "angle": 4.63, "curve": 0.382, "c2": 0.58, "c3": 0.731 },
					{ "time": 0.2, "angle": 7.42, "curve": 0.243, "c3": 0.655, "c4": 0.63 },
					{ "time": 0.6667, "angle": -1.31, "curve": 0.382, "c2": 0.58, "c3": 0.731 },
					{ "time": 0.8667, "angle": 7.42, "curve": 0.243, "c3": 0.655, "c4": 0.63 },
					{ "time": 1.3333, "angle": -1.31 }
				]
			},
			"tissue2": {
				"rotate": [
					{ "angle": 6.04, "curve": 0.363, "c2": 0.44, "c3": 0.755 },
					{ "time": 0.2, "angle": -12, "curve": 0.25, "c3": 0.75 },
					{ "time": 0.5333, "angle": 16.54, "curve": 0.25, "c3": 0.75 },
					{ "time": 0.8667, "angle": -12, "curve": 0.25, "c3": 0.75 },
					{ "time": 1.2, "angle": 16.54, "curve": 0.258, "c3": 0.619, "c4": 0.45 },
					{ "time": 1.3333, "angle": 6.04 }
				]
			},
			"tissue3": {
				"rotate": [
					{ "angle": 15.33, "curve": 0.289, "c2": 0.17, "c3": 0.755 },
					{ "time": 0.3, "angle": -12, "curve": 0.25, "c3": 0.75 },
					{ "time": 0.6333, "angle": 16.54, "curve": 0.25, "c3": 0.75 },
					{ "time": 0.9667, "angle": -12, "curve": 0.25, "c3": 0.75 },
					{ "time": 1.3, "angle": 16.54, "curve": 0.305, "c3": 0.64, "c4": 0.36 },
					{ "time": 1.3333, "angle": 15.33 }
				]
			},
			"tissue6": {
				"rotate": [
					{ "angle": 15.33, "curve": 0.289, "c2": 0.17, "c3": 0.755 },
					{ "time": 0.3, "angle": -12, "curve": 0.25, "c3": 0.75 },
					{ "time": 0.6333, "angle": 16.54, "curve": 0.25, "c3": 0.75 },
					{ "time": 0.9667, "angle": -12, "curve": 0.25, "c3": 0.75 },
					{ "time": 1.3, "angle": 16.54, "curve": 0.305, "c3": 0.64, "c4": 0.36 },
					{ "time": 1.3333, "angle": 15.33 }
				]
			},
			"pink-body12": {
				"rotate": [
					{ "angle": 0.14, "curve": 0.363, "c2": 0.44, "c3": 0.755 },
					{ "time": 0.4, "angle": 7.42, "curve": 0.258, "c3": 0.619, "c4": 0.45 },
					{ "time": 0.6667, "angle": 3.19, "curve": 0.363, "c2": 0.44, "c3": 0.755 },
					{ "time": 1.0667, "angle": 7.42, "curve": 0.258, "c3": 0.619, "c4": 0.45 },
					{ "time": 1.3333, "angle": 3.19 }
				]
			},
			"pink-body6": {
				"rotate": [
					{ "angle": 0.14, "curve": 0.363, "c2": 0.44, "c3": 0.755 },
					{ "time": 0.4, "angle": 7.42, "curve": 0.258, "c3": 0.619, "c4": 0.45 },
					{ "time": 0.6667, "angle": 3.19, "curve": 0.363, "c2": 0.44, "c3": 0.755 },
					{ "time": 1.0667, "angle": 7.42, "curve": 0.258, "c3": 0.619, "c4": 0.45 },
					{ "time": 1.3333, "angle": 3.19 }
				]
			},
			"pink-body9": {
				"rotate": [
					{ "angle": 0.14, "curve": 0.363, "c2": 0.44, "c3": 0.755 },
					{ "time": 0.4, "angle": 7.42, "curve": 0.258, "c3": 0.619, "c4": 0.45 },
					{ "time": 0.6667, "angle": 3.19, "curve": 0.363, "c2": 0.44, "c3": 0.755 },
					{ "time": 1.0667, "angle": 7.42, "curve": 0.258, "c3": 0.619, "c4": 0.45 },
					{ "time": 1.3333, "angle": 3.19 }
				]
			},
			"pink-leg-2b2": {
				"rotate": [
					{ "angle": 1.94 }
				]
			},
			"body": {
				"translate": [
					{ "x": -15.02, "y": -5.01 }
				]
			},
			"face": {
				"translate": [
					{ "x": -26.72, "y": 30.94 }
				]
			},
			"pink-leg-1b": {
				"rotate": [
					{ "angle": 0.19 }
				]
			},
			"pink-leg-1b2": {
				"rotate": [
					{ "angle": -0.37 }
				]
			},
			"body2": {
				"rotate": [
					{ "angle": 8.46 }
				]
			},
			"body3": {
				"rotate": [
					{ "angle": 8.46 }
				]
			},
			"hand-2b": {
				"rotate": [
					{ "angle": 77.27 }
				]
			},
			"hand-1b2": {
				"rotate": [
					{ "angle": -5.76 }
				]
			},
			"leg-1b": {
				"rotate": [
					{ "angle": -3.54 }
				]
			},
			"leg-1b2": {
				"rotate": [
					{ "angle": 16.37 }
				]
			},
			"leg-2b": {
				"rotate": [
					{ "angle": 24.3 }
				]
			},
			"leg-2b2": {
				"rotate": [
					{ "angle": 3.24 }
				]
			},
			"target1": {
				"translate": [
					{ "x": 62.01 }
				]
			}
		},
		"deform": {
			"default": {
				"brown-1": {
					"brown-1": [
						{
							"vertices": [ -34.05505, -37.40699, -34.05505, -37.40699, -34.05505, -37.40699, -34.05505, -37.40699 ]
						}
					]
				},
				"brown-2": {
					"brown-2": [
						{
							"vertices": [ -34.05505, -37.40699, -34.05505, -37.40699, -34.05505, -37.40699, -34.05505, -37.40699 ]
						}
					]
				},
				"eye-1": {
					"eye-1": [
						{
							"vertices": [ -13.26843, -34.71375, -13.26843, -34.71375, -13.26843, -34.71375, -13.26843, -34.71375 ]
						}
					]
				},
				"eye-2": {
					"eye-2": [
						{
							"vertices": [ -13.26843, -34.71375, -13.26843, -34.71375, -13.26843, -34.71375, -13.26843, -34.71375 ]
						}
					]
				},
				"iris-scare-1": {
					"iris-scare-1": [
						{
							"vertices": [ -25.82666, 13.71536, -25.82666, 13.71536, -25.82666, 13.71536, -25.82666, 13.71536 ]
						}
					]
				},
				"iris-scare-2": {
					"iris-scare-2": [
						{
							"vertices": [ -25.82666, 13.71536, -25.82666, 13.71536, -25.82666, 13.71536, -25.82666, 13.71536 ]
						}
					]
				},
				"lid-under-1": {
					"lid-under-1": [
						{
							"vertices": [ -12.24036, -35.1825, -12.24036, -35.1825, -12.24036, -35.1825, -12.24036, -35.1825 ]
						}
					]
				},
				"lid-under-2": {
					"lid-under-2": [
						{
							"vertices": [ -12.24036, -35.1825, -12.24036, -35.1825, -12.24036, -35.1825, -12.24036, -35.1825 ]
						}
					]
				}
			}
		}
	},
	"quest": {
		"slots": {
			"iris-scare-1": {
				"attachment": [
					{ "name": null }
				]
			},
			"iris-scare-2": {
				"attachment": [
					{ "name": null }
				]
			},
			"lid-under-1": {
				"attachment": [
					{ "name": null }
				]
			},
			"lid-under-2": {
				"attachment": [
					{ "name": null }
				]
			},
			"sweat-1": {
				"attachment": [
					{ "name": null }
				]
			},
			"sweat-2": {
				"attachment": [
					{ "name": null }
				]
			},
			"tissue": {
				"attachment": [
					{ "name": null }
				]
			}
		},
		"bones": {
			"heart": {
				"scale": [
					{}
				]
			},
			"body": {
				"translate": [
					{}
				]
			},
			"leg-2b3": {
				"rotate": [
					{}
				]
			},
			"mouth-drolling": {
				"scale": [
					{}
				]
			},
			"hand-1b": {
				"rotate": [
					{}
				]
			},
			"target1": {
				"translate": [
					{ "x": 62.01 }
				]
			},
			"pink-leg-2b3": {
				"rotate": [
					{}
				]
			},
			"pink-body4": {
				"rotate": [
					{ "angle": -4.1 }
				]
			},
			"pink-body5": {
				"rotate": [
					{ "angle": -1.31 }
				]
			},
			"pink-body6": {
				"rotate": [
					{ "angle": 3.15 }
				]
			},
			"pink-body7": {
				"rotate": [
					{ "angle": -4.1 }
				]
			},
			"pink-body8": {
				"rotate": [
					{ "angle": -1.31 }
				]
			},
			"pink-body9": {
				"rotate": [
					{ "angle": 3.15 }
				]
			},
			"pink-body10": {
				"rotate": [
					{ "angle": -4.1 }
				]
			},
			"pink-body11": {
				"rotate": [
					{ "angle": -1.31 }
				]
			},
			"pink-body12": {
				"rotate": [
					{ "angle": 3.15 }
				]
			},
			"pink-leg-2b": {
				"translate": [
					{}
				]
			},
			"face2": {
				"translate": [
					{}
				]
			},
			"hand-2b2": {
				"translate": [
					{}
				]
			}
		},
		"deform": {
			"default": {
				"iris-1": {
					"iris-1": [
						{}
					]
				},
				"iris-2": {
					"iris-2": [
						{}
					]
				}
			}
		}
	},
	"quest2": {
		"slots": {
			"blush": {
				"attachment": [
					{ "time": 0.0667, "name": null }
				]
			},
			"hand-1a-hold": {
				"attachment": [
					{ "time": 1.3333, "name": "hand-1a-hold" }
				]
			},
			"heart": {
				"attachment": [
					{ "time": 0.0667, "name": null }
				]
			},
			"iris-1": {
				"attachment": [
					{ "time": 0.0667, "name": null }
				]
			},
			"iris-2": {
				"attachment": [
					{ "time": 0.0667, "name": null }
				]
			},
			"iris-scare-1": {
				"attachment": [
					{ "name": null },
					{ "time": 0.0667, "name": "iris-scare-1" }
				]
			},
			"lid-1": {
				"attachment": [
					{ "time": 0.0667, "name": null }
				]
			},
			"lid-2": {
				"attachment": [
					{ "time": 0.0667, "name": null }
				]
			},
			"lid-under-1": {
				"attachment": [
					{ "name": null },
					{ "time": 0.0667, "name": "lid-under-1" }
				]
			},
			"lid-under-2": {
				"attachment": [
					{ "name": null },
					{ "time": 0.0667, "name": "lid-under-2" }
				]
			},
			"mouth-drolling": {
				"attachment": [
					{ "time": 0.0667, "name": "mouth-scare" }
				]
			},
			"sweat-1": {
				"attachment": [
					{ "name": null },
					{ "time": 0.0667, "name": "sweat-1" },
					{ "time": 0.2333, "name": null }
				]
			},
			"sweat-2": {
				"attachment": [
					{ "name": null },
					{ "time": 0.0667, "name": "sweat-2" },
					{ "time": 0.2333, "name": null }
				]
			},
			"tissue": {
				"attachment": [
					{ "name": "tissue" }
				]
			}
		},
		"bones": {
			"face2": {
				"translate": [
					{ "curve": 0.25, "c3": 0.75 },
					{ "time": 0.6667, "x": -5.06, "y": 2.89, "curve": 0.25, "c3": 0.75 },
					{ "time": 1.3333, "curve": 0.25, "c3": 0.75 },
					{ "time": 2, "x": -5.06, "y": 2.89 }
				]
			},
			"pink-leg-2b": {
				"rotate": [
					{ "time": 2, "angle": -1.06 }
				],
				"translate": [
					{ "curve": 0.25, "c3": 0.75 },
					{ "time": 0.1667, "x": -1.03, "y": -3.6, "curve": 0.25, "c3": 0.75 },
					{ "time": 0.3333, "curve": 0.25, "c3": 0.75 },
					{ "time": 0.5, "x": -1.03, "y": -3.6, "curve": 0.25, "c3": 0.75 },
					{ "time": 0.6667, "curve": 0.25, "c3": 0.75 },
					{ "time": 0.8333, "x": -1.03, "y": -3.6, "curve": 0.25, "c3": 0.75 },
					{ "time": 1, "curve": 0.25, "c3": 0.75 },
					{ "time": 1.1667, "x": -1.03, "y": -3.6, "curve": 0.25, "c3": 0.75 },
					{ "time": 1.3333, "curve": 0.25, "c3": 0.75 },
					{ "time": 1.5, "x": -1.03, "y": -3.6, "curve": 0.25, "c3": 0.75 },
					{ "time": 1.6667, "curve": 0.25, "c3": 0.75 },
					{ "time": 1.8333, "x": -1.03, "y": -3.6, "curve": 0.25, "c3": 0.75 },
					{ "time": 2 }
				]
			},
			"pink-body12": {
				"rotate": [
					{ "angle": 3.15, "curve": 0.333, "c2": 0.33, "c3": 0.68, "c4": 0.71 },
					{ "time": 0.2, "angle": -1.31, "curve": 0.382, "c2": 0.58, "c3": 0.731 },
					{ "time": 0.4, "angle": -4.1, "curve": 0.25, "c3": 0.75 },
					{ "time": 1.0667, "angle": 7.42, "curve": 0.25, "c3": 0.75 },
					{ "time": 1.7333, "angle": -4.1, "curve": 0.258, "c3": 0.619, "c4": 0.45 },
					{ "time": 2, "angle": 0.14 }
				]
			},
			"pink-body11": {
				"rotate": [
					{ "angle": -1.31, "curve": 0.382, "c2": 0.58, "c3": 0.731 },
					{ "time": 0.2, "angle": -4.1, "curve": 0.25, "c3": 0.75 },
					{ "time": 0.8667, "angle": 7.42, "curve": 0.25, "c3": 0.75 },
					{ "time": 1.5333, "angle": -4.1, "curve": 0.243, "c3": 0.655, "c4": 0.63 },
					{ "time": 2, "angle": 4.63 }
				]
			},
			"pink-leg-2b3": {
				"rotate": [
					{ "curve": 0.25, "c3": 0.75 },
					{ "time": 0.1667, "angle": 21.4, "curve": 0.25, "c3": 0.75 },
					{ "time": 0.3333, "curve": 0.25, "c3": 0.75 },
					{ "time": 0.5, "angle": 21.4, "curve": 0.25, "c3": 0.75 },
					{ "time": 0.6667, "curve": 0.25, "c3": 0.75 },
					{ "time": 0.8333, "angle": 21.4, "curve": 0.25, "c3": 0.75 },
					{ "time": 1, "curve": 0.25, "c3": 0.75 },
					{ "time": 1.1667, "angle": 21.4, "curve": 0.25, "c3": 0.75 },
					{ "time": 1.3333, "curve": 0.25, "c3": 0.75 },
					{ "time": 1.5, "angle": 21.4, "curve": 0.25, "c3": 0.75 },
					{ "time": 1.6667, "curve": 0.25, "c3": 0.75 },
					{ "time": 1.8333, "angle": 21.4, "curve": 0.25, "c3": 0.75 },
					{ "time": 2 }
				]
			},
			"pink-body4": {
				"rotate": [
					{ "angle": -4.1, "curve": 0.25, "c3": 0.75 },
					{ "time": 0.6667, "angle": 7.42, "curve": 0.25, "c3": 0.75 },
					{ "time": 1.3333, "angle": -4.1, "curve": 0.25, "c3": 0.75 },
					{ "time": 2, "angle": 7.42 }
				]
			},
			"pink-body5": {
				"rotate": [
					{ "angle": -1.31, "curve": 0.382, "c2": 0.58, "c3": 0.731 },
					{ "time": 0.2, "angle": -4.1, "curve": 0.25, "c3": 0.75 },
					{ "time": 0.8667, "angle": 7.42, "curve": 0.25, "c3": 0.75 },
					{ "time": 1.5333, "angle": -4.1, "curve": 0.243, "c3": 0.655, "c4": 0.63 },
					{ "time": 2, "angle": 4.63 }
				]
			},
			"pink-body6": {
				"rotate": [
					{ "angle": 3.15, "curve": 0.333, "c2": 0.33, "c3": 0.68, "c4": 0.71 },
					{ "time": 0.2, "angle": -1.31, "curve": 0.382, "c2": 0.58, "c3": 0.731 },
					{ "time": 0.4, "angle": -4.1, "curve": 0.25, "c3": 0.75 },
					{ "time": 1.0667, "angle": 7.42, "curve": 0.25, "c3": 0.75 },
					{ "time": 1.7333, "angle": -4.1, "curve": 0.258, "c3": 0.619, "c4": 0.45 },
					{ "time": 2, "angle": 0.14 }
				]
			},
			"pink-body7": {
				"rotate": [
					{ "angle": -4.1, "curve": 0.25, "c3": 0.75 },
					{ "time": 0.6667, "angle": 7.42, "curve": 0.25, "c3": 0.75 },
					{ "time": 1.3333, "angle": -4.1, "curve": 0.25, "c3": 0.75 },
					{ "time": 2, "angle": 7.42 }
				]
			},
			"pink-body8": {
				"rotate": [
					{ "angle": -1.31, "curve": 0.382, "c2": 0.58, "c3": 0.731 },
					{ "time": 0.2, "angle": -4.1, "curve": 0.25, "c3": 0.75 },
					{ "time": 0.8667, "angle": 7.42, "curve": 0.25, "c3": 0.75 },
					{ "time": 1.5333, "angle": -4.1, "curve": 0.243, "c3": 0.655, "c4": 0.63 },
					{ "time": 2, "angle": 4.63 }
				]
			},
			"pink-body9": {
				"rotate": [
					{ "angle": 3.15, "curve": 0.333, "c2": 0.33, "c3": 0.68, "c4": 0.71 },
					{ "time": 0.2, "angle": -1.31, "curve": 0.382, "c2": 0.58, "c3": 0.731 },
					{ "time": 0.4, "angle": -4.1, "curve": 0.25, "c3": 0.75 },
					{ "time": 1.0667, "angle": 7.42, "curve": 0.25, "c3": 0.75 },
					{ "time": 1.7333, "angle": -4.1, "curve": 0.258, "c3": 0.619, "c4": 0.45 },
					{ "time": 2, "angle": 0.14 }
				]
			},
			"pink-body10": {
				"rotate": [
					{ "angle": -4.1, "curve": 0.25, "c3": 0.75 },
					{ "time": 0.6667, "angle": 7.42, "curve": 0.25, "c3": 0.75 },
					{ "time": 1.3333, "angle": -4.1, "curve": 0.25, "c3": 0.75 },
					{ "time": 2, "angle": 7.42 }
				]
			},
			"face": {
				"translate": [
					{ "curve": 0.25, "c3": 0.75 },
					{ "time": 0.0667, "x": -34.47, "y": 71.75, "curve": 0.25, "c3": 0.75 },
					{ "time": 0.1667, "x": -13.45, "y": -42.69, "curve": "stepped" },
					{ "time": 1.3333, "x": -13.45, "y": -42.69, "curve": 0.25, "c3": 0.75 },
					{ "time": 1.5, "x": -26.72, "y": 30.94 }
				]
			},
			"body": {
				"translate": [
					{ "time": 1.1667, "curve": 0.25, "c3": 0.75 },
					{ "time": 1.5, "x": -15.02, "y": -5.01 }
				]
			},
			"body2": {
				"rotate": [
					{ "time": 1.1667, "curve": 0.25, "c3": 0.75 },
					{ "time": 1.5, "angle": 8.46 }
				]
			},
			"body3": {
				"rotate": [
					{ "time": 1.1667, "curve": 0.25, "c3": 0.75 },
					{ "time": 1.5, "angle": 8.46 }
				]
			},
			"tissue5": {
				"rotate": [
					{ "angle": 6.04, "curve": 0.363, "c2": 0.44, "c3": 0.755 },
					{ "time": 0.2, "angle": -12, "curve": 0.25, "c3": 0.75 },
					{ "time": 1.2, "angle": 16.54, "curve": 0.243, "c3": 0.655, "c4": 0.63 },
					{ "time": 1.4333, "angle": -5.09, "curve": 0.382, "c2": 0.58, "c3": 0.731 },
					{ "time": 1.5333, "angle": -12, "curve": 0.25, "c3": 0.75 },
					{ "time": 1.8667, "angle": 16.54, "curve": 0.258, "c3": 0.619, "c4": 0.45 },
					{ "time": 2, "angle": 6.04 }
				]
			},
			"target1": {
				"translate": [
					{ "x": 62.01 }
				]
			},
			"hand-1b2": {
				"rotate": [
					{ "time": 1.1667, "curve": 0.25, "c3": 0.75 },
					{ "time": 1.3333, "angle": 78.64, "curve": 0.25, "c3": 0.75 },
					{ "time": 1.5, "angle": -5.76, "curve": 0.25, "c3": 0.75 },
					{ "time": 1.8333, "angle": -5.76 }
				]
			},
			"hand-1b": {
				"rotate": [
					{ "time": 1.1667, "curve": 0.25, "c3": 0.75 },
					{ "time": 1.3333, "angle": 78.64, "curve": 0.25, "c3": 0.75 },
					{ "time": 1.5, "angle": -5.76, "curve": 0.25, "c3": 0.75 },
					{ "time": 1.8333, "angle": -5.76 }
				],
				"translate": [
					{ "time": 1.5, "curve": 0.25, "c3": 0.75 },
					{ "time": 1.8333, "x": -15.46, "y": -33.21, "curve": 0.25, "c3": 0.625, "c4": 0.5 },
					{ "time": 2, "x": 2.81, "y": 6.04 }
				]
			},
			"hand-2b": {
				"rotate": [
					{ "time": 1.2333, "curve": 0.25, "c3": 0.75 },
					{ "time": 1.5333, "angle": 77.27 }
				]
			},
			"tissue": {
				"rotate": [
					{ "angle": -5.09, "curve": 0.382, "c2": 0.58, "c3": 0.731 },
					{ "time": 0.1, "angle": -12, "curve": 0.25, "c3": 0.75 },
					{ "time": 1.1, "angle": 16.54, "curve": 0.25, "c3": 0.75 },
					{ "time": 1.4333, "angle": -12, "curve": 0.25, "c3": 0.75 },
					{ "time": 1.7667, "angle": 16.54, "curve": 0.243, "c3": 0.655, "c4": 0.63 },
					{ "time": 2, "angle": -5.09 }
				]
			},
			"tissue2": {
				"rotate": [
					{ "angle": 6.04, "curve": 0.363, "c2": 0.44, "c3": 0.755 },
					{ "time": 0.2, "angle": -12, "curve": 0.25, "c3": 0.75 },
					{ "time": 1.2, "angle": 16.54, "curve": 0.243, "c3": 0.655, "c4": 0.63 },
					{ "time": 1.4333, "angle": -5.09, "curve": 0.382, "c2": 0.58, "c3": 0.731 },
					{ "time": 1.5333, "angle": -12, "curve": 0.25, "c3": 0.75 },
					{ "time": 1.8667, "angle": 16.54, "curve": 0.258, "c3": 0.619, "c4": 0.45 },
					{ "time": 2, "angle": 6.04 }
				]
			},
			"tissue3": {
				"rotate": [
					{ "angle": 15.33, "curve": 0.289, "c2": 0.17, "c3": 0.755 },
					{ "time": 0.9667, "angle": -12, "curve": 0.25, "c3": 0.75 },
					{ "time": 1.3, "angle": 16.54, "curve": 0.258, "c3": 0.619, "c4": 0.45 },
					{ "time": 1.4333, "angle": 5.96, "curve": 0.333, "c2": 0.33, "c3": 0.68, "c4": 0.71 },
					{ "time": 1.5333, "angle": -5.09, "curve": 0.382, "c2": 0.58, "c3": 0.731 },
					{ "time": 1.6333, "angle": -12, "curve": 0.25, "c3": 0.75 },
					{ "time": 1.9667, "angle": 16.54, "curve": 0.305, "c3": 0.64, "c4": 0.36 },
					{ "time": 2, "angle": 15.33 }
				]
			},
			"tissue4": {
				"rotate": [
					{ "angle": 12.83, "curve": 0.375, "c2": 0.62, "c3": 0.716 },
					{ "time": 0.0667, "angle": 16.54, "curve": 0.25, "c3": 0.75 },
					{ "time": 1.0667, "angle": -12, "curve": 0.25, "c3": 0.75 },
					{ "time": 1.4, "angle": 16.54, "curve": 0.305, "c3": 0.64, "c4": 0.36 },
					{ "time": 1.4333, "angle": 15.4, "curve": 0.289, "c2": 0.17, "c3": 0.637, "c4": 0.56 },
					{ "time": 1.5333, "angle": 5.96, "curve": 0.333, "c2": 0.33, "c3": 0.68, "c4": 0.71 },
					{ "time": 1.6333, "angle": -5.09, "curve": 0.382, "c2": 0.58, "c3": 0.731 },
					{ "time": 1.7333, "angle": -12, "curve": 0.243, "c3": 0.68, "c4": 0.71 },
					{ "time": 2, "angle": 12.83 }
				]
			},
			"tissue6": {
				"rotate": [
					{ "angle": 15.33, "curve": 0.289, "c2": 0.17, "c3": 0.755 },
					{ "time": 0.9667, "angle": -12, "curve": 0.25, "c3": 0.75 },
					{ "time": 1.3, "angle": 16.54, "curve": 0.258, "c3": 0.619, "c4": 0.45 },
					{ "time": 1.4333, "angle": 5.96, "curve": 0.333, "c2": 0.33, "c3": 0.68, "c4": 0.71 },
					{ "time": 1.5333, "angle": -5.09, "curve": 0.382, "c2": 0.58, "c3": 0.731 },
					{ "time": 1.6333, "angle": -12, "curve": 0.25, "c3": 0.75 },
					{ "time": 1.9667, "angle": 16.54, "curve": 0.305, "c3": 0.64, "c4": 0.36 },
					{ "time": 2, "angle": 15.33 }
				]
			},
			"tissue7": {
				"rotate": [
					{ "angle": 12.83, "curve": 0.375, "c2": 0.62, "c3": 0.716 },
					{ "time": 0.0667, "angle": 16.54, "curve": 0.25, "c3": 0.75 },
					{ "time": 1.0667, "angle": -12, "curve": 0.25, "c3": 0.75 },
					{ "time": 1.4, "angle": 16.54, "curve": 0.305, "c3": 0.64, "c4": 0.36 },
					{ "time": 1.4333, "angle": 15.4, "curve": 0.289, "c2": 0.17, "c3": 0.637, "c4": 0.56 },
					{ "time": 1.5333, "angle": 5.96, "curve": 0.333, "c2": 0.33, "c3": 0.68, "c4": 0.71 },
					{ "time": 1.6333, "angle": -5.09, "curve": 0.382, "c2": 0.58, "c3": 0.731 },
					{ "time": 1.7333, "angle": -12, "curve": 0.243, "c3": 0.68, "c4": 0.71 },
					{ "time": 2, "angle": 12.83 }
				]
			},
			"pink-leg-1b": {
				"rotate": [
					{ "time": 2, "angle": 0.19 }
				]
			},
			"pink-leg-1b2": {
				"rotate": [
					{ "time": 2, "angle": -0.37 }
				]
			},
			"leg-1b": {
				"rotate": [
					{ "time": 2, "angle": -3.54 }
				]
			},
			"leg-1b2": {
				"rotate": [
					{ "time": 2, "angle": 16.37 }
				]
			},
			"leg-2b": {
				"rotate": [
					{ "time": 2, "angle": 24.3 }
				]
			},
			"leg-2b2": {
				"rotate": [
					{ "time": 2, "angle": 3.24 }
				]
			},
			"pink-leg-2b2": {
				"rotate": [
					{ "time": 2, "angle": 1.94 }
				]
			}
		},
		"deform": {
			"default": {
				"brown-1": {
					"brown-1": [
						{ "curve": 0.25, "c3": 0.75 },
						{
							"time": 0.0667,
							"vertices": [ -20.78662, -2.69324, -20.78662, -2.69324, -20.78662, -2.69324, -20.78662, -2.69324 ],
							"curve": 0.25,
							"c3": 0.75
						},
						{
							"time": 0.1667,
							"vertices": [ -34.05505, -37.40699, -34.05505, -37.40699, -34.05505, -37.40699, -34.05505, -37.40699 ]
						}
					]
				},
				"brown-2": {
					"brown-2": [
						{ "curve": 0.25, "c3": 0.75 },
						{
							"time": 0.0667,
							"vertices": [ -20.78662, -2.69324, -20.78662, -2.69324, -20.78662, -2.69324, -20.78662, -2.69324 ],
							"curve": 0.25,
							"c3": 0.75
						},
						{
							"time": 0.1667,
							"vertices": [ -34.05505, -37.40699, -34.05505, -37.40699, -34.05505, -37.40699, -34.05505, -37.40699 ]
						}
					]
				},
				"eye-1": {
					"eye-1": [
						{
							"time": 0.1667,
							"vertices": [ -13.26843, -34.71375, -13.26843, -34.71375, -13.26843, -34.71375, -13.26843, -34.71375 ]
						}
					]
				},
				"eye-2": {
					"eye-2": [
						{
							"time": 0.1667,
							"vertices": [ -13.26843, -34.71375, -13.26843, -34.71375, -13.26843, -34.71375, -13.26843, -34.71375 ]
						}
					]
				},
				"iris-scare-1": {
					"iris-scare-1": [
						{
							"time": 0.0667,
							"vertices": [ -24.86755, 39.35518, -24.86755, 39.35518, -24.86755, 39.35518, -24.86755, 39.35518 ],
							"curve": 0.25,
							"c3": 0.75
						},
						{
							"time": 0.1667,
							"vertices": [ -3.52155, -39.53286, -3.52155, -39.53286, -3.52155, -39.53286, -3.52155, -39.53286 ],
							"curve": 0.242,
							"c3": 0.667,
							"c4": 0.67
						},
						{
							"time": 1.3333,
							"vertices": [ 1.14462, -31.83697, 1.14462, -31.83697, 1.14462, -31.83697, 1.14462, -31.83697 ],
							"curve": 0.379,
							"c2": 0.6,
							"c3": 0.724
						},
						{
							"time": 1.5,
							"vertices": [ -25.82666, 13.71536, -25.82666, 13.71536, -25.82666, 13.71536, -25.82666, 13.71536 ]
						}
					]
				},
				"iris-scare-2": {
					"iris-scare-2": [
						{
							"time": 0.0667,
							"vertices": [ -24.86755, 39.35518, -24.86755, 39.35518, -24.86755, 39.35518, -24.86755, 39.35518 ],
							"curve": 0.25,
							"c3": 0.75
						},
						{
							"time": 0.1667,
							"vertices": [ -3.52155, -39.53286, -3.52155, -39.53286, -3.52155, -39.53286, -3.52155, -39.53286 ],
							"curve": 0.242,
							"c3": 0.667,
							"c4": 0.67
						},
						{
							"time": 1.3333,
							"vertices": [ 1.14462, -31.83697, 1.14462, -31.83697, 1.14462, -31.83697, 1.14462, -31.83697 ],
							"curve": 0.379,
							"c2": 0.6,
							"c3": 0.724
						},
						{
							"time": 1.5,
							"vertices": [ -25.82666, 13.71536, -25.82666, 13.71536, -25.82666, 13.71536, -25.82666, 13.71536 ]
						}
					]
				},
				"lid-under-1": {
					"lid-under-1": [
						{
							"time": 0.1667,
							"vertices": [ -12.24036, -35.1825, -12.24036, -35.1825, -12.24036, -35.1825, -12.24036, -35.1825 ]
						}
					]
				},
				"lid-under-2": {
					"lid-under-2": [
						{
							"time": 0.1667,
							"vertices": [ -12.24036, -35.1825, -12.24036, -35.1825, -12.24036, -35.1825, -12.24036, -35.1825 ]
						}
					]
				}
			}
		}
	}
}
}