
lupin.png
size: 2048,2048
format: RGBA8888
filter: Linear,Linear
repeat: none
beard
  rotate: true
  xy: 201, 273
  size: 142, 224
  orig: 154, 238
  offset: 4, 11
  index: -1
bird/b_body
  rotate: false
  xy: 1582, 143
  size: 374, 138
  orig: 374, 138
  offset: 0, 0
  index: -1
bird/b_eye
  rotate: true
  xy: 1989, 2017
  size: 27, 32
  orig: 29, 35
  offset: 1, 1
  index: -1
bird/b_peak
  rotate: false
  xy: 1733, 1912
  size: 59, 41
  orig: 61, 43
  offset: 1, 1
  index: -1
bird/leg
  rotate: true
  xy: 535, 1787
  size: 52, 80
  orig: 53, 80
  offset: 1, 0
  index: -1
bird/wing_2
  rotate: false
  xy: 530, 1216
  size: 206, 86
  orig: 208, 88
  offset: 1, 1
  index: -1
bird/wing_4
  rotate: true
  xy: 370, 681
  size: 122, 231
  orig: 124, 233
  offset: 1, 1
  index: -1
body
  rotate: true
  xy: 1015, 1998
  size: 26, 215
  orig: 26, 215
  offset: 0, 0
  index: -1
body_1
  rotate: true
  xy: 535, 533
  size: 126, 213
  orig: 126, 213
  offset: 0, 0
  index: -1
eagle/body
  rotate: false
  xy: 356, 117
  size: 374, 138
  orig: 374, 138
  offset: 0, 0
  index: -1
eagle/leg
  rotate: true
  xy: 1647, 1699
  size: 56, 112
  orig: 60, 112
  offset: 4, 0
  index: -1
eagle/wing_2
  rotate: false
  xy: 832, 1203
  size: 206, 86
  orig: 206, 86
  offset: 0, 0
  index: -1
eagle/wing_4
  rotate: true
  xy: 971, 642
  size: 122, 231
  orig: 122, 231
  offset: 0, 0
  index: -1
eyebrown_left_01
  rotate: false
  xy: 2, 2011
  size: 28, 27
  orig: 30, 29
  offset: 1, 1
  index: -1
eyebrown_right_01
  rotate: false
  xy: 32, 2011
  size: 29, 27
  orig: 31, 29
  offset: 1, 1
  index: -1
eyes/eye_Hulk
  rotate: false
  xy: 1874, 1627
  size: 132, 61
  orig: 145, 69
  offset: 7, 5
  index: -1
eyes/eye_angry
  rotate: true
  xy: 1511, 973
  size: 102, 126
  orig: 106, 126
  offset: 3, 0
  index: -1
eyes/eye_die
  rotate: false
  xy: 1832, 1559
  size: 152, 66
  orig: 174, 84
  offset: 12, 4
  index: -1
eyes/eye_happy
  rotate: false
  xy: 111, 1392
  size: 114, 75
  orig: 114, 75
  offset: 0, 0
  index: -1
eyes/eye_heat
  rotate: false
  xy: 55, 1790
  size: 87, 51
  orig: 93, 56
  offset: 3, 2
  index: -1
eyes/eye_idle
  rotate: true
  xy: 229, 1789
  size: 51, 97
  orig: 51, 97
  offset: 0, 0
  index: -1
eyes/eye_laugh
  rotate: false
  xy: 328, 1789
  size: 85, 51
  orig: 85, 51
  offset: 0, 0
  index: -1
eyes/eye_sad
  rotate: true
  xy: 420, 1217
  size: 85, 108
  orig: 85, 108
  offset: 0, 0
  index: -1
eyes/eye_sinister
  rotate: false
  xy: 1065, 1516
  size: 145, 68
  orig: 145, 69
  offset: 0, 1
  index: -1
eyes/eye_tired
  rotate: false
  xy: 2, 1545
  size: 111, 66
  orig: 111, 66
  offset: 0, 0
  index: -1
eyes/eye_whistle
  rotate: false
  xy: 1261, 1823
  size: 78, 50
  orig: 78, 50
  offset: 0, 0
  index: -1
eyes/eye_worry
  rotate: true
  xy: 1437, 1701
  size: 57, 68
  orig: 57, 68
  offset: 0, 0
  index: -1
eyes/eyes_03
  rotate: true
  xy: 308, 1608
  size: 63, 110
  orig: 65, 112
  offset: 1, 1
  index: -1
eyes/eyes_06
  rotate: false
  xy: 802, 1833
  size: 108, 49
  orig: 109, 49
  offset: 1, 0
  index: -1
eyes/eyes_08
  rotate: false
  xy: 765, 229
  size: 178, 142
  orig: 179, 142
  offset: 1, 0
  index: -1
eyes/eyes_10
  rotate: false
  xy: 857, 1527
  size: 72, 68
  orig: 72, 68
  offset: 0, 0
  index: -1
eyes/eyes_14
  rotate: false
  xy: 1938, 1857
  size: 93, 47
  orig: 94, 47
  offset: 0, 0
  index: -1
eyes/eyes_15
  rotate: false
  xy: 1952, 1138
  size: 92, 115
  orig: 92, 115
  offset: 0, 0
  index: -1
eyes/eyes_17
  rotate: false
  xy: 1824, 1255
  size: 156, 82
  orig: 156, 82
  offset: 0, 0
  index: -1
eyes/eyes_19
  rotate: false
  xy: 1761, 1698
  size: 73, 57
  orig: 74, 57
  offset: 0, 0
  index: -1
eyes/eyes_21
  rotate: false
  xy: 525, 805
  size: 151, 114
  orig: 152, 116
  offset: 1, 0
  index: -1
eyes/eyes_shock
  rotate: false
  xy: 668, 1375
  size: 94, 79
  orig: 109, 86
  offset: 10, 0
  index: -1
eyes/lv21_girl_eye_1
  rotate: true
  xy: 1820, 1488
  size: 69, 79
  orig: 95, 96
  offset: 13, 10
  index: -1
eyes/lv21_girl_eye_2
  rotate: false
  xy: 235, 1609
  size: 71, 63
  orig: 95, 96
  offset: 18, 10
  index: -1
eyes/lv21_girl_eye_3
  rotate: true
  xy: 1043, 1442
  size: 72, 81
  orig: 95, 96
  offset: 15, 14
  index: -1
foot_back
  rotate: false
  xy: 1521, 1916
  size: 78, 40
  orig: 79, 40
  offset: 0, 0
  index: -1
foot_bottom
  rotate: true
  xy: 2, 1943
  size: 35, 73
  orig: 40, 79
  offset: 3, 4
  index: -1
foot_side
  rotate: false
  xy: 684, 1929
  size: 94, 37
  orig: 94, 51
  offset: 0, 0
  index: -1
fx/cloud/02/cloud_1
  rotate: false
  xy: 948, 1661
  size: 59, 59
  orig: 59, 59
  offset: 0, 0
  index: -1
fx/cloud/02/cloud_2
  rotate: false
  xy: 1009, 1654
  size: 59, 59
  orig: 59, 59
  offset: 0, 0
  index: -1
fx/cloud/02/cloud_3
  rotate: false
  xy: 1502, 1816
  size: 59, 50
  orig: 59, 59
  offset: 0, 9
  index: -1
fx/cloud/02/cloud_4
  rotate: true
  xy: 685, 1781
  size: 53, 58
  orig: 59, 59
  offset: 4, 0
  index: -1
fx/drop
  rotate: false
  xy: 63, 2011
  size: 55, 27
  orig: 62, 37
  offset: 5, 4
  index: -1
head_status/mohoi
  rotate: false
  xy: 63, 2011
  size: 55, 27
  orig: 62, 37
  offset: 5, 4
  index: -1
fx/electric/gun_fx_1
  rotate: false
  xy: 2, 1613
  size: 73, 62
  orig: 106, 80
  offset: 18, 2
  index: -1
fx/electric/gun_fx_2
  rotate: false
  xy: 1767, 1861
  size: 57, 47
  orig: 106, 80
  offset: 24, 7
  index: -1
fx/electric/gun_fx_3
  rotate: false
  xy: 660, 1598
  size: 95, 63
  orig: 106, 80
  offset: 2, 7
  index: -1
fx/electric/gun_fx_4
  rotate: false
  xy: 420, 1607
  size: 82, 63
  orig: 106, 80
  offset: 21, 13
  index: -1
fx/electric/gun_fx_5
  rotate: false
  xy: 1070, 1651
  size: 85, 60
  orig: 106, 80
  offset: 7, 6
  index: -1
fx/explosion/explosion_01
  rotate: false
  xy: 1863, 2018
  size: 43, 26
  orig: 250, 250
  offset: 100, 33
  index: -1
fx/explosion/explosion_02
  rotate: false
  xy: 2, 1473
  size: 71, 70
  orig: 250, 250
  offset: 82, 27
  index: -1
fx/explosion/explosion_03
  rotate: true
  xy: 1028, 1005
  size: 98, 115
  orig: 250, 250
  offset: 64, 19
  index: -1
fx/fire/01/fire_01
  rotate: true
  xy: 1759, 1412
  size: 74, 77
  orig: 79, 82
  offset: 3, 2
  index: -1
fx/fire/01/fire_02
  rotate: true
  xy: 227, 1392
  size: 75, 79
  orig: 80, 82
  offset: 3, 2
  index: -1
fx/fire/01/fire_03
  rotate: true
  xy: 1200, 1435
  size: 73, 76
  orig: 78, 80
  offset: 3, 2
  index: -1
fx/fire/01/fire_04
  rotate: true
  xy: 1838, 1412
  size: 74, 75
  orig: 79, 79
  offset: 3, 1
  index: -1
fx/fire/01/fire_05
  rotate: true
  xy: 1915, 1412
  size: 74, 79
  orig: 80, 82
  offset: 3, 2
  index: -1
fx/fire/02/Layer_1
  rotate: true
  xy: 688, 1528
  size: 67, 167
  orig: 81, 174
  offset: 4, 2
  index: -1
fx/fire/02/Layer_2
  rotate: true
  xy: 332, 1467
  size: 70, 149
  orig: 71, 174
  offset: 0, 5
  index: -1
fx/fire/02/Layer_3
  rotate: true
  xy: 887, 1444
  size: 71, 154
  orig: 71, 174
  offset: 0, 5
  index: -1
fx/fire/02/Layer_4
  rotate: true
  xy: 757, 1597
  size: 63, 172
  orig: 71, 174
  offset: 3, 2
  index: -1
fx/fire/02/Layer_5
  rotate: true
  xy: 216, 1540
  size: 66, 153
  orig: 71, 174
  offset: 2, 1
  index: -1
fx/fire/02/Layer_6
  rotate: true
  xy: 1069, 1586
  size: 63, 158
  orig: 71, 174
  offset: 3, 3
  index: -1
fx/gun_fire/shoot_eff
  rotate: true
  xy: 446, 921
  size: 107, 127
  orig: 119, 150
  offset: 8, 12
  index: -1
fx/hit
  rotate: false
  xy: 732, 81
  size: 148, 146
  orig: 148, 146
  offset: 0, 0
  index: -1
fx/hit_1
  rotate: false
  xy: 1432, 184
  size: 148, 143
  orig: 148, 146
  offset: 0, 0
  index: -1
fx/noise_1
  rotate: false
  xy: 267, 2002
  size: 79, 29
  orig: 80, 30
  offset: 0, 0
  index: -1
fx/ocean_wave/wave_1
  rotate: false
  xy: 2, 690
  size: 366, 118
  orig: 366, 127
  offset: 0, 0
  index: -1
fx/ocean_wave/wave_2
  rotate: false
  xy: 603, 661
  size: 366, 119
  orig: 366, 127
  offset: 0, 0
  index: -1
fx/ocean_wave/wave_3
  rotate: false
  xy: 1339, 606
  size: 366, 119
  orig: 366, 127
  offset: 0, 0
  index: -1
fx/ocean_wave/wave_4
  rotate: false
  xy: 2, 810
  size: 366, 110
  orig: 366, 127
  offset: 0, 0
  index: -1
fx/phaogiay/obj1
  rotate: false
  xy: 179, 2033
  size: 12, 11
  orig: 14, 13
  offset: 1, 1
  index: -1
fx/phaogiay/obj2
  rotate: false
  xy: 376, 2030
  size: 18, 14
  orig: 20, 16
  offset: 1, 1
  index: -1
fx/phaogiay/obj3
  rotate: true
  xy: 462, 2026
  size: 18, 42
  orig: 20, 44
  offset: 1, 1
  index: -1
fx/phaogiay/obj4
  rotate: true
  xy: 396, 2030
  size: 14, 22
  orig: 16, 24
  offset: 1, 1
  index: -1
fx/phaogiay/obj5
  rotate: true
  xy: 1704, 2019
  size: 25, 60
  orig: 32, 64
  offset: 3, 2
  index: -1
fx/phaogiay/obj6
  rotate: true
  xy: 1637, 2021
  size: 23, 30
  orig: 28, 34
  offset: 3, 1
  index: -1
fx/spark/01/spark_00
  rotate: false
  xy: 2, 1849
  size: 55, 47
  orig: 57, 50
  offset: 0, 1
  index: -1
fx/spark/01/spark_01
  rotate: false
  xy: 1906, 1690
  size: 103, 57
  orig: 105, 59
  offset: 1, 1
  index: -1
fx/spark/01/spark_02
  rotate: false
  xy: 1856, 1909
  size: 82, 42
  orig: 87, 44
  offset: 1, 1
  index: -1
fx/spark/01/spark_03
  rotate: true
  xy: 1062, 1880
  size: 43, 61
  orig: 45, 64
  offset: 0, 2
  index: -1
fx/spark/01/spark_04
  rotate: false
  xy: 606, 1529
  size: 80, 67
  orig: 83, 69
  offset: 0, 2
  index: -1
fx/spark/02/Sparks_05_01
  rotate: false
  xy: 1048, 346
  size: 243, 137
  orig: 363, 273
  offset: 6, 72
  index: -1
fx/spray
  rotate: false
  xy: 745, 1778
  size: 89, 53
  orig: 89, 53
  offset: 0, 0
  index: -1
fx/waiter_splash/waiter_splash_1
  rotate: false
  xy: 882, 61
  size: 380, 143
  orig: 666, 326
  offset: 147, 12
  index: -1
fx/water/01/water_4
  rotate: false
  xy: 1356, 1576
  size: 370, 62
  orig: 370, 62
  offset: 0, 0
  index: -1
fx/wave/wave_1
  rotate: false
  xy: 945, 206
  size: 485, 129
  orig: 485, 129
  offset: 0, 0
  index: -1
fx/wave_o_sound
  rotate: false
  xy: 1094, 1105
  size: 96, 96
  orig: 100, 100
  offset: 2, 2
  index: -1
fx/zzz
  rotate: false
  xy: 1901, 1488
  size: 82, 69
  orig: 95, 86
  offset: 7, 8
  index: -1
hair/empty
  rotate: true
  xy: 2, 2043
  size: 1, 2
  orig: 3, 2
  offset: 1, 0
  index: -1
hair/girl_hair_2
  rotate: true
  xy: 427, 257
  size: 137, 336
  orig: 160, 353
  offset: 10, 10
  index: -1
hands/hand
  rotate: true
  xy: 117, 1933
  size: 36, 56
  orig: 39, 59
  offset: 2, 1
  index: -1
hands/hand_02
  rotate: false
  xy: 1629, 1990
  size: 53, 29
  orig: 54, 31
  offset: 0, 1
  index: -1
hands/hand_04
  rotate: true
  xy: 175, 1932
  size: 36, 56
  orig: 39, 59
  offset: 2, 1
  index: -1
head_status/angry
  rotate: false
  xy: 77, 1942
  size: 38, 35
  orig: 38, 35
  offset: 0, 0
  index: -1
head_status/cold
  rotate: false
  xy: 829, 373
  size: 217, 136
  orig: 240, 198
  offset: 12, 50
  index: -1
head_status/cry_1
  rotate: false
  xy: 394, 1387
  size: 81, 78
  orig: 87, 85
  offset: 4, 1
  index: -1
head_status/cry_2
  rotate: false
  xy: 308, 1389
  size: 84, 76
  orig: 87, 85
  offset: 1, 1
  index: -1
head_status/poison
  rotate: false
  xy: 1293, 337
  size: 170, 138
  orig: 240, 198
  offset: 32, 22
  index: -1
head_status/scratch
  rotate: false
  xy: 1596, 1865
  size: 119, 46
  orig: 120, 47
  offset: 1, 1
  index: -1
head_status/sweat
  rotate: false
  xy: 1278, 1433
  size: 152, 72
  orig: 152, 78
  offset: 0, 0
  index: -1
head_status/wrinkle_1
  rotate: false
  xy: 1512, 1868
  size: 82, 46
  orig: 83, 46
  offset: 1, 0
  index: -1
head_status/wrinkle_2
  rotate: false
  xy: 142, 1971
  size: 74, 31
  orig: 74, 31
  offset: 0, 0
  index: -1
lowerArm_left
  rotate: true
  xy: 738, 1215
  size: 87, 92
  orig: 92, 96
  offset: 2, 2
  index: -1
lowerArm_left_1
  rotate: true
  xy: 1349, 1284
  size: 82, 87
  orig: 92, 96
  offset: 2, 8
  index: -1
lowerArm_right
  rotate: true
  xy: 464, 1841
  size: 48, 125
  orig: 52, 134
  offset: 2, 8
  index: -1
lowerArm_right_1
  rotate: true
  xy: 1563, 1813
  size: 50, 122
  orig: 52, 134
  offset: 0, 9
  index: -1
lv21_boob_1
  rotate: false
  xy: 477, 1380
  size: 85, 80
  orig: 85, 80
  offset: 0, 0
  index: -1
lv21_boob_2
  rotate: false
  xy: 1438, 1267
  size: 89, 82
  orig: 89, 82
  offset: 0, 0
  index: -1
lv21_boob_3
  rotate: true
  xy: 483, 1462
  size: 70, 82
  orig: 89, 82
  offset: 7, 0
  index: -1
lv21_boob_rock
  rotate: false
  xy: 567, 1457
  size: 72, 70
  orig: 89, 82
  offset: 11, 5
  index: -1
mouths/lv21_2_girl_lip_1
  rotate: false
  xy: 1940, 1906
  size: 86, 42
  orig: 97, 50
  offset: 6, 3
  index: -1
mouths/lv21_2_girl_lip_2
  rotate: false
  xy: 1838, 1953
  size: 47, 34
  orig: 97, 50
  offset: 15, 7
  index: -1
mouths/lv21_2_girl_lip_3
  rotate: false
  xy: 1125, 1877
  size: 49, 45
  orig: 97, 50
  offset: 28, 1
  index: -1
mouths/mouth_02
  rotate: false
  xy: 193, 2033
  size: 19, 11
  orig: 24, 14
  offset: 4, 1
  index: -1
mouths/mouth_08
  rotate: false
  xy: 1303, 1875
  size: 83, 45
  orig: 83, 45
  offset: 0, 0
  index: -1
mouths/mouth_10
  rotate: false
  xy: 1984, 1986
  size: 54, 29
  orig: 57, 33
  offset: 2, 1
  index: -1
mouths/mouth_12
  rotate: false
  xy: 420, 2028
  size: 40, 16
  orig: 42, 19
  offset: 1, 1
  index: -1
mouths/mouth_15
  rotate: false
  xy: 261, 1969
  size: 62, 31
  orig: 64, 33
  offset: 1, 1
  index: -1
mouths/mouth_16
  rotate: false
  xy: 1794, 1910
  size: 60, 41
  orig: 62, 43
  offset: 1, 1
  index: -1
mouths/mouth_22
  rotate: false
  xy: 1100, 1713
  size: 81, 56
  orig: 81, 61
  offset: 0, 0
  index: -1
mouths/mouth_25
  rotate: false
  xy: 120, 2011
  size: 51, 27
  orig: 51, 28
  offset: 0, 1
  index: -1
mouths/mouth_25.1
  rotate: true
  xy: 1097, 1925
  size: 39, 42
  orig: 39, 42
  offset: 0, 0
  index: -1
mouths/mouth_26
  rotate: false
  xy: 1263, 2023
  size: 84, 21
  orig: 84, 22
  offset: 0, 0
  index: -1
mouths/mouth_28
  rotate: true
  xy: 1687, 1811
  size: 51, 56
  orig: 51, 56
  offset: 0, 0
  index: -1
mouths/mouth_29
  rotate: false
  xy: 1887, 1953
  size: 73, 34
  orig: 73, 34
  offset: 0, 0
  index: -1
mouths/mouth_30
  rotate: false
  xy: 764, 1373
  size: 98, 79
  orig: 99, 79
  offset: 0, 0
  index: -1
mouths/mouth_31
  rotate: false
  xy: 1550, 1432
  size: 98, 73
  orig: 99, 74
  offset: 0, 1
  index: -1
mouths/mouth_32
  rotate: false
  xy: 1650, 1419
  size: 107, 73
  orig: 107, 74
  offset: 0, 1
  index: -1
mouths/mouth_33
  rotate: false
  xy: 234, 2003
  size: 31, 28
  orig: 31, 28
  offset: 0, 0
  index: -1
mouths/mouth_34
  rotate: false
  xy: 77, 1613
  size: 77, 62
  orig: 77, 62
  offset: 0, 0
  index: -1
mouths/mouth_angry
  rotate: false
  xy: 1422, 1918
  size: 97, 39
  orig: 97, 48
  offset: 0, 0
  index: -1
mouths/mouth_bersek
  rotate: false
  xy: 1745, 1809
  size: 83, 50
  orig: 107, 85
  offset: 8, 17
  index: -1
mouths/mouth_cry1
  rotate: false
  xy: 144, 1790
  size: 83, 51
  orig: 93, 66
  offset: 5, 8
  index: -1
mouths/mouth_cry2
  rotate: false
  xy: 1039, 1829
  size: 84, 49
  orig: 93, 66
  offset: 4, 6
  index: -1
mouths/mouth_die
  rotate: false
  xy: 2, 1980
  size: 98, 29
  orig: 115, 38
  offset: 11, 3
  index: -1
mouths/mouth_excited
  rotate: false
  xy: 182, 1220
  size: 102, 84
  orig: 107, 85
  offset: 0, 0
  index: -1
mouths/mouth_fear_1
  rotate: false
  xy: 1176, 1877
  size: 125, 43
  orig: 125, 43
  offset: 0, 0
  index: -1
mouths/mouth_fear_2
  rotate: false
  xy: 75, 1471
  size: 112, 69
  orig: 112, 69
  offset: 0, 0
  index: -1
mouths/mouth_happy
  rotate: true
  xy: 931, 1594
  size: 65, 67
  orig: 65, 67
  offset: 0, 0
  index: -1
mouths/mouth_idle
  rotate: false
  xy: 1962, 1950
  size: 49, 34
  orig: 50, 34
  offset: 0, 0
  index: -1
mouths/mouth_laugh
  rotate: false
  xy: 994, 889
  size: 120, 114
  orig: 120, 115
  offset: 0, 1
  index: -1
mouths/mouth_sad
  rotate: false
  xy: 1669, 2021
  size: 33, 23
  orig: 33, 24
  offset: 0, 1
  index: -1
mouths/mouth_scare
  rotate: true
  xy: 115, 1542
  size: 66, 99
  orig: 76, 102
  offset: 2, 3
  index: -1
mouths/mouth_sing_1
  rotate: false
  xy: 506, 2026
  size: 82, 18
  orig: 142, 63
  offset: 32, 22
  index: -1
mouths/mouth_sing_2
  rotate: false
  xy: 1625, 1955
  size: 94, 32
  orig: 142, 63
  offset: 26, 15
  index: -1
mouths/mouth_sing_3
  rotate: false
  xy: 591, 1841
  size: 75, 48
  orig: 142, 63
  offset: 25, 4
  index: -1
mouths/mouth_sing_4
  rotate: false
  xy: 831, 1884
  size: 90, 42
  orig: 142, 63
  offset: 24, 5
  index: -1
mouths/mouth_sing_5
  rotate: false
  xy: 1309, 1708
  size: 126, 55
  orig: 142, 63
  offset: 10, 3
  index: -1
mouths/mouth_sinister
  rotate: true
  xy: 1125, 1826
  size: 49, 50
  orig: 52, 50
  offset: 0, 0
  index: -1
mouths/mouth_sup1
  rotate: false
  xy: 1329, 1188
  size: 100, 94
  orig: 115, 96
  offset: 3, 1
  index: -1
mouths/mouth_tired
  rotate: false
  xy: 233, 1931
  size: 55, 36
  orig: 56, 36
  offset: 0, 0
  index: -1
mouths/mouth_whistle
  rotate: true
  xy: 668, 1836
  size: 48, 53
  orig: 71, 54
  offset: 23, 1
  index: -1
mouths/mouth_worry
  rotate: true
  xy: 2, 1791
  size: 56, 51
  orig: 56, 51
  offset: 0, 0
  index: -1
props/24_3_TnT
  rotate: false
  xy: 1229, 1580
  size: 125, 64
  orig: 132, 75
  offset: 5, 4
  index: -1
props/24_3_bug
  rotate: true
  xy: 575, 921
  size: 107, 121
  orig: 118, 133
  offset: 3, 5
  index: -1
props/Level_20_beard1
  rotate: false
  xy: 876, 1928
  size: 66, 38
  orig: 93, 66
  offset: 15, 20
  index: -1
props/Level_20_beard2
  rotate: false
  xy: 1038, 1773
  size: 71, 54
  orig: 93, 66
  offset: 8, 4
  index: -1
props/Level_20_clock2
  rotate: false
  xy: 1908, 2018
  size: 26, 26
  orig: 36, 30
  offset: 6, 1
  index: -1
props/Level_20_clother
  rotate: false
  xy: 1582, 727
  size: 134, 123
  orig: 145, 133
  offset: 0, 5
  index: -1
props/Level_20_clother1
  rotate: false
  xy: 1861, 1039
  size: 168, 97
  orig: 189, 114
  offset: 12, 8
  index: -1
props/armor
  rotate: false
  xy: 325, 1968
  size: 301, 30
  orig: 313, 31
  offset: 1, 1
  index: -1
props/ball
  rotate: true
  xy: 1850, 1751
  size: 56, 57
  orig: 120, 87
  offset: 36, 13
  index: -1
props/ball_1
  rotate: false
  xy: 448, 1672
  size: 58, 58
  orig: 58, 58
  offset: 0, 0
  index: -1
props/ball_pen
  rotate: true
  xy: 1717, 1864
  size: 46, 48
  orig: 50, 49
  offset: 1, 1
  index: -1
props/ball_tennis
  rotate: false
  xy: 1126, 1442
  size: 72, 72
  orig: 72, 72
  offset: 0, 0
  index: -1
props/body_blue
  rotate: true
  xy: 377, 1122
  size: 92, 280
  orig: 92, 280
  offset: 0, 0
  index: -1
props/body_housekeeping
  rotate: true
  xy: 812, 1109
  size: 92, 280
  orig: 92, 280
  offset: 0, 0
  index: -1
props/bone
  rotate: false
  xy: 750, 531
  size: 191, 128
  orig: 221, 148
  offset: 15, 10
  index: -1
props/book_1
  rotate: false
  xy: 226, 1306
  size: 87, 81
  orig: 88, 82
  offset: 0, 0
  index: -1
props/botle
  rotate: true
  xy: 1802, 933
  size: 104, 144
  orig: 125, 159
  offset: 14, 4
  index: -1
props/botle_1
  rotate: false
  xy: 1111, 1771
  size: 97, 53
  orig: 100, 61
  offset: 1, 6
  index: -1
props/botle_1a
  rotate: false
  xy: 1210, 1768
  size: 97, 53
  orig: 100, 61
  offset: 1, 6
  index: -1
props/botle_2a
  rotate: true
  xy: 290, 1930
  size: 36, 82
  orig: 43, 91
  offset: 3, 4
  index: -1
props/botle_2b
  rotate: true
  xy: 374, 1930
  size: 36, 82
  orig: 43, 91
  offset: 3, 4
  index: -1
props/botle_2c
  rotate: true
  xy: 458, 1930
  size: 36, 82
  orig: 43, 91
  offset: 3, 4
  index: -1
props/botle_2d
  rotate: true
  xy: 542, 1930
  size: 36, 82
  orig: 43, 91
  offset: 3, 4
  index: -1
props/bow_tie
  rotate: false
  xy: 1601, 1913
  size: 64, 40
  orig: 66, 42
  offset: 1, 1
  index: -1
props/bubble
  rotate: false
  xy: 1212, 746
  size: 178, 120
  orig: 178, 120
  offset: 0, 0
  index: -1
props/bucket_2
  rotate: false
  xy: 836, 1778
  size: 200, 52
  orig: 200, 52
  offset: 0, 0
  index: -1
props/bumerang
  rotate: true
  xy: 678, 784
  size: 116, 157
  orig: 240, 180
  offset: 68, 15
  index: -1
props/buoyring_b
  rotate: false
  xy: 1040, 1203
  size: 193, 86
  orig: 193, 86
  offset: 0, 0
  index: -1
props/buoyring_f
  rotate: false
  xy: 1309, 1765
  size: 153, 53
  orig: 153, 53
  offset: 0, 0
  index: -1
props/ca_heo
  rotate: false
  xy: 472, 396
  size: 355, 133
  orig: 355, 133
  offset: 0, 0
  index: -1
props/can_cau
  rotate: false
  xy: 1286, 1507
  size: 398, 67
  orig: 398, 67
  offset: 0, 0
  index: -1
props/candle_1
  rotate: true
  xy: 944, 1926
  size: 38, 95
  orig: 38, 95
  offset: 0, 0
  index: -1
props/candle_2
  rotate: true
  xy: 348, 2032
  size: 12, 26
  orig: 12, 26
  offset: 0, 0
  index: -1
props/candle_3
  rotate: true
  xy: 1766, 2019
  size: 25, 95
  orig: 25, 95
  offset: 0, 0
  index: -1
props/cape_1
  rotate: false
  xy: 148, 922
  size: 296, 106
  orig: 528, 231
  offset: 19, 107
  index: -1
props/cape_4
  rotate: false
  xy: 1306, 477
  size: 265, 127
  orig: 528, 231
  offset: 37, 48
  index: -1
props/cape_5
  rotate: false
  xy: 741, 1011
  size: 285, 96
  orig: 528, 231
  offset: 74, 40
  index: -1
props/cape_6
  rotate: false
  xy: 2, 565
  size: 318, 123
  orig: 528, 231
  offset: 185, 21
  index: -1
props/card
  rotate: true
  xy: 1830, 1809
  size: 50, 83
  orig: 50, 83
  offset: 0, 0
  index: -1
props/card_green
  rotate: true
  xy: 328, 1732
  size: 55, 68
  orig: 57, 68
  offset: 1, 0
  index: -1
props/card_red
  rotate: true
  xy: 1464, 1760
  size: 54, 66
  orig: 57, 68
  offset: 1, 1
  index: -1
props/card_yellow
  rotate: true
  xy: 521, 1730
  size: 55, 65
  orig: 57, 68
  offset: 1, 2
  index: -1
props/chain
  rotate: true
  xy: 628, 1968
  size: 30, 356
  orig: 30, 356
  offset: 0, 0
  index: -1
props/chan_vit
  rotate: true
  xy: 2, 433
  size: 130, 264
  orig: 155, 297
  offset: 9, 17
  index: -1
props/chan_vit1
  rotate: false
  xy: 1431, 1077
  size: 284, 92
  orig: 298, 117
  offset: 5, 10
  index: -1
props/cheese
  rotate: false
  xy: 508, 1670
  size: 61, 58
  orig: 61, 58
  offset: 0, 0
  index: -1
props/chiakhoa_1
  rotate: true
  xy: 1145, 995
  size: 101, 171
  orig: 119, 182
  offset: 10, 5
  index: -1
props/chiakhoa_2
  rotate: true
  xy: 156, 1610
  size: 62, 77
  orig: 75, 96
  offset: 5, 8
  index: -1
props/cigaret
  rotate: false
  xy: 1041, 1926
  size: 54, 38
  orig: 70, 52
  offset: 6, 7
  index: -1
props/cockroach
  rotate: false
  xy: 617, 1782
  size: 66, 52
  orig: 84, 61
  offset: 8, 2
  index: -1
props/con_lac
  rotate: true
  xy: 59, 1843
  size: 46, 168
  orig: 50, 174
  offset: 2, 3
  index: -1
props/crowbar
  rotate: false
  xy: 990, 766
  size: 220, 117
  orig: 240, 180
  offset: 12, 36
  index: -1
props/crowbar_brake
  rotate: false
  xy: 2, 145
  size: 180, 144
  orig: 240, 144
  offset: 12, 0
  index: -1
props/cry
  rotate: false
  xy: 676, 1886
  size: 153, 41
  orig: 159, 54
  offset: 3, 5
  index: -1
props/day_cau
  rotate: false
  xy: 1532, 1757
  size: 316, 50
  orig: 316, 50
  offset: 0, 0
  index: -1
props/day_thung
  rotate: false
  xy: 590, 2026
  size: 671, 18
  orig: 671, 18
  offset: 0, 0
  index: -1
props/dirt_01
  rotate: false
  xy: 1936, 2018
  size: 51, 26
  orig: 51, 26
  offset: 0, 0
  index: -1
props/eraser
  rotate: false
  xy: 794, 1454
  size: 91, 71
  orig: 110, 74
  offset: 9, 2
  index: -1
props/firefly
  rotate: true
  xy: 1283, 1646
  size: 60, 96
  orig: 63, 100
  offset: 2, 3
  index: -1
props/fish_1
  rotate: false
  xy: 371, 1539
  size: 118, 66
  orig: 125, 76
  offset: 4, 4
  index: -1
props/fishtank_1
  rotate: false
  xy: 184, 126
  size: 170, 145
  orig: 188, 176
  offset: 11, 11
  index: -1
props/fishtank_2
  rotate: false
  xy: 1639, 963
  size: 161, 103
  orig: 188, 176
  offset: 14, 17
  index: -1
props/flare_gun
  rotate: false
  xy: 2, 1395
  size: 107, 74
  orig: 120, 90
  offset: 9, 5
  index: -1
props/flashlight
  rotate: false
  xy: 1116, 885
  size: 169, 108
  orig: 170, 108
  offset: 1, 0
  index: -1
props/flashlight11
  rotate: false
  xy: 1432, 1433
  size: 116, 72
  orig: 170, 108
  offset: 54, 0
  index: -1
props/floor_break
  rotate: false
  xy: 1496, 852
  size: 223, 109
  orig: 223, 110
  offset: 0, 1
  index: -1
props/flut_1
  rotate: false
  xy: 986, 1966
  size: 216, 30
  orig: 221, 40
  offset: 3, 4
  index: -1
props/flut_2
  rotate: true
  xy: 1909, 1749
  size: 54, 121
  orig: 54, 121
  offset: 0, 0
  index: -1
props/giot_nuoc
  rotate: false
  xy: 1507, 1700
  size: 138, 55
  orig: 138, 55
  offset: 0, 0
  index: -1
props/glasses_1
  rotate: false
  xy: 1915, 1805
  size: 124, 50
  orig: 124, 50
  offset: 0, 0
  index: -1
props/glue
  rotate: true
  xy: 208, 1674
  size: 57, 114
  orig: 57, 114
  offset: 0, 0
  index: -1
props/gosh_1
  rotate: false
  xy: 1264, 54
  size: 162, 150
  orig: 170, 157
  offset: 5, 0
  index: -1
props/gosh_2
  rotate: false
  xy: 698, 902
  size: 170, 107
  orig: 170, 107
  offset: 0, 0
  index: -1
props/grenade
  rotate: true
  xy: 1177, 1826
  size: 49, 82
  orig: 64, 85
  offset: 5, 1
  index: -1
props/gun_02
  rotate: false
  xy: 564, 1378
  size: 102, 76
  orig: 102, 88
  offset: 0, 6
  index: -1
props/gun_03
  rotate: false
  xy: 1392, 729
  size: 188, 121
  orig: 240, 180
  offset: 28, 24
  index: -1
props/gun_lv19_1
  rotate: false
  xy: 1868, 426
  size: 159, 135
  orig: 240, 180
  offset: 41, 15
  index: -1
props/heat
  rotate: false
  xy: 2, 1899
  size: 49, 42
  orig: 50, 44
  offset: 0, 0
  index: -1
props/holecover
  rotate: false
  xy: 931, 1517
  size: 132, 68
  orig: 132, 68
  offset: 0, 0
  index: -1
props/icon_boar
  rotate: false
  xy: 1204, 617
  size: 133, 127
  orig: 133, 127
  offset: 0, 0
  index: -1
props/icon_fearful
  rotate: false
  xy: 1707, 566
  size: 133, 127
  orig: 133, 127
  offset: 0, 0
  index: -1
props/ken
  rotate: false
  xy: 1718, 695
  size: 172, 121
  orig: 240, 180
  offset: 27, 24
  index: -1
props/key
  rotate: true
  xy: 1775, 1630
  size: 60, 97
  orig: 60, 97
  offset: 0, 0
  index: -1
props/khoan
  rotate: true
  xy: 1721, 818
  size: 113, 206
  orig: 113, 206
  offset: 0, 0
  index: -1
props/knife
  rotate: false
  xy: 2, 1735
  size: 241, 52
  orig: 242, 52
  offset: 1, 0
  index: -1
props/leaf
  rotate: true
  xy: 1529, 1259
  size: 78, 293
  orig: 78, 293
  offset: 0, 0
  index: -1
props/leaf_1
  rotate: false
  xy: 322, 554
  size: 211, 125
  orig: 211, 125
  offset: 0, 0
  index: -1
props/light
  rotate: true
  xy: 1478, 1351
  size: 79, 89
  orig: 79, 89
  offset: 0, 0
  index: -1
props/lighter
  rotate: false
  xy: 1038, 1715
  size: 60, 56
  orig: 65, 57
  offset: 2, 1
  index: -1
props/line_purple
  rotate: false
  xy: 245, 1733
  size: 81, 54
  orig: 81, 54
  offset: 0, 0
  index: -1
props/line_red
  rotate: false
  xy: 415, 1788
  size: 60, 51
  orig: 60, 51
  offset: 0, 0
  index: -1
props/mask_2
  rotate: false
  xy: 1892, 690
  size: 148, 126
  orig: 160, 132
  offset: 6, 0
  index: -1
props/mask_3
  rotate: false
  xy: 943, 511
  size: 154, 129
  orig: 160, 132
  offset: 3, 0
  index: -1
props/mat_na
  rotate: true
  xy: 1465, 329
  size: 140, 167
  orig: 157, 180
  offset: 9, 5
  index: -1
props/mat_na_white
  rotate: false
  xy: 1428, 9
  size: 146, 173
  orig: 157, 180
  offset: 6, 2
  index: -1
props/meat
  rotate: false
  xy: 1287, 868
  size: 207, 108
  orig: 221, 148
  offset: 7, 20
  index: -1
props/mui_ten
  rotate: false
  xy: 1449, 1992
  size: 178, 28
  orig: 178, 32
  offset: 0, 4
  index: -1
props/music_note_1
  rotate: true
  xy: 1349, 2023
  size: 21, 40
  orig: 21, 40
  offset: 0, 0
  index: -1
props/music_note_2
  rotate: true
  xy: 53, 1898
  size: 42, 44
  orig: 42, 44
  offset: 0, 0
  index: -1
props/na_ban_thun
  rotate: true
  xy: 2, 1230
  size: 82, 178
  orig: 92, 180
  offset: 4, 0
  index: -1
props/na_ban_thun1
  rotate: false
  xy: 1547, 1958
  size: 76, 32
  orig: 76, 32
  offset: 0, 0
  index: -1
props/nunchaku
  rotate: false
  xy: 1684, 1989
  size: 298, 27
  orig: 298, 27
  offset: 0, 0
  index: -1
props/option_1
  rotate: true
  xy: 1634, 288
  size: 141, 152
  orig: 240, 180
  offset: 40, 13
  index: -1
props/option_3
  rotate: true
  xy: 2, 924
  size: 104, 144
  orig: 271, 196
  offset: 83, 27
  index: -1
props/option_cocnuoc
  rotate: true
  xy: 1788, 283
  size: 141, 152
  orig: 240, 180
  offset: 40, 13
  index: -1
props/pepperspray
  rotate: true
  xy: 504, 1602
  size: 62, 154
  orig: 62, 154
  offset: 0, 0
  index: -1
props/phone
  rotate: false
  xy: 1212, 1510
  size: 72, 68
  orig: 72, 68
  offset: 0, 0
  index: -1
props/phun_muc
  rotate: false
  xy: 1341, 1820
  size: 159, 49
  orig: 164, 53
  offset: 5, 0
  index: -1
props/pot
  rotate: false
  xy: 2, 291
  size: 197, 140
  orig: 197, 140
  offset: 0, 0
  index: -1
props/potato
  rotate: false
  xy: 837, 782
  size: 151, 118
  orig: 221, 148
  offset: 35, 15
  index: -1
props/quoc
  rotate: false
  xy: 1431, 1171
  size: 356, 86
  orig: 357, 86
  offset: 0, 0
  index: -1
props/radio
  rotate: false
  xy: 268, 417
  size: 202, 135
  orig: 240, 180
  offset: 19, 20
  index: -1
props/rag
  rotate: false
  xy: 1728, 1564
  size: 102, 64
  orig: 102, 64
  offset: 0, 0
  index: -1
props/remote
  rotate: false
  xy: 2, 1038
  size: 120, 97
  orig: 168, 122
  offset: 27, 9
  index: -1
props/repair_hammer
  rotate: false
  xy: 491, 1534
  size: 113, 66
  orig: 120, 90
  offset: 4, 10
  index: -1
props/rock
  rotate: false
  xy: 218, 1970
  size: 41, 31
  orig: 41, 31
  offset: 0, 0
  index: -1
props/rock_1
  rotate: false
  xy: 723, 1836
  size: 77, 48
  orig: 77, 48
  offset: 0, 0
  index: -1
props/rod
  rotate: true
  xy: 315, 1304
  size: 67, 528
  orig: 68, 528
  offset: 0, 0
  index: -1
props/rod_1
  rotate: true
  xy: 1569, 1339
  size: 71, 416
  orig: 104, 438
  offset: 9, 13
  index: -1
props/rod_2
  rotate: true
  xy: 845, 1291
  size: 75, 402
  orig: 104, 438
  offset: 27, 13
  index: -1
props/rope
  rotate: true
  xy: 6, 2040
  size: 4, 171
  orig: 4, 171
  offset: 0, 0
  index: -1
props/saw
  rotate: false
  xy: 1099, 485
  size: 205, 130
  orig: 206, 132
  offset: 0, 2
  index: -1
props/scissors_1
  rotate: true
  xy: 1706, 431
  size: 130, 160
  orig: 130, 162
  offset: 0, 1
  index: -1
props/scissors_2
  rotate: true
  xy: 1789, 1166
  size: 87, 161
  orig: 130, 162
  offset: 16, 1
  index: -1
props/sewing_tool
  rotate: false
  xy: 214, 2033
  size: 132, 11
  orig: 138, 16
  offset: 5, 3
  index: -1
props/shin_left_blue
  rotate: true
  xy: 1388, 1871
  size: 45, 122
  orig: 48, 123
  offset: 3, 0
  index: -1
props/shin_rightt_blue
  rotate: true
  xy: 1826, 1861
  size: 46, 110
  orig: 55, 115
  offset: 5, 1
  index: -1
props/sleep_spray_1
  rotate: true
  xy: 102, 1979
  size: 30, 38
  orig: 32, 40
  offset: 1, 1
  index: -1
props/sleep_spray_2
  rotate: true
  xy: 641, 1456
  size: 70, 151
  orig: 73, 154
  offset: 1, 1
  index: -1
props/smoke
  rotate: false
  xy: 870, 902
  size: 122, 107
  orig: 122, 107
  offset: 0, 0
  index: -1
props/spear
  rotate: true
  xy: 124, 1030
  size: 87, 615
  orig: 102, 635
  offset: 9, 13
  index: -1
props/spoon
  rotate: false
  xy: 1318, 978
  size: 191, 97
  orig: 191, 97
  offset: 0, 0
  index: -1
props/spray_1
  rotate: false
  xy: 1686, 1494
  size: 132, 68
  orig: 134, 70
  offset: 1, 1
  index: -1
props/spray_2
  rotate: false
  xy: 189, 1469
  size: 141, 69
  orig: 144, 71
  offset: 1, 1
  index: -1
props/steel
  rotate: true
  xy: 348, 2000
  size: 24, 665
  orig: 24, 665
  offset: 0, 0
  index: -1
props/suriken
  rotate: false
  xy: 2, 1677
  size: 204, 56
  orig: 212, 61
  offset: 4, 2
  index: -1
props/tat
  rotate: true
  xy: 1573, 471
  size: 133, 131
  orig: 133, 132
  offset: 0, 1
  index: -1
props/teleport
  rotate: true
  xy: 370, 806
  size: 113, 153
  orig: 240, 180
  offset: 67, 17
  index: -1
props/tieugayme
  rotate: false
  xy: 1721, 1955
  size: 115, 32
  orig: 119, 33
  offset: 3, 1
  index: -1
props/time_machine
  rotate: false
  xy: 1842, 563
  size: 190, 125
  orig: 240, 180
  offset: 27, 26
  index: -1
props/time_machine_1
  rotate: false
  xy: 588, 1725
  size: 148, 54
  orig: 155, 63
  offset: 4, 5
  index: -1
props/time_machine_2
  rotate: false
  xy: 738, 1722
  size: 148, 54
  orig: 155, 63
  offset: 4, 5
  index: -1
props/time_machine_3
  rotate: false
  xy: 888, 1722
  size: 148, 54
  orig: 155, 63
  offset: 4, 5
  index: -1
props/toiletcover_1
  rotate: true
  xy: 864, 1368
  size: 63, 612
  orig: 63, 612
  offset: 0, 0
  index: -1
props/toiletcover_2
  rotate: true
  xy: 99, 1891
  size: 37, 575
  orig: 37, 575
  offset: 0, 0
  index: -1
props/toiletpaper
  rotate: false
  xy: 286, 1220
  size: 132, 82
  orig: 168, 126
  offset: 18, 22
  index: -1
props/tray
  rotate: true
  xy: 1249, 1285
  size: 81, 98
  orig: 81, 98
  offset: 0, 0
  index: -1
props/tui_tien
  rotate: true
  xy: 1717, 1068
  size: 96, 142
  orig: 111, 156
  offset: 8, 6
  index: -1
props/vodkar
  rotate: true
  xy: 923, 1882
  size: 42, 137
  orig: 50, 139
  offset: 4, 2
  index: -1
props/whistle
  rotate: false
  xy: 1141, 1924
  size: 57, 40
  orig: 67, 50
  offset: 7, 0
  index: -1
props/wood
  rotate: false
  xy: 1381, 1640
  size: 392, 56
  orig: 394, 58
  offset: 1, 2
  index: -1
props/woodfire
  rotate: false
  xy: 2, 1314
  size: 222, 76
  orig: 223, 76
  offset: 1, 0
  index: -1
props/woodpecker
  rotate: true
  xy: 659, 1119
  size: 94, 151
  orig: 106, 151
  offset: 12, 0
  index: -1
props/wool
  rotate: true
  xy: 1325, 1081
  size: 105, 104
  orig: 115, 115
  offset: 6, 4
  index: -1
shin_left
  rotate: true
  xy: 1204, 1962
  size: 30, 113
  orig: 32, 115
  offset: 1, 1
  index: -1
shin_left_1
  rotate: true
  xy: 1434, 1959
  size: 31, 111
  orig: 32, 115
  offset: 0, 3
  index: -1
shin_right
  rotate: true
  xy: 1200, 1922
  size: 38, 109
  orig: 40, 121
  offset: 1, 11
  index: -1
shin_right_1
  rotate: true
  xy: 229, 1842
  size: 47, 111
  orig: 50, 113
  offset: 2, 1
  index: -1
thigh_left
  rotate: true
  xy: 324, 1673
  size: 57, 122
  orig: 61, 129
  offset: 1, 6
  index: -1
thigh_left_1
  rotate: true
  xy: 571, 1666
  size: 57, 125
  orig: 61, 129
  offset: 0, 4
  index: -1
thigh_right
  rotate: true
  xy: 1391, 2022
  size: 22, 121
  orig: 24, 134
  offset: 1, 12
  index: -1
thigh_right_1
  rotate: true
  xy: 342, 1842
  size: 47, 120
  orig: 52, 134
  offset: 1, 9
  index: -1
upperArm_left
  rotate: true
  xy: 822, 1662
  size: 58, 124
  orig: 60, 127
  offset: 1, 2
  index: -1
upperArm_left_1
  rotate: true
  xy: 1183, 1711
  size: 55, 124
  orig: 60, 127
  offset: 1, 2
  index: -1
upperArm_left_2
  rotate: true
  xy: 398, 1732
  size: 54, 121
  orig: 60, 127
  offset: 0, 5
  index: -1
upperArm_right
  rotate: true
  xy: 2, 1137
  size: 91, 123
  orig: 97, 133
  offset: 5, 8
  index: -1
upperArm_right_1
  rotate: true
  xy: 127, 1127
  size: 91, 123
  orig: 97, 133
  offset: 5, 8
  index: -1
upperArm_right_2
  rotate: true
  xy: 1192, 1098
  size: 96, 131
  orig: 97, 133
  offset: 1, 2
  index: -1
white/body
  rotate: true
  xy: 1232, 1994
  size: 26, 215
  orig: 26, 215
  offset: 0, 0
  index: -1
white/bow_tie
  rotate: false
  xy: 1667, 1913
  size: 64, 40
  orig: 66, 42
  offset: 1, 1
  index: -1
white/eye_worry
  rotate: true
  xy: 1836, 1692
  size: 57, 68
  orig: 57, 68
  offset: 0, 0
  index: -1
white/eyebrown_left_01
  rotate: false
  xy: 173, 2004
  size: 28, 27
  orig: 30, 29
  offset: 1, 1
  index: -1
white/eyebrown_right_01
  rotate: false
  xy: 203, 2004
  size: 29, 27
  orig: 31, 29
  offset: 1, 1
  index: -1
white/foot_side
  rotate: false
  xy: 780, 1929
  size: 94, 37
  orig: 94, 51
  offset: 0, 0
  index: -1
white/hand
  rotate: true
  xy: 626, 1930
  size: 36, 56
  orig: 39, 59
  offset: 2, 1
  index: -1
white/lowerArm_left
  rotate: true
  xy: 1235, 1196
  size: 87, 92
  orig: 92, 96
  offset: 2, 2
  index: -1
white/lowerArm_right
  rotate: true
  xy: 912, 1832
  size: 48, 125
  orig: 52, 134
  offset: 2, 8
  index: -1
white/mouth_happy
  rotate: true
  xy: 1000, 1587
  size: 65, 67
  orig: 65, 67
  offset: 0, 0
  index: -1
white/mouth_worry
  rotate: false
  xy: 477, 1788
  size: 56, 51
  orig: 56, 51
  offset: 0, 0
  index: -1
white/shin_left
  rotate: true
  xy: 1319, 1962
  size: 30, 113
  orig: 32, 115
  offset: 1, 1
  index: -1
white/shin_right
  rotate: true
  xy: 1311, 1922
  size: 38, 109
  orig: 40, 121
  offset: 1, 11
  index: -1
white/thigh_left
  rotate: true
  xy: 698, 1663
  size: 57, 122
  orig: 61, 129
  offset: 1, 6
  index: -1
white/thigh_right
  rotate: true
  xy: 1514, 2022
  size: 22, 121
  orig: 24, 134
  offset: 1, 12
  index: -1
white/upperArm_left
  rotate: true
  xy: 1157, 1651
  size: 58, 124
  orig: 60, 127
  offset: 1, 2
  index: -1
white/upperArm_right
  rotate: true
  xy: 252, 1127
  size: 91, 123
  orig: 97, 133
  offset: 5, 8
  index: -1

lupin2.png
size: 2048,2048
format: RGBA8888
filter: Linear,Linear
repeat: none
bird/wing1
  rotate: true
  xy: 378, 878
  size: 172, 234
  orig: 174, 236
  offset: 1, 1
  index: -1
bird/wing_3
  rotate: false
  xy: 162, 1576
  size: 180, 155
  orig: 182, 157
  offset: 1, 1
  index: -1
eagle/wing_1
  rotate: true
  xy: 614, 878
  size: 172, 234
  orig: 172, 234
  offset: 0, 0
  index: -1
eagle/wing_3
  rotate: false
  xy: 559, 1558
  size: 180, 156
  orig: 180, 156
  offset: 0, 0
  index: -1
fx/cloud/01/fightcloud_01
  rotate: false
  xy: 2, 1733
  size: 203, 147
  orig: 234, 180
  offset: 9, 19
  index: -1
fx/cloud/01/fightcloud_02
  rotate: false
  xy: 207, 1733
  size: 195, 147
  orig: 234, 180
  offset: 27, 24
  index: -1
fx/cloud/01/fightcloud_03
  rotate: false
  xy: 741, 1554
  size: 203, 156
  orig: 234, 180
  offset: 27, 17
  index: -1
fx/cloud/01/fightcloud_04
  rotate: false
  xy: 644, 1219
  size: 195, 169
  orig: 234, 180
  offset: 23, 5
  index: -1
fx/cloud/01/fightcloud_05
  rotate: false
  xy: 1523, 1382
  size: 195, 165
  orig: 234, 180
  offset: 19, 8
  index: -1
fx/cloud/01/fightcloud_06
  rotate: false
  xy: 946, 1554
  size: 196, 156
  orig: 234, 180
  offset: 24, 18
  index: -1
fx/cloud/01/fightcloud_07
  rotate: false
  xy: 344, 1573
  size: 213, 155
  orig: 234, 180
  offset: 12, 20
  index: -1
fx/explosion/explosion_04
  rotate: true
  xy: 2, 1068
  size: 170, 191
  orig: 250, 250
  offset: 33, 7
  index: -1
fx/explosion/explosion_05
  rotate: true
  xy: 850, 871
  size: 179, 200
  orig: 250, 250
  offset: 28, 5
  index: -1
fx/explosion/explosion_06
  rotate: true
  xy: 2, 707
  size: 182, 205
  orig: 250, 250
  offset: 26, 3
  index: -1
fx/spark/02/Sparks_05_02
  rotate: false
  xy: 1440, 461
  size: 353, 199
  orig: 363, 273
  offset: 10, 43
  index: -1
fx/spark/02/Sparks_05_03
  rotate: false
  xy: 890, 265
  size: 353, 216
  orig: 363, 273
  offset: 10, 33
  index: -1
fx/spark/02/Sparks_05_05
  rotate: false
  xy: 1664, 239
  size: 238, 219
  orig: 363, 273
  offset: 125, 1
  index: -1
fx/waiter_splash/waiter_splash_2
  rotate: false
  xy: 2, 63
  size: 462, 218
  orig: 666, 326
  offset: 120, 12
  index: -1
fx/waiter_splash/waiter_splash_6
  rotate: false
  xy: 466, 45
  size: 628, 218
  orig: 666, 326
  offset: 16, 10
  index: -1
fx/water/01/water_1
  rotate: false
  xy: 1624, 1549
  size: 327, 159
  orig: 327, 159
  offset: 0, 0
  index: -1
fx/water/01/water_2
  rotate: false
  xy: 209, 691
  size: 291, 185
  orig: 291, 185
  offset: 0, 0
  index: -1
fx/water/01/water_3
  rotate: true
  xy: 724, 1390
  size: 162, 288
  orig: 162, 288
  offset: 0, 0
  index: -1
fx/wave/wave_2
  rotate: false
  xy: 935, 1712
  size: 507, 152
  orig: 507, 152
  offset: 0, 0
  index: -1
fx/wave/wave_3
  rotate: false
  xy: 1014, 1386
  size: 507, 163
  orig: 507, 163
  offset: 0, 0
  index: -1
hair/girl_hair_5a
  rotate: false
  xy: 1661, 2
  size: 272, 235
  orig: 273, 235
  offset: 1, 0
  index: -1
head
  rotate: false
  xy: 463, 493
  size: 238, 196
  orig: 240, 198
  offset: 1, 1
  index: -1
head_Hulk
  rotate: false
  xy: 703, 486
  size: 238, 196
  orig: 240, 198
  offset: 1, 1
  index: -1
props/Level_20_clock1
  rotate: false
  xy: 660, 269
  size: 228, 215
  orig: 252, 233
  offset: 15, 3
  index: -1
props/Thor_hammer
  rotate: false
  xy: 1245, 243
  size: 417, 216
  orig: 455, 256
  offset: 23, 15
  index: -1
props/bikini
  rotate: false
  xy: 1144, 1552
  size: 257, 158
  orig: 257, 158
  offset: 0, 0
  index: -1
props/binh_oxy
  rotate: true
  xy: 588, 1716
  size: 149, 345
  orig: 210, 359
  offset: 34, 7
  index: -1
props/box
  rotate: false
  xy: 207, 495
  size: 254, 194
  orig: 254, 194
  offset: 0, 0
  index: -1
props/box_1
  rotate: false
  xy: 943, 483
  size: 255, 196
  orig: 255, 196
  offset: 0, 0
  index: -1
props/bucket_1
  rotate: false
  xy: 1795, 460
  size: 200, 200
  orig: 201, 201
  offset: 0, 0
  index: -1
props/ca_kiem
  rotate: false
  xy: 841, 1219
  size: 408, 165
  orig: 409, 167
  offset: 1, 1
  index: -1
props/cape_2
  rotate: false
  xy: 1691, 1710
  size: 202, 154
  orig: 528, 231
  offset: 27, 49
  index: -1
props/cape_3
  rotate: true
  xy: 185, 891
  size: 174, 191
  orig: 528, 231
  offset: 30, 17
  index: -1
props/chicken
  rotate: false
  xy: 2, 286
  size: 320, 207
  orig: 325, 207
  offset: 2, 0
  index: -1
props/choi
  rotate: true
  xy: 324, 283
  size: 208, 334
  orig: 208, 334
  offset: 0, 0
  index: -1
props/con_muc
  rotate: false
  xy: 195, 1067
  size: 198, 171
  orig: 240, 180
  offset: 22, 5
  index: -1
props/cot_leu
  rotate: true
  xy: 395, 1052
  size: 160, 1427
  orig: 161, 1427
  offset: 0, 0
  index: -1
props/fish
  rotate: false
  xy: 1442, 1214
  size: 438, 166
  orig: 445, 173
  offset: 4, 4
  index: -1
props/fish_2
  rotate: false
  xy: 1444, 1711
  size: 245, 153
  orig: 245, 153
  offset: 0, 0
  index: -1
props/hammer
  rotate: true
  xy: 2, 1413
  size: 161, 172
  orig: 170, 193
  offset: 9, 5
  index: -1
props/handlamp
  rotate: false
  xy: 2, 1245
  size: 168, 166
  orig: 168, 166
  offset: 0, 0
  index: -1
props/hat_01
  rotate: false
  xy: 172, 1240
  size: 234, 166
  orig: 236, 168
  offset: 1, 1
  index: -1
props/hat_02
  rotate: false
  xy: 1403, 1551
  size: 219, 158
  orig: 236, 168
  offset: 3, 6
  index: -1
props/leaf_2
  rotate: false
  xy: 1468, 662
  size: 234, 193
  orig: 234, 193
  offset: 0, 0
  index: -1
props/leaf_3
  rotate: false
  xy: 1704, 662
  size: 236, 193
  orig: 236, 193
  offset: 0, 0
  index: -1
props/ma
  rotate: true
  xy: 404, 1730
  size: 150, 182
  orig: 150, 182
  offset: 0, 0
  index: -1
props/mieng_xop
  rotate: false
  xy: 1626, 857
  size: 341, 181
  orig: 366, 226
  offset: 18, 26
  index: -1
props/nunchaku_1
  rotate: false
  xy: 1824, 1040
  size: 185, 172
  orig: 187, 174
  offset: 1, 1
  index: -1
props/nuoc
  rotate: false
  xy: 1388, 1866
  size: 560, 146
  orig: 560, 146
  offset: 0, 0
  index: -1
props/popup_nuoc
  rotate: false
  xy: 1251, 1215
  size: 189, 169
  orig: 222, 186
  offset: 22, 8
  index: -1
props/radio_1
  rotate: true
  xy: 1325, 870
  size: 180, 299
  orig: 180, 299
  offset: 0, 0
  index: -1
props/rope_1
  rotate: true
  xy: 1720, 1382
  size: 165, 173
  orig: 167, 173
  offset: 1, 0
  index: -1
props/rose
  rotate: true
  xy: 502, 691
  size: 185, 271
  orig: 196, 287
  offset: 6, 6
  index: -1
props/shove
  rotate: true
  xy: 1052, 871
  size: 179, 271
  orig: 184, 271
  offset: 3, 0
  index: -1
props/song_1
  rotate: false
  xy: 643, 1867
  size: 743, 145
  orig: 743, 145
  offset: 0, 0
  index: -1
props/song_2
  rotate: false
  xy: 2, 1882
  size: 639, 130
  orig: 639, 130
  offset: 0, 0
  index: -1
props/song_nuoc
  rotate: false
  xy: 1038, 681
  size: 428, 187
  orig: 428, 187
  offset: 0, 0
  index: -1
props/weld
  rotate: false
  xy: 342, 1408
  size: 206, 163
  orig: 208, 176
  offset: 1, 6
  index: -1
props/wood_1
  rotate: true
  xy: 176, 1413
  size: 161, 164
  orig: 240, 180
  offset: 39, 8
  index: -1
props/xonuoc_1
  rotate: false
  xy: 550, 1393
  size: 172, 163
  orig: 172, 163
  offset: 0, 0
  index: -1
props/xonuoc_2
  rotate: true
  xy: 2, 894
  size: 172, 181
  orig: 172, 181
  offset: 0, 0
  index: -1
props/xonuoc_3
  rotate: true
  xy: 2, 1577
  size: 154, 158
  orig: 154, 158
  offset: 0, 0
  index: -1
skeleton
  rotate: true
  xy: 1096, 16
  size: 225, 563
  orig: 340, 596
  offset: 59, 24
  index: -1
werewolf
  rotate: false
  xy: 2, 511
  size: 203, 194
  orig: 227, 215
  offset: 10, 11
  index: -1
white/hat_01
  rotate: false
  xy: 408, 1225
  size: 234, 166
  orig: 236, 168
  offset: 1, 1
  index: -1
white/head
  rotate: false
  xy: 1200, 483
  size: 238, 196
  orig: 240, 198
  offset: 1, 1
  index: -1
wolf_tail
  rotate: true
  xy: 775, 684
  size: 185, 261
  orig: 203, 273
  offset: 10, 7
  index: -1

lupin3.png
size: 2048,2048
format: RGBA8888
filter: Linear,Linear
repeat: none
Hulk_hair
  rotate: true
  xy: 742, 1547
  size: 248, 286
  orig: 272, 294
  offset: 9, 8
  index: -1
fx/light
  rotate: false
  xy: 887, 920
  size: 360, 323
  orig: 366, 331
  offset: 2, 4
  index: -1
fx/spark/02/Sparks_05_04
  rotate: false
  xy: 1142, 1796
  size: 353, 236
  orig: 363, 273
  offset: 10, 19
  index: -1
fx/star
  rotate: false
  xy: 2, 1300
  size: 327, 265
  orig: 327, 265
  offset: 0, 0
  index: -1
fx/waiter_splash/waiter_splash_3
  rotate: false
  xy: 613, 1263
  size: 540, 279
  orig: 666, 326
  offset: 71, 13
  index: -1
fx/waiter_splash/waiter_splash_4
  rotate: false
  xy: 1155, 1245
  size: 570, 284
  orig: 666, 326
  offset: 60, 11
  index: -1
fx/waiter_splash/waiter_splash_5
  rotate: false
  xy: 1282, 1531
  size: 612, 260
  orig: 666, 326
  offset: 25, 10
  index: -1
hair/girl_hair_1
  rotate: false
  xy: 1727, 1188
  size: 288, 341
  orig: 314, 370
  offset: 14, 16
  index: -1
hair/girl_hair_5b
  rotate: false
  xy: 1760, 1793
  size: 272, 239
  orig: 274, 239
  offset: 1, 0
  index: -1
hair/girl_hair_5c
  rotate: false
  xy: 868, 1797
  size: 272, 235
  orig: 273, 235
  offset: 1, 0
  index: -1
props/aura1
  rotate: true
  xy: 1136, 544
  size: 367, 474
  orig: 406, 499
  offset: 17, 13
  index: -1
props/aura2
  rotate: true
  xy: 2, 604
  size: 337, 463
  orig: 406, 499
  offset: 26, 13
  index: -1
props/aura3
  rotate: true
  xy: 1249, 913
  size: 330, 475
  orig: 406, 499
  offset: 35, 17
  index: -1
props/bulb_1
  rotate: false
  xy: 1612, 524
  size: 388, 387
  orig: 463, 481
  offset: 47, 46
  index: -1
props/ca_map
  rotate: false
  xy: 2, 1567
  size: 356, 238
  orig: 356, 240
  offset: 0, 0
  index: -1
props/cano_mc
  rotate: false
  xy: 467, 571
  size: 667, 347
  orig: 667, 347
  offset: 0, 0
  index: -1
props/da_tang
  rotate: false
  xy: 2, 965
  size: 391, 317
  orig: 393, 319
  offset: 1, 1
  index: -1
props/day_thung_2
  rotate: false
  xy: 1030, 1544
  size: 250, 250
  orig: 250, 250
  offset: 0, 0
  index: -1
props/fishing_net
  rotate: false
  xy: 474, 1806
  size: 392, 226
  orig: 392, 226
  offset: 0, 0
  index: -1
props/hammer_01
  rotate: true
  xy: 395, 943
  size: 318, 490
  orig: 492, 699
  offset: 101, 135
  index: -1
props/light_1
  rotate: true
  xy: 2, 100
  size: 469, 499
  orig: 469, 513
  offset: 0, 14
  index: -1
props/mu_lan
  rotate: true
  xy: 331, 1284
  size: 275, 280
  orig: 341, 325
  offset: 32, 15
  index: -1
props/muc
  rotate: false
  xy: 360, 1561
  size: 380, 243
  orig: 381, 243
  offset: 0, 0
  index: -1
props/picture
  rotate: true
  xy: 1497, 1795
  size: 237, 261
  orig: 237, 261
  offset: 0, 0
  index: -1
skeleton_1
  rotate: true
  xy: 2, 1807
  size: 225, 470
  orig: 340, 470
  offset: 59, 0
  index: -1
