<?xml version="1.0" encoding="UTF-8" standalone="no"?>
<!-- Created with Inkscape (http://www.inkscape.org/) -->

<svg
   xmlns:dc="http://purl.org/dc/elements/1.1/"
   xmlns:cc="http://creativecommons.org/ns#"
   xmlns:rdf="http://www.w3.org/1999/02/22-rdf-syntax-ns#"
   xmlns:svg="http://www.w3.org/2000/svg"
   xmlns="http://www.w3.org/2000/svg"
   xmlns:sodipodi="http://sodipodi.sourceforge.net/DTD/sodipodi-0.dtd"
   xmlns:inkscape="http://www.inkscape.org/namespaces/inkscape"
   width="120.55573"
   height="120.55573"
   viewBox="0 0 6027.7862 6027.7858"
   version="1.1"
   id="svg4089"
   inkscape:version="0.92.1 r15371"
   sodipodi:docname="marked-skipp.svg">
  <defs
     id="defs4083" />
  <sodipodi:namedview
     id="base"
     pagecolor="#ffffff"
     bordercolor="#666666"
     borderopacity="1.0"
     inkscape:pageopacity="0.0"
     inkscape:pageshadow="2"
     inkscape:zoom="5.6568543"
     inkscape:cx="91.156693"
     inkscape:cy="65.463831"
     inkscape:document-units="px"
     inkscape:current-layer="layer1"
     showgrid="false"
     units="px"
     inkscape:snap-bbox="false"
     inkscape:bbox-paths="true"
     inkscape:bbox-nodes="true"
     inkscape:snap-bbox-edge-midpoints="true"
     inkscape:snap-bbox-midpoints="true"
     inkscape:window-width="1920"
     inkscape:window-height="1001"
     inkscape:window-x="2391"
     inkscape:window-y="-9"
     inkscape:window-maximized="1"
     showguides="true"
     inkscape:guide-bbox="true" />
  <metadata
     id="metadata4086">
    <rdf:RDF>
      <cc:Work
         rdf:about="">
        <dc:format>image/svg+xml</dc:format>
        <dc:type
           rdf:resource="http://purl.org/dc/dcmitype/StillImage" />
        <dc:title></dc:title>
      </cc:Work>
    </rdf:RDF>
  </metadata>
  <g
     inkscape:label="1. réteg"
     inkscape:groupmode="layer"
     id="layer1"
     transform="translate(1480.2663,-51254.707)">
    <path
       id="path4932"
       transform="matrix(49.999995,0,0,49.999995,-1480.2663,51254.707)"
       style="fill:#ffffff;stroke:none;stroke-width:1.30154634"
       d="M 60.277344,0 A 60.277866,60.277866 0 0 0 0,60.277344 60.277866,60.277866 0 0 0 60.277344,120.55664 60.277866,60.277866 0 0 0 120.55664,60.277344 60.277866,60.277866 0 0 0 60.277344,0 Z m 5.705078,16.638672 a 44.057013,44.057013 0 0 1 37.822268,37.066406 l -16.490237,6.572266 16.472657,6.566406 a 44.057013,44.057013 0 0 1 -36.992188,36.9668 L 60.277344,87.460938 53.765625,103.79492 A 44.057013,44.057013 0 0 1 16.712891,66.546875 l 15.730468,-6.269531 -15.71875,-6.265625 a 44.057013,44.057013 0 0 1 37.84961,-37.367188 l 5.703125,14.306641 z m -5.92296,18.644832 a 20.108658,20.146238 0 0 0 -19.85882,17.068721 h 0.06533 V 84.039028 H 53.596541 V 52.352225 a 6.5177235,6.5299041 0 0 1 6.497975,-6.16016 6.5177235,6.5299041 0 0 1 6.504349,6.16016 h -0.0239 V 68.673647 H 79.905534 V 52.352225 A 20.108658,20.146238 0 0 0 60.059462,35.283504 Z m -2.329584,33.390143 15.521525,15.521541 15.50081,-15.499221 z" />
  </g>
</svg>
