%YAML 1.1
%TAG !u! tag:unity3d.com,2011:
--- !u!1 &3971097320246777320
GameObject:
  m_ObjectHideFlags: 0
  m_CorrespondingSourceObject: {fileID: 0}
  m_PrefabInstance: {fileID: 0}
  m_PrefabAsset: {fileID: 0}
  serializedVersion: 6
  m_Component:
  - component: {fileID: 3971097320246777322}
  - component: {fileID: 3971097320246777321}
  m_Layer: 0
  m_Name: RandomLine
  m_TagString: Untagged
  m_Icon: {fileID: 0}
  m_NavMeshLayer: 0
  m_StaticEditorFlags: 0
  m_IsActive: 1
--- !u!4 &3971097320246777322
Transform:
  m_ObjectHideFlags: 0
  m_CorrespondingSourceObject: {fileID: 0}
  m_PrefabInstance: {fileID: 0}
  m_PrefabAsset: {fileID: 0}
  m_GameObject: {fileID: 3971097320246777320}
  m_LocalRotation: {x: 0, y: 0, z: 0, w: 1}
  m_LocalPosition: {x: 0, y: -0.05, z: 2}
  m_LocalScale: {x: 1, y: 1, z: 1}
  m_Children:
  - {fileID: 5695985911247057535}
  m_Father: {fileID: 0}
  m_RootOrder: 0
  m_LocalEulerAnglesHint: {x: 0, y: 0, z: 0}
--- !u!114 &3971097320246777321
MonoBehaviour:
  m_ObjectHideFlags: 0
  m_CorrespondingSourceObject: {fileID: 0}
  m_PrefabInstance: {fileID: 0}
  m_PrefabAsset: {fileID: 0}
  m_GameObject: {fileID: 3971097320246777320}
  m_Enabled: 1
  m_EditorHideFlags: 0
  m_Script: {fileID: 11500000, guid: 16335877f34c8704aab527bd7a4cdb09, type: 3}
  m_Name: 
  m_EditorClassIdentifier: 
  lineList: []
  lineListLenght: 5
  _carline: {fileID: 6004295669504323047, guid: 3266a73c0b8ad6e4c98428c9c1cf0acf,
    type: 3}
  listColorLine:
  - {r: 0.6981132, g: 0.28648987, b: 0.28648987, a: 0}
  - {r: 0.10453009, g: 0.5443085, b: 0.8207547, a: 0}
  - {r: 0.32974365, g: 0.735849, b: 0.4604461, a: 0}
  - {r: 1, g: 0.5518868, b: 0.9793015, a: 0}
  - {r: 0.7372549, g: 0.72829777, b: 0.32941177, a: 0}
  indexDelete: 0
  MaxLenghtPlace: 0
  TraficCarManage: {fileID: 1756949768570244445, guid: 750ebf8dcd3614e42892f017920d7184,
    type: 3}
  ListLines: {fileID: 5695985911247057535}
--- !u!1 &4468155165949759668
GameObject:
  m_ObjectHideFlags: 0
  m_CorrespondingSourceObject: {fileID: 0}
  m_PrefabInstance: {fileID: 0}
  m_PrefabAsset: {fileID: 0}
  serializedVersion: 6
  m_Component:
  - component: {fileID: 5695985911247057535}
  m_Layer: 0
  m_Name: LineList
  m_TagString: Untagged
  m_Icon: {fileID: 0}
  m_NavMeshLayer: 0
  m_StaticEditorFlags: 0
  m_IsActive: 1
--- !u!4 &5695985911247057535
Transform:
  m_ObjectHideFlags: 0
  m_CorrespondingSourceObject: {fileID: 0}
  m_PrefabInstance: {fileID: 0}
  m_PrefabAsset: {fileID: 0}
  m_GameObject: {fileID: 4468155165949759668}
  m_LocalRotation: {x: -0, y: -0, z: -0, w: 1}
  m_LocalPosition: {x: -20.565014, y: -4.282814, z: 3.5765715}
  m_LocalScale: {x: 1, y: 1, z: 1}
  m_Children: []
  m_Father: {fileID: 3971097320246777322}
  m_RootOrder: 0
  m_LocalEulerAnglesHint: {x: 0, y: 0, z: 0}
