%YAML 1.1
%TAG !u! tag:unity3d.com,2011:
--- !u!1 &6643595590963767731
GameObject:
  m_ObjectHideFlags: 0
  m_CorrespondingSourceObject: {fileID: 0}
  m_PrefabInstance: {fileID: 0}
  m_PrefabAsset: {fileID: 0}
  serializedVersion: 6
  m_Component:
  - component: {fileID: 6643595590963767741}
  - component: {fileID: 6643595590963767730}
  m_Layer: 0
  m_Name: GameController 1
  m_TagString: Untagged
  m_Icon: {fileID: 0}
  m_NavMeshLayer: 0
  m_StaticEditorFlags: 0
  m_IsActive: 1
--- !u!4 &6643595590963767741
Transform:
  m_ObjectHideFlags: 0
  m_CorrespondingSourceObject: {fileID: 0}
  m_PrefabInstance: {fileID: 0}
  m_PrefabAsset: {fileID: 0}
  m_GameObject: {fileID: 6643595590963767731}
  m_LocalRotation: {x: 0, y: 0, z: 0, w: 1}
  m_LocalPosition: {x: 353.52737, y: 301.2197, z: -5.231939}
  m_LocalScale: {x: 1, y: 1, z: 1}
  m_Children: []
  m_Father: {fileID: 0}
  m_RootOrder: 0
  m_LocalEulerAnglesHint: {x: 0, y: 0, z: 0}
--- !u!114 &6643595590963767730
MonoBehaviour:
  m_ObjectHideFlags: 0
  m_CorrespondingSourceObject: {fileID: 0}
  m_PrefabInstance: {fileID: 0}
  m_PrefabAsset: {fileID: 0}
  m_GameObject: {fileID: 6643595590963767731}
  m_Enabled: 1
  m_EditorHideFlags: 0
  m_Script: {fileID: 11500000, guid: 46781e8b6ca209c479b198aaa954c350, type: 3}
  m_Name: 
  m_EditorClassIdentifier: 
  Point: 0
  dataPoint: {fileID: 0}
  previousBlock: {fileID: 0}
  StadingBlock: {fileID: 0}
  nextBlock: {fileID: 0}
  maxRangePoint: 11
  gameStatus: 
  isPlayerControl: 0
  PointText: {fileID: 0}
  MenuController: {fileID: 0}
  status: {fileID: 0}
  respawnPoint: {x: 0, y: 0}
  Player: {fileID: 0}
  DataJson: {fileID: 4900000, guid: c567055e0be1495eb079af2d84d78d89, type: 3}
