%YAML 1.1
%TAG !u! tag:unity3d.com,2011:
--- !u!29 &1
OcclusionCullingSettings:
  m_ObjectHideFlags: 0
  serializedVersion: 2
  m_OcclusionBakeSettings:
    smallestOccluder: 5
    smallestHole: 0.25
    backfaceThreshold: 100
  m_SceneGUID: 00000000000000000000000000000000
  m_OcclusionCullingData: {fileID: 0}
--- !u!104 &2
RenderSettings:
  m_ObjectHideFlags: 0
  serializedVersion: 9
  m_Fog: 0
  m_FogColor: {r: 0.5, g: 0.5, b: 0.5, a: 1}
  m_FogMode: 3
  m_FogDensity: 0.01
  m_LinearFogStart: 0
  m_LinearFogEnd: 300
  m_AmbientSkyColor: {r: 0.212, g: 0.227, b: 0.259, a: 1}
  m_AmbientEquatorColor: {r: 0.114, g: 0.125, b: 0.133, a: 1}
  m_AmbientGroundColor: {r: 0.047, g: 0.043, b: 0.035, a: 1}
  m_AmbientIntensity: 1
  m_AmbientMode: 3
  m_SubtractiveShadowColor: {r: 0.42, g: 0.478, b: 0.627, a: 1}
  m_SkyboxMaterial: {fileID: 0}
  m_HaloStrength: 0.5
  m_FlareStrength: 1
  m_FlareFadeSpeed: 3
  m_HaloTexture: {fileID: 0}
  m_SpotCookie: {fileID: 10001, guid: 0000000000000000e000000000000000, type: 0}
  m_DefaultReflectionMode: 0
  m_DefaultReflectionResolution: 128
  m_ReflectionBounces: 1
  m_ReflectionIntensity: 1
  m_CustomReflection: {fileID: 0}
  m_Sun: {fileID: 0}
  m_IndirectSpecularColor: {r: 0, g: 0, b: 0, a: 1}
  m_UseRadianceAmbientProbe: 0
--- !u!157 &3
LightmapSettings:
  m_ObjectHideFlags: 0
  serializedVersion: 12
  m_GIWorkflowMode: 1
  m_GISettings:
    serializedVersion: 2
    m_BounceScale: 1
    m_IndirectOutputScale: 1
    m_AlbedoBoost: 1
    m_EnvironmentLightingMode: 0
    m_EnableBakedLightmaps: 0
    m_EnableRealtimeLightmaps: 0
  m_LightmapEditorSettings:
    serializedVersion: 12
    m_Resolution: 2
    m_BakeResolution: 40
    m_AtlasSize: 1024
    m_AO: 0
    m_AOMaxDistance: 1
    m_CompAOExponent: 1
    m_CompAOExponentDirect: 0
    m_ExtractAmbientOcclusion: 0
    m_Padding: 2
    m_LightmapParameters: {fileID: 0}
    m_LightmapsBakeMode: 1
    m_TextureCompression: 1
    m_FinalGather: 0
    m_FinalGatherFiltering: 1
    m_FinalGatherRayCount: 256
    m_ReflectionCompression: 2
    m_MixedBakeMode: 2
    m_BakeBackend: 0
    m_PVRSampling: 1
    m_PVRDirectSampleCount: 32
    m_PVRSampleCount: 500
    m_PVRBounces: 2
    m_PVREnvironmentSampleCount: 500
    m_PVREnvironmentReferencePointCount: 2048
    m_PVRFilteringMode: 2
    m_PVRDenoiserTypeDirect: 0
    m_PVRDenoiserTypeIndirect: 0
    m_PVRDenoiserTypeAO: 0
    m_PVRFilterTypeDirect: 0
    m_PVRFilterTypeIndirect: 0
    m_PVRFilterTypeAO: 0
    m_PVREnvironmentMIS: 0
    m_PVRCulling: 1
    m_PVRFilteringGaussRadiusDirect: 1
    m_PVRFilteringGaussRadiusIndirect: 5
    m_PVRFilteringGaussRadiusAO: 2
    m_PVRFilteringAtrousPositionSigmaDirect: 0.5
    m_PVRFilteringAtrousPositionSigmaIndirect: 2
    m_PVRFilteringAtrousPositionSigmaAO: 1
    m_ExportTrainingData: 0
    m_TrainingDataDestination: TrainingData
    m_LightProbeSampleCountMultiplier: 4
  m_LightingDataAsset: {fileID: 0}
  m_LightingSettings: {fileID: 0}
--- !u!196 &4
NavMeshSettings:
  serializedVersion: 2
  m_ObjectHideFlags: 0
  m_BuildSettings:
    serializedVersion: 2
    agentTypeID: 0
    agentRadius: 0.5
    agentHeight: 2
    agentSlope: 45
    agentClimb: 0.4
    ledgeDropHeight: 0
    maxJumpAcrossDistance: 0
    minRegionArea: 2
    manualCellSize: 0
    cellSize: 0.16666667
    manualTileSize: 0
    tileSize: 256
    accuratePlacement: 0
    maxJobWorkers: 0
    preserveTilesOutsideBounds: 0
    debug:
      m_Flags: 0
  m_NavMeshData: {fileID: 0}
--- !u!114 &414859923 stripped
MonoBehaviour:
  m_CorrespondingSourceObject: {fileID: 8163270755554899010, guid: 87bdab3c41015e1498561e8ae02a40d0, type: 3}
  m_PrefabInstance: {fileID: 8163270755427382993}
  m_PrefabAsset: {fileID: 0}
  m_GameObject: {fileID: 0}
  m_Enabled: 1
  m_EditorHideFlags: 0
  m_Script: {fileID: 11500000, guid: 5f7201a12d95ffc409449d95f23cf332, type: 3}
  m_Name: 
  m_EditorClassIdentifier: 
--- !u!114 &498794737 stripped
MonoBehaviour:
  m_CorrespondingSourceObject: {fileID: 8163270755504518688, guid: 87bdab3c41015e1498561e8ae02a40d0, type: 3}
  m_PrefabInstance: {fileID: 8163270755427382993}
  m_PrefabAsset: {fileID: 0}
  m_GameObject: {fileID: 0}
  m_Enabled: 1
  m_EditorHideFlags: 0
  m_Script: {fileID: 11500000, guid: 5f7201a12d95ffc409449d95f23cf332, type: 3}
  m_Name: 
  m_EditorClassIdentifier: 
--- !u!114 &498794739 stripped
MonoBehaviour:
  m_CorrespondingSourceObject: {fileID: 8163270755504518690, guid: 87bdab3c41015e1498561e8ae02a40d0, type: 3}
  m_PrefabInstance: {fileID: 8163270755427382993}
  m_PrefabAsset: {fileID: 0}
  m_GameObject: {fileID: 0}
  m_Enabled: 1
  m_EditorHideFlags: 0
  m_Script: {fileID: 11500000, guid: ddf030107e6706c40ae48f2c487421b7, type: 3}
  m_Name: 
  m_EditorClassIdentifier: 
--- !u!1 &519420028
GameObject:
  m_ObjectHideFlags: 0
  m_CorrespondingSourceObject: {fileID: 0}
  m_PrefabInstance: {fileID: 0}
  m_PrefabAsset: {fileID: 0}
  serializedVersion: 6
  m_Component:
  - component: {fileID: 519420032}
  - component: {fileID: 519420031}
  - component: {fileID: 519420029}
  - component: {fileID: 519420030}
  - component: {fileID: 519420033}
  m_Layer: 0
  m_Name: Main Camera
  m_TagString: MainCamera
  m_Icon: {fileID: 0}
  m_NavMeshLayer: 0
  m_StaticEditorFlags: 0
  m_IsActive: 1
--- !u!81 &519420029
AudioListener:
  m_ObjectHideFlags: 0
  m_CorrespondingSourceObject: {fileID: 0}
  m_PrefabInstance: {fileID: 0}
  m_PrefabAsset: {fileID: 0}
  m_GameObject: {fileID: 519420028}
  m_Enabled: 1
--- !u!114 &519420030
MonoBehaviour:
  m_ObjectHideFlags: 0
  m_CorrespondingSourceObject: {fileID: 0}
  m_PrefabInstance: {fileID: 0}
  m_PrefabAsset: {fileID: 0}
  m_GameObject: {fileID: 519420028}
  m_Enabled: 1
  m_EditorHideFlags: 0
  m_Script: {fileID: 11500000, guid: 72ece51f2901e7445ab60da3685d6b5f, type: 3}
  m_Name: 
  m_EditorClassIdentifier: 
  m_ShowDebugText: 0
  m_ShowCameraFrustum: 1
  m_IgnoreTimeScale: 0
  m_WorldUpOverride: {fileID: 0}
  m_UpdateMethod: 2
  m_BlendUpdateMethod: 1
  m_DefaultBlend:
    m_Style: 1
    m_Time: 2
    m_CustomCurve:
      serializedVersion: 2
      m_Curve: []
      m_PreInfinity: 2
      m_PostInfinity: 2
      m_RotationOrder: 4
  m_CustomBlends: {fileID: 0}
  m_CameraCutEvent:
    m_PersistentCalls:
      m_Calls: []
  m_CameraActivatedEvent:
    m_PersistentCalls:
      m_Calls: []
--- !u!20 &519420031
Camera:
  m_ObjectHideFlags: 0
  m_CorrespondingSourceObject: {fileID: 0}
  m_PrefabInstance: {fileID: 0}
  m_PrefabAsset: {fileID: 0}
  m_GameObject: {fileID: 519420028}
  m_Enabled: 1
  serializedVersion: 2
  m_ClearFlags: 2
  m_BackGroundColor: {r: 0.19215687, g: 0.3019608, b: 0.4745098, a: 0}
  m_projectionMatrixMode: 1
  m_GateFitMode: 2
  m_FOVAxisMode: 0
  m_SensorSize: {x: 36, y: 24}
  m_LensShift: {x: 0, y: 0}
  m_FocalLength: 50
  m_NormalizedViewPortRect:
    serializedVersion: 2
    x: 0
    y: 0
    width: 1
    height: 1
  near clip plane: 0.3
  far clip plane: 1000
  field of view: 60
  orthographic: 1
  orthographic size: 5
  m_Depth: -1
  m_CullingMask:
    serializedVersion: 2
    m_Bits: 4294967295
  m_RenderingPath: -1
  m_TargetTexture: {fileID: 0}
  m_TargetDisplay: 0
  m_TargetEye: 0
  m_HDR: 1
  m_AllowMSAA: 0
  m_AllowDynamicResolution: 0
  m_ForceIntoRT: 0
  m_OcclusionCulling: 0
  m_StereoConvergence: 10
  m_StereoSeparation: 0.022
--- !u!4 &519420032
Transform:
  m_ObjectHideFlags: 0
  m_CorrespondingSourceObject: {fileID: 0}
  m_PrefabInstance: {fileID: 0}
  m_PrefabAsset: {fileID: 0}
  m_GameObject: {fileID: 519420028}
  m_LocalRotation: {x: 0, y: 0, z: 0, w: 1}
  m_LocalPosition: {x: 0.010001183, y: -0.94, z: -10}
  m_LocalScale: {x: 1, y: 1, z: 1}
  m_Children: []
  m_Father: {fileID: 0}
  m_RootOrder: 0
  m_LocalEulerAnglesHint: {x: 0, y: 0, z: 0}
--- !u!114 &519420033
MonoBehaviour:
  m_ObjectHideFlags: 0
  m_CorrespondingSourceObject: {fileID: 0}
  m_PrefabInstance: {fileID: 0}
  m_PrefabAsset: {fileID: 0}
  m_GameObject: {fileID: 519420028}
  m_Enabled: 1
  m_EditorHideFlags: 0
  m_Script: {fileID: 11500000, guid: 091bb7100ce6822408f05c001afdfe4c, type: 3}
  m_Name: 
  m_EditorClassIdentifier: 
  mainCamera: {fileID: 519420031}
  RandomBlock: {fileID: 1346276819}
--- !u!4 &774115692 stripped
Transform:
  m_CorrespondingSourceObject: {fileID: 4721856467421512955, guid: 6f322cdbf5d491d4db73b52048e97ea8, type: 3}
  m_PrefabInstance: {fileID: 4721856467792975255}
  m_PrefabAsset: {fileID: 0}
--- !u!1001 &836600445
PrefabInstance:
  m_ObjectHideFlags: 0
  serializedVersion: 2
  m_Modification:
    m_TransformParent: {fileID: 0}
    m_Modifications:
    - target: {fileID: 7575976401902332866, guid: a14b2fa53f6327d49af223cd68bc8c3f, type: 3}
      propertyPath: m_RootOrder
      value: 7
      objectReference: {fileID: 0}
    - target: {fileID: 7575976401902332866, guid: a14b2fa53f6327d49af223cd68bc8c3f, type: 3}
      propertyPath: m_LocalScale.x
      value: 0.9964172
      objectReference: {fileID: 0}
    - target: {fileID: 7575976401902332866, guid: a14b2fa53f6327d49af223cd68bc8c3f, type: 3}
      propertyPath: m_LocalPosition.x
      value: -0.049987793
      objectReference: {fileID: 0}
    - target: {fileID: 7575976401902332866, guid: a14b2fa53f6327d49af223cd68bc8c3f, type: 3}
      propertyPath: m_LocalPosition.y
      value: -0.42001343
      objectReference: {fileID: 0}
    - target: {fileID: 7575976401902332866, guid: a14b2fa53f6327d49af223cd68bc8c3f, type: 3}
      propertyPath: m_LocalPosition.z
      value: 0
      objectReference: {fileID: 0}
    - target: {fileID: 7575976401902332866, guid: a14b2fa53f6327d49af223cd68bc8c3f, type: 3}
      propertyPath: m_LocalRotation.w
      value: 1
      objectReference: {fileID: 0}
    - target: {fileID: 7575976401902332866, guid: a14b2fa53f6327d49af223cd68bc8c3f, type: 3}
      propertyPath: m_LocalRotation.x
      value: -0
      objectReference: {fileID: 0}
    - target: {fileID: 7575976401902332866, guid: a14b2fa53f6327d49af223cd68bc8c3f, type: 3}
      propertyPath: m_LocalRotation.y
      value: -0
      objectReference: {fileID: 0}
    - target: {fileID: 7575976401902332866, guid: a14b2fa53f6327d49af223cd68bc8c3f, type: 3}
      propertyPath: m_LocalRotation.z
      value: -0
      objectReference: {fileID: 0}
    - target: {fileID: 7575976401902332866, guid: a14b2fa53f6327d49af223cd68bc8c3f, type: 3}
      propertyPath: m_LocalEulerAnglesHint.x
      value: 0
      objectReference: {fileID: 0}
    - target: {fileID: 7575976401902332866, guid: a14b2fa53f6327d49af223cd68bc8c3f, type: 3}
      propertyPath: m_LocalEulerAnglesHint.y
      value: 0
      objectReference: {fileID: 0}
    - target: {fileID: 7575976401902332866, guid: a14b2fa53f6327d49af223cd68bc8c3f, type: 3}
      propertyPath: m_LocalEulerAnglesHint.z
      value: 0
      objectReference: {fileID: 0}
    - target: {fileID: 7575976401902332870, guid: a14b2fa53f6327d49af223cd68bc8c3f, type: 3}
      propertyPath: m_Name
      value: Block (1)
      objectReference: {fileID: 0}
    - target: {fileID: 7575976401902332870, guid: a14b2fa53f6327d49af223cd68bc8c3f, type: 3}
      propertyPath: m_TagString
      value: Ground
      objectReference: {fileID: 0}
    m_RemovedComponents: []
  m_SourcePrefab: {fileID: 100100000, guid: a14b2fa53f6327d49af223cd68bc8c3f, type: 3}
--- !u!1 &1019467131 stripped
GameObject:
  m_CorrespondingSourceObject: {fileID: 8163270756027245482, guid: 87bdab3c41015e1498561e8ae02a40d0, type: 3}
  m_PrefabInstance: {fileID: 8163270755427382993}
  m_PrefabAsset: {fileID: 0}
--- !u!1 &1259156197 stripped
GameObject:
  m_CorrespondingSourceObject: {fileID: 8163270754202829876, guid: 87bdab3c41015e1498561e8ae02a40d0, type: 3}
  m_PrefabInstance: {fileID: 8163270755427382993}
  m_PrefabAsset: {fileID: 0}
--- !u!1 &1275668910
GameObject:
  m_ObjectHideFlags: 3
  m_CorrespondingSourceObject: {fileID: 0}
  m_PrefabInstance: {fileID: 0}
  m_PrefabAsset: {fileID: 0}
  serializedVersion: 6
  m_Component:
  - component: {fileID: 1275668911}
  - component: {fileID: 1275668914}
  - component: {fileID: 1275668913}
  - component: {fileID: 1275668912}
  m_Layer: 0
  m_Name: cm
  m_TagString: Untagged
  m_Icon: {fileID: 0}
  m_NavMeshLayer: 0
  m_StaticEditorFlags: 0
  m_IsActive: 1
--- !u!4 &1275668911
Transform:
  m_ObjectHideFlags: 3
  m_CorrespondingSourceObject: {fileID: 0}
  m_PrefabInstance: {fileID: 0}
  m_PrefabAsset: {fileID: 0}
  m_GameObject: {fileID: 1275668910}
  m_LocalRotation: {x: -0, y: -0, z: -0, w: 1}
  m_LocalPosition: {x: 0, y: 0, z: 34.24871}
  m_LocalScale: {x: 1, y: 1, z: 1}
  m_Children: []
  m_Father: {fileID: 1507121017}
  m_RootOrder: 0
  m_LocalEulerAnglesHint: {x: 0, y: 0, z: 0}
--- !u!114 &1275668912
MonoBehaviour:
  m_ObjectHideFlags: 3
  m_CorrespondingSourceObject: {fileID: 0}
  m_PrefabInstance: {fileID: 0}
  m_PrefabAsset: {fileID: 0}
  m_GameObject: {fileID: 1275668910}
  m_Enabled: 1
  m_EditorHideFlags: 0
  m_Script: {fileID: 11500000, guid: fa7155796051b734daa718462081dc5f, type: 3}
  m_Name: 
  m_EditorClassIdentifier: 
  m_BindingMode: 1
  m_FollowOffset: {x: 4.630001, y: 0, z: -10}
  m_XDamping: 1
  m_YDamping: 1
  m_ZDamping: 1
  m_AngularDampingMode: 0
  m_PitchDamping: 0
  m_YawDamping: 0
  m_RollDamping: 0
  m_AngularDamping: 0
--- !u!114 &1275668913
MonoBehaviour:
  m_ObjectHideFlags: 3
  m_CorrespondingSourceObject: {fileID: 0}
  m_PrefabInstance: {fileID: 0}
  m_PrefabAsset: {fileID: 0}
  m_GameObject: {fileID: 1275668910}
  m_Enabled: 1
  m_EditorHideFlags: 0
  m_Script: {fileID: 11500000, guid: f4044717213e31446939f7bd49c896ea, type: 3}
  m_Name: 
  m_EditorClassIdentifier: 
  m_TrackedObjectOffset: {x: 0, y: 0, z: 0}
  m_LookaheadTime: 0
  m_LookaheadSmoothing: 0
  m_LookaheadIgnoreY: 0
  m_HorizontalDamping: 0.5
  m_VerticalDamping: 0.5
  m_ScreenX: 0.5
  m_ScreenY: 0.5
  m_DeadZoneWidth: 0
  m_DeadZoneHeight: 0
  m_SoftZoneWidth: 0.8
  m_SoftZoneHeight: 0.8
  m_BiasX: 0
  m_BiasY: 0
  m_CenterOnActivate: 1
--- !u!114 &1275668914
MonoBehaviour:
  m_ObjectHideFlags: 3
  m_CorrespondingSourceObject: {fileID: 0}
  m_PrefabInstance: {fileID: 0}
  m_PrefabAsset: {fileID: 0}
  m_GameObject: {fileID: 1275668910}
  m_Enabled: 1
  m_EditorHideFlags: 0
  m_Script: {fileID: 11500000, guid: ac0b09e7857660247b1477e93731de29, type: 3}
  m_Name: 
  m_EditorClassIdentifier: 
--- !u!114 &1346276819 stripped
MonoBehaviour:
  m_CorrespondingSourceObject: {fileID: 4993057110688061060, guid: 7173c5dd14b018f4d90f6bd0f9cce872, type: 3}
  m_PrefabInstance: {fileID: 4993057109885213527}
  m_PrefabAsset: {fileID: 0}
  m_GameObject: {fileID: 0}
  m_Enabled: 1
  m_EditorHideFlags: 0
  m_Script: {fileID: 11500000, guid: 649026d68def32446b4701cdfff134a6, type: 3}
  m_Name: 
  m_EditorClassIdentifier: 
--- !u!1 &1448999155
GameObject:
  m_ObjectHideFlags: 0
  m_CorrespondingSourceObject: {fileID: 0}
  m_PrefabInstance: {fileID: 0}
  m_PrefabAsset: {fileID: 0}
  serializedVersion: 6
  m_Component:
  - component: {fileID: 1448999158}
  - component: {fileID: 1448999157}
  - component: {fileID: 1448999156}
  m_Layer: 0
  m_Name: EventSystem
  m_TagString: Untagged
  m_Icon: {fileID: 0}
  m_NavMeshLayer: 0
  m_StaticEditorFlags: 0
  m_IsActive: 1
--- !u!114 &1448999156
MonoBehaviour:
  m_ObjectHideFlags: 0
  m_CorrespondingSourceObject: {fileID: 0}
  m_PrefabInstance: {fileID: 0}
  m_PrefabAsset: {fileID: 0}
  m_GameObject: {fileID: 1448999155}
  m_Enabled: 1
  m_EditorHideFlags: 0
  m_Script: {fileID: 11500000, guid: 4f231c4fb786f3946a6b90b886c48677, type: 3}
  m_Name: 
  m_EditorClassIdentifier: 
  m_HorizontalAxis: Horizontal
  m_VerticalAxis: Vertical
  m_SubmitButton: Submit
  m_CancelButton: Cancel
  m_InputActionsPerSecond: 10
  m_RepeatDelay: 0.5
  m_ForceModuleActive: 0
--- !u!114 &1448999157
MonoBehaviour:
  m_ObjectHideFlags: 0
  m_CorrespondingSourceObject: {fileID: 0}
  m_PrefabInstance: {fileID: 0}
  m_PrefabAsset: {fileID: 0}
  m_GameObject: {fileID: 1448999155}
  m_Enabled: 1
  m_EditorHideFlags: 0
  m_Script: {fileID: 11500000, guid: 76c392e42b5098c458856cdf6ecaaaa1, type: 3}
  m_Name: 
  m_EditorClassIdentifier: 
  m_FirstSelected: {fileID: 0}
  m_sendNavigationEvents: 1
  m_DragThreshold: 10
--- !u!4 &1448999158
Transform:
  m_ObjectHideFlags: 0
  m_CorrespondingSourceObject: {fileID: 0}
  m_PrefabInstance: {fileID: 0}
  m_PrefabAsset: {fileID: 0}
  m_GameObject: {fileID: 1448999155}
  m_LocalRotation: {x: 0, y: 0, z: 0, w: 1}
  m_LocalPosition: {x: 0, y: 0, z: 0}
  m_LocalScale: {x: 1, y: 1, z: 1}
  m_Children: []
  m_Father: {fileID: 0}
  m_RootOrder: 5
  m_LocalEulerAnglesHint: {x: 0, y: 0, z: 0}
--- !u!114 &1475083696 stripped
MonoBehaviour:
  m_CorrespondingSourceObject: {fileID: 8163270754536688481, guid: 87bdab3c41015e1498561e8ae02a40d0, type: 3}
  m_PrefabInstance: {fileID: 8163270755427382993}
  m_PrefabAsset: {fileID: 0}
  m_GameObject: {fileID: 0}
  m_Enabled: 1
  m_EditorHideFlags: 0
  m_Script: {fileID: 11500000, guid: 34cf0d269ba543b4b84963b3a2049677, type: 3}
  m_Name: 
  m_EditorClassIdentifier: 
--- !u!1 &1507121015
GameObject:
  m_ObjectHideFlags: 0
  m_CorrespondingSourceObject: {fileID: 0}
  m_PrefabInstance: {fileID: 0}
  m_PrefabAsset: {fileID: 0}
  serializedVersion: 6
  m_Component:
  - component: {fileID: 1507121017}
  - component: {fileID: 1507121016}
  m_Layer: 0
  m_Name: CM vcam1
  m_TagString: Untagged
  m_Icon: {fileID: 0}
  m_NavMeshLayer: 0
  m_StaticEditorFlags: 0
  m_IsActive: 1
--- !u!114 &1507121016
MonoBehaviour:
  m_ObjectHideFlags: 0
  m_CorrespondingSourceObject: {fileID: 0}
  m_PrefabInstance: {fileID: 0}
  m_PrefabAsset: {fileID: 0}
  m_GameObject: {fileID: 1507121015}
  m_Enabled: 1
  m_EditorHideFlags: 0
  m_Script: {fileID: 11500000, guid: 45e653bab7fb20e499bda25e1b646fea, type: 3}
  m_Name: 
  m_EditorClassIdentifier: 
  m_ExcludedPropertiesInInspector:
  - m_Script
  m_LockStageInInspector: 
  m_StreamingVersion: 20170927
  m_Priority: 10
  m_StandbyUpdate: 2
  m_LookAt: {fileID: 0}
  m_Follow: {fileID: 774115692}
  m_Lens:
    FieldOfView: 60
    OrthographicSize: 5
    NearClipPlane: 0.3
    FarClipPlane: 1000
    Dutch: 0
    LensShift: {x: 0, y: 0}
  m_Transitions:
    m_BlendHint: 0
    m_InheritPosition: 0
    m_OnCameraLive:
      m_PersistentCalls:
        m_Calls: []
  m_LegacyBlendHint: 0
  m_ComponentOwner: {fileID: 1275668911}
--- !u!4 &1507121017
Transform:
  m_ObjectHideFlags: 0
  m_CorrespondingSourceObject: {fileID: 0}
  m_PrefabInstance: {fileID: 0}
  m_PrefabAsset: {fileID: 0}
  m_GameObject: {fileID: 1507121015}
  m_LocalRotation: {x: 0, y: 0, z: 0, w: 1}
  m_LocalPosition: {x: 0.010001183, y: -0.94, z: -10}
  m_LocalScale: {x: 1, y: 1, z: 1}
  m_Children:
  - {fileID: 1275668911}
  m_Father: {fileID: 0}
  m_RootOrder: 1
  m_LocalEulerAnglesHint: {x: 0, y: 0, z: 0}
--- !u!1 &1664379869 stripped
GameObject:
  m_CorrespondingSourceObject: {fileID: 720421533312807629, guid: 56047c563b0c79d44991b814d48948ff, type: 3}
  m_PrefabInstance: {fileID: 720421532496354829}
  m_PrefabAsset: {fileID: 0}
--- !u!114 &1692140647 stripped
MonoBehaviour:
  m_CorrespondingSourceObject: {fileID: 3717087382735177466, guid: a14b2fa53f6327d49af223cd68bc8c3f, type: 3}
  m_PrefabInstance: {fileID: 836600445}
  m_PrefabAsset: {fileID: 0}
  m_GameObject: {fileID: 0}
  m_Enabled: 1
  m_EditorHideFlags: 0
  m_Script: {fileID: 11500000, guid: 148363c036d88554bac2a0ae6f012a22, type: 3}
  m_Name: 
  m_EditorClassIdentifier: 
--- !u!1 &1948609544 stripped
GameObject:
  m_CorrespondingSourceObject: {fileID: 8163270755093584601, guid: 87bdab3c41015e1498561e8ae02a40d0, type: 3}
  m_PrefabInstance: {fileID: 8163270755427382993}
  m_PrefabAsset: {fileID: 0}
--- !u!114 &2022047848 stripped
MonoBehaviour:
  m_CorrespondingSourceObject: {fileID: 4721856467421512952, guid: 6f322cdbf5d491d4db73b52048e97ea8, type: 3}
  m_PrefabInstance: {fileID: 4721856467792975255}
  m_PrefabAsset: {fileID: 0}
  m_GameObject: {fileID: 0}
  m_Enabled: 1
  m_EditorHideFlags: 0
  m_Script: {fileID: 11500000, guid: 27209c2217ecbbc419c288f2a094891e, type: 3}
  m_Name: 
  m_EditorClassIdentifier: 
--- !u!1001 &720421532496354829
PrefabInstance:
  m_ObjectHideFlags: 0
  serializedVersion: 2
  m_Modification:
    m_TransformParent: {fileID: 0}
    m_Modifications:
    - target: {fileID: 720421533312807629, guid: 56047c563b0c79d44991b814d48948ff, type: 3}
      propertyPath: m_Name
      value: Ground
      objectReference: {fileID: 0}
    - target: {fileID: 720421533312807629, guid: 56047c563b0c79d44991b814d48948ff, type: 3}
      propertyPath: m_TagString
      value: Respawn
      objectReference: {fileID: 0}
    - target: {fileID: 720421533312807631, guid: 56047c563b0c79d44991b814d48948ff, type: 3}
      propertyPath: m_RootOrder
      value: 6
      objectReference: {fileID: 0}
    - target: {fileID: 720421533312807631, guid: 56047c563b0c79d44991b814d48948ff, type: 3}
      propertyPath: m_LocalPosition.x
      value: -5.4400024
      objectReference: {fileID: 0}
    - target: {fileID: 720421533312807631, guid: 56047c563b0c79d44991b814d48948ff, type: 3}
      propertyPath: m_LocalPosition.y
      value: -1.9899902
      objectReference: {fileID: 0}
    - target: {fileID: 720421533312807631, guid: 56047c563b0c79d44991b814d48948ff, type: 3}
      propertyPath: m_LocalPosition.z
      value: 0
      objectReference: {fileID: 0}
    - target: {fileID: 720421533312807631, guid: 56047c563b0c79d44991b814d48948ff, type: 3}
      propertyPath: m_LocalRotation.w
      value: 1
      objectReference: {fileID: 0}
    - target: {fileID: 720421533312807631, guid: 56047c563b0c79d44991b814d48948ff, type: 3}
      propertyPath: m_LocalRotation.x
      value: -0
      objectReference: {fileID: 0}
    - target: {fileID: 720421533312807631, guid: 56047c563b0c79d44991b814d48948ff, type: 3}
      propertyPath: m_LocalRotation.y
      value: -0
      objectReference: {fileID: 0}
    - target: {fileID: 720421533312807631, guid: 56047c563b0c79d44991b814d48948ff, type: 3}
      propertyPath: m_LocalRotation.z
      value: -0
      objectReference: {fileID: 0}
    - target: {fileID: 720421533312807631, guid: 56047c563b0c79d44991b814d48948ff, type: 3}
      propertyPath: m_LocalEulerAnglesHint.x
      value: 0
      objectReference: {fileID: 0}
    - target: {fileID: 720421533312807631, guid: 56047c563b0c79d44991b814d48948ff, type: 3}
      propertyPath: m_LocalEulerAnglesHint.y
      value: 0
      objectReference: {fileID: 0}
    - target: {fileID: 720421533312807631, guid: 56047c563b0c79d44991b814d48948ff, type: 3}
      propertyPath: m_LocalEulerAnglesHint.z
      value: 0
      objectReference: {fileID: 0}
    m_RemovedComponents: []
  m_SourcePrefab: {fileID: 100100000, guid: 56047c563b0c79d44991b814d48948ff, type: 3}
--- !u!1001 &4721856467792975255
PrefabInstance:
  m_ObjectHideFlags: 0
  serializedVersion: 2
  m_Modification:
    m_TransformParent: {fileID: 0}
    m_Modifications:
    - target: {fileID: 4721856467421512952, guid: 6f322cdbf5d491d4db73b52048e97ea8, type: 3}
      propertyPath: Heart
      value: 3
      objectReference: {fileID: 0}
    - target: {fileID: 4721856467421512952, guid: 6f322cdbf5d491d4db73b52048e97ea8, type: 3}
      propertyPath: ground
      value: 
      objectReference: {fileID: 1664379869}
    - target: {fileID: 4721856467421512952, guid: 6f322cdbf5d491d4db73b52048e97ea8, type: 3}
      propertyPath: isGround
      value: 1
      objectReference: {fileID: 0}
    - target: {fileID: 4721856467421512952, guid: 6f322cdbf5d491d4db73b52048e97ea8, type: 3}
      propertyPath: Heartbar.Array.size
      value: 3
      objectReference: {fileID: 0}
    - target: {fileID: 4721856467421512952, guid: 6f322cdbf5d491d4db73b52048e97ea8, type: 3}
      propertyPath: Heartbar.Array.data[0]
      value: 
      objectReference: {fileID: 1259156197}
    - target: {fileID: 4721856467421512952, guid: 6f322cdbf5d491d4db73b52048e97ea8, type: 3}
      propertyPath: Heartbar.Array.data[1]
      value: 
      objectReference: {fileID: 1948609544}
    - target: {fileID: 4721856467421512952, guid: 6f322cdbf5d491d4db73b52048e97ea8, type: 3}
      propertyPath: Heartbar.Array.data[2]
      value: 
      objectReference: {fileID: 1019467131}
    - target: {fileID: 4721856467421512955, guid: 6f322cdbf5d491d4db73b52048e97ea8, type: 3}
      propertyPath: m_RootOrder
      value: 3
      objectReference: {fileID: 0}
    - target: {fileID: 4721856467421512955, guid: 6f322cdbf5d491d4db73b52048e97ea8, type: 3}
      propertyPath: m_LocalPosition.x
      value: -4.62
      objectReference: {fileID: 0}
    - target: {fileID: 4721856467421512955, guid: 6f322cdbf5d491d4db73b52048e97ea8, type: 3}
      propertyPath: m_LocalPosition.y
      value: -0.94
      objectReference: {fileID: 0}
    - target: {fileID: 4721856467421512955, guid: 6f322cdbf5d491d4db73b52048e97ea8, type: 3}
      propertyPath: m_LocalPosition.z
      value: 0
      objectReference: {fileID: 0}
    - target: {fileID: 4721856467421512955, guid: 6f322cdbf5d491d4db73b52048e97ea8, type: 3}
      propertyPath: m_LocalRotation.w
      value: 1
      objectReference: {fileID: 0}
    - target: {fileID: 4721856467421512955, guid: 6f322cdbf5d491d4db73b52048e97ea8, type: 3}
      propertyPath: m_LocalRotation.x
      value: 0
      objectReference: {fileID: 0}
    - target: {fileID: 4721856467421512955, guid: 6f322cdbf5d491d4db73b52048e97ea8, type: 3}
      propertyPath: m_LocalRotation.y
      value: 0
      objectReference: {fileID: 0}
    - target: {fileID: 4721856467421512955, guid: 6f322cdbf5d491d4db73b52048e97ea8, type: 3}
      propertyPath: m_LocalRotation.z
      value: 0
      objectReference: {fileID: 0}
    - target: {fileID: 4721856467421512955, guid: 6f322cdbf5d491d4db73b52048e97ea8, type: 3}
      propertyPath: m_LocalEulerAnglesHint.x
      value: 0
      objectReference: {fileID: 0}
    - target: {fileID: 4721856467421512955, guid: 6f322cdbf5d491d4db73b52048e97ea8, type: 3}
      propertyPath: m_LocalEulerAnglesHint.y
      value: 0
      objectReference: {fileID: 0}
    - target: {fileID: 4721856467421512955, guid: 6f322cdbf5d491d4db73b52048e97ea8, type: 3}
      propertyPath: m_LocalEulerAnglesHint.z
      value: 0
      objectReference: {fileID: 0}
    - target: {fileID: 4721856467421512957, guid: 6f322cdbf5d491d4db73b52048e97ea8, type: 3}
      propertyPath: m_Name
      value: Player
      objectReference: {fileID: 0}
    - target: {fileID: 4721856467421512957, guid: 6f322cdbf5d491d4db73b52048e97ea8, type: 3}
      propertyPath: m_TagString
      value: Player
      objectReference: {fileID: 0}
    m_RemovedComponents: []
  m_SourcePrefab: {fileID: 100100000, guid: 6f322cdbf5d491d4db73b52048e97ea8, type: 3}
--- !u!1001 &4993057109885213527
PrefabInstance:
  m_ObjectHideFlags: 0
  serializedVersion: 2
  m_Modification:
    m_TransformParent: {fileID: 0}
    m_Modifications:
    - target: {fileID: 4993057110688061060, guid: 7173c5dd14b018f4d90f6bd0f9cce872, type: 3}
      propertyPath: rootBlock
      value: 
      objectReference: {fileID: 1692140647}
    - target: {fileID: 4993057110688061061, guid: 7173c5dd14b018f4d90f6bd0f9cce872, type: 3}
      propertyPath: m_RootOrder
      value: 8
      objectReference: {fileID: 0}
    - target: {fileID: 4993057110688061061, guid: 7173c5dd14b018f4d90f6bd0f9cce872, type: 3}
      propertyPath: m_LocalPosition.x
      value: 353.52737
      objectReference: {fileID: 0}
    - target: {fileID: 4993057110688061061, guid: 7173c5dd14b018f4d90f6bd0f9cce872, type: 3}
      propertyPath: m_LocalPosition.y
      value: 301.2197
      objectReference: {fileID: 0}
    - target: {fileID: 4993057110688061061, guid: 7173c5dd14b018f4d90f6bd0f9cce872, type: 3}
      propertyPath: m_LocalPosition.z
      value: -5.231939
      objectReference: {fileID: 0}
    - target: {fileID: 4993057110688061061, guid: 7173c5dd14b018f4d90f6bd0f9cce872, type: 3}
      propertyPath: m_LocalRotation.w
      value: 1
      objectReference: {fileID: 0}
    - target: {fileID: 4993057110688061061, guid: 7173c5dd14b018f4d90f6bd0f9cce872, type: 3}
      propertyPath: m_LocalRotation.x
      value: 0
      objectReference: {fileID: 0}
    - target: {fileID: 4993057110688061061, guid: 7173c5dd14b018f4d90f6bd0f9cce872, type: 3}
      propertyPath: m_LocalRotation.y
      value: 0
      objectReference: {fileID: 0}
    - target: {fileID: 4993057110688061061, guid: 7173c5dd14b018f4d90f6bd0f9cce872, type: 3}
      propertyPath: m_LocalRotation.z
      value: 0
      objectReference: {fileID: 0}
    - target: {fileID: 4993057110688061061, guid: 7173c5dd14b018f4d90f6bd0f9cce872, type: 3}
      propertyPath: m_LocalEulerAnglesHint.x
      value: 0
      objectReference: {fileID: 0}
    - target: {fileID: 4993057110688061061, guid: 7173c5dd14b018f4d90f6bd0f9cce872, type: 3}
      propertyPath: m_LocalEulerAnglesHint.y
      value: 0
      objectReference: {fileID: 0}
    - target: {fileID: 4993057110688061061, guid: 7173c5dd14b018f4d90f6bd0f9cce872, type: 3}
      propertyPath: m_LocalEulerAnglesHint.z
      value: 0
      objectReference: {fileID: 0}
    - target: {fileID: 4993057110688061062, guid: 7173c5dd14b018f4d90f6bd0f9cce872, type: 3}
      propertyPath: m_Name
      value: BlockList
      objectReference: {fileID: 0}
    m_RemovedComponents: []
  m_SourcePrefab: {fileID: 100100000, guid: 7173c5dd14b018f4d90f6bd0f9cce872, type: 3}
--- !u!1001 &6643595591083275589
PrefabInstance:
  m_ObjectHideFlags: 0
  serializedVersion: 2
  m_Modification:
    m_TransformParent: {fileID: 0}
    m_Modifications:
    - target: {fileID: 6643595590963767730, guid: 358511c6a2561cb4287e7c5359f81d5c, type: 3}
      propertyPath: Player
      value: 
      objectReference: {fileID: 2022047848}
    - target: {fileID: 6643595590963767730, guid: 358511c6a2561cb4287e7c5359f81d5c, type: 3}
      propertyPath: status
      value: 
      objectReference: {fileID: 414859923}
    - target: {fileID: 6643595590963767730, guid: 358511c6a2561cb4287e7c5359f81d5c, type: 3}
      propertyPath: DataJson
      value: 
      objectReference: {fileID: 4900000, guid: 335084fb868d80940a2041f3cc083d05, type: 3}
    - target: {fileID: 6643595590963767730, guid: 358511c6a2561cb4287e7c5359f81d5c, type: 3}
      propertyPath: PointText
      value: 
      objectReference: {fileID: 498794737}
    - target: {fileID: 6643595590963767730, guid: 358511c6a2561cb4287e7c5359f81d5c, type: 3}
      propertyPath: dataPoint
      value: 
      objectReference: {fileID: 498794739}
    - target: {fileID: 6643595590963767730, guid: 358511c6a2561cb4287e7c5359f81d5c, type: 3}
      propertyPath: StadingBlock
      value: 
      objectReference: {fileID: 1664379869}
    - target: {fileID: 6643595590963767730, guid: 358511c6a2561cb4287e7c5359f81d5c, type: 3}
      propertyPath: maxRangePoint
      value: 0
      objectReference: {fileID: 0}
    - target: {fileID: 6643595590963767730, guid: 358511c6a2561cb4287e7c5359f81d5c, type: 3}
      propertyPath: MenuController
      value: 
      objectReference: {fileID: 1475083696}
    - target: {fileID: 6643595590963767731, guid: 358511c6a2561cb4287e7c5359f81d5c, type: 3}
      propertyPath: m_Name
      value: GameController
      objectReference: {fileID: 0}
    - target: {fileID: 6643595590963767741, guid: 358511c6a2561cb4287e7c5359f81d5c, type: 3}
      propertyPath: m_RootOrder
      value: 2
      objectReference: {fileID: 0}
    - target: {fileID: 6643595590963767741, guid: 358511c6a2561cb4287e7c5359f81d5c, type: 3}
      propertyPath: m_LocalPosition.x
      value: 353.52737
      objectReference: {fileID: 0}
    - target: {fileID: 6643595590963767741, guid: 358511c6a2561cb4287e7c5359f81d5c, type: 3}
      propertyPath: m_LocalPosition.y
      value: 301.2197
      objectReference: {fileID: 0}
    - target: {fileID: 6643595590963767741, guid: 358511c6a2561cb4287e7c5359f81d5c, type: 3}
      propertyPath: m_LocalPosition.z
      value: -5.231939
      objectReference: {fileID: 0}
    - target: {fileID: 6643595590963767741, guid: 358511c6a2561cb4287e7c5359f81d5c, type: 3}
      propertyPath: m_LocalRotation.w
      value: 1
      objectReference: {fileID: 0}
    - target: {fileID: 6643595590963767741, guid: 358511c6a2561cb4287e7c5359f81d5c, type: 3}
      propertyPath: m_LocalRotation.x
      value: 0
      objectReference: {fileID: 0}
    - target: {fileID: 6643595590963767741, guid: 358511c6a2561cb4287e7c5359f81d5c, type: 3}
      propertyPath: m_LocalRotation.y
      value: 0
      objectReference: {fileID: 0}
    - target: {fileID: 6643595590963767741, guid: 358511c6a2561cb4287e7c5359f81d5c, type: 3}
      propertyPath: m_LocalRotation.z
      value: 0
      objectReference: {fileID: 0}
    - target: {fileID: 6643595590963767741, guid: 358511c6a2561cb4287e7c5359f81d5c, type: 3}
      propertyPath: m_LocalEulerAnglesHint.x
      value: 0
      objectReference: {fileID: 0}
    - target: {fileID: 6643595590963767741, guid: 358511c6a2561cb4287e7c5359f81d5c, type: 3}
      propertyPath: m_LocalEulerAnglesHint.y
      value: 0
      objectReference: {fileID: 0}
    - target: {fileID: 6643595590963767741, guid: 358511c6a2561cb4287e7c5359f81d5c, type: 3}
      propertyPath: m_LocalEulerAnglesHint.z
      value: 0
      objectReference: {fileID: 0}
    m_RemovedComponents: []
  m_SourcePrefab: {fileID: 100100000, guid: 358511c6a2561cb4287e7c5359f81d5c, type: 3}
--- !u!1001 &8163270755427382993
PrefabInstance:
  m_ObjectHideFlags: 0
  serializedVersion: 2
  m_Modification:
    m_TransformParent: {fileID: 0}
    m_Modifications:
    - target: {fileID: 8163270754536688506, guid: 87bdab3c41015e1498561e8ae02a40d0, type: 3}
      propertyPath: m_Name
      value: Canvas
      objectReference: {fileID: 0}
    - target: {fileID: 8163270754536688510, guid: 87bdab3c41015e1498561e8ae02a40d0, type: 3}
      propertyPath: m_Pivot.x
      value: 0
      objectReference: {fileID: 0}
    - target: {fileID: 8163270754536688510, guid: 87bdab3c41015e1498561e8ae02a40d0, type: 3}
      propertyPath: m_Pivot.y
      value: 0
      objectReference: {fileID: 0}
    - target: {fileID: 8163270754536688510, guid: 87bdab3c41015e1498561e8ae02a40d0, type: 3}
      propertyPath: m_RootOrder
      value: 4
      objectReference: {fileID: 0}
    - target: {fileID: 8163270754536688510, guid: 87bdab3c41015e1498561e8ae02a40d0, type: 3}
      propertyPath: m_AnchorMax.x
      value: 0
      objectReference: {fileID: 0}
    - target: {fileID: 8163270754536688510, guid: 87bdab3c41015e1498561e8ae02a40d0, type: 3}
      propertyPath: m_AnchorMax.y
      value: 0
      objectReference: {fileID: 0}
    - target: {fileID: 8163270754536688510, guid: 87bdab3c41015e1498561e8ae02a40d0, type: 3}
      propertyPath: m_AnchorMin.x
      value: 0
      objectReference: {fileID: 0}
    - target: {fileID: 8163270754536688510, guid: 87bdab3c41015e1498561e8ae02a40d0, type: 3}
      propertyPath: m_AnchorMin.y
      value: 0
      objectReference: {fileID: 0}
    - target: {fileID: 8163270754536688510, guid: 87bdab3c41015e1498561e8ae02a40d0, type: 3}
      propertyPath: m_SizeDelta.x
      value: 0
      objectReference: {fileID: 0}
    - target: {fileID: 8163270754536688510, guid: 87bdab3c41015e1498561e8ae02a40d0, type: 3}
      propertyPath: m_SizeDelta.y
      value: 0
      objectReference: {fileID: 0}
    - target: {fileID: 8163270754536688510, guid: 87bdab3c41015e1498561e8ae02a40d0, type: 3}
      propertyPath: m_LocalPosition.x
      value: 0
      objectReference: {fileID: 0}
    - target: {fileID: 8163270754536688510, guid: 87bdab3c41015e1498561e8ae02a40d0, type: 3}
      propertyPath: m_LocalPosition.y
      value: 0
      objectReference: {fileID: 0}
    - target: {fileID: 8163270754536688510, guid: 87bdab3c41015e1498561e8ae02a40d0, type: 3}
      propertyPath: m_LocalPosition.z
      value: 0
      objectReference: {fileID: 0}
    - target: {fileID: 8163270754536688510, guid: 87bdab3c41015e1498561e8ae02a40d0, type: 3}
      propertyPath: m_LocalRotation.w
      value: 1
      objectReference: {fileID: 0}
    - target: {fileID: 8163270754536688510, guid: 87bdab3c41015e1498561e8ae02a40d0, type: 3}
      propertyPath: m_LocalRotation.x
      value: 0
      objectReference: {fileID: 0}
    - target: {fileID: 8163270754536688510, guid: 87bdab3c41015e1498561e8ae02a40d0, type: 3}
      propertyPath: m_LocalRotation.y
      value: 0
      objectReference: {fileID: 0}
    - target: {fileID: 8163270754536688510, guid: 87bdab3c41015e1498561e8ae02a40d0, type: 3}
      propertyPath: m_LocalRotation.z
      value: 0
      objectReference: {fileID: 0}
    - target: {fileID: 8163270754536688510, guid: 87bdab3c41015e1498561e8ae02a40d0, type: 3}
      propertyPath: m_AnchoredPosition.x
      value: 0
      objectReference: {fileID: 0}
    - target: {fileID: 8163270754536688510, guid: 87bdab3c41015e1498561e8ae02a40d0, type: 3}
      propertyPath: m_AnchoredPosition.y
      value: 0
      objectReference: {fileID: 0}
    - target: {fileID: 8163270754536688510, guid: 87bdab3c41015e1498561e8ae02a40d0, type: 3}
      propertyPath: m_LocalEulerAnglesHint.x
      value: 0
      objectReference: {fileID: 0}
    - target: {fileID: 8163270754536688510, guid: 87bdab3c41015e1498561e8ae02a40d0, type: 3}
      propertyPath: m_LocalEulerAnglesHint.y
      value: 0
      objectReference: {fileID: 0}
    - target: {fileID: 8163270754536688510, guid: 87bdab3c41015e1498561e8ae02a40d0, type: 3}
      propertyPath: m_LocalEulerAnglesHint.z
      value: 0
      objectReference: {fileID: 0}
    - target: {fileID: 8163270755504518688, guid: 87bdab3c41015e1498561e8ae02a40d0, type: 3}
      propertyPath: m_Text
      value: 
      objectReference: {fileID: 0}
    - target: {fileID: 8163270755504518690, guid: 87bdab3c41015e1498561e8ae02a40d0, type: 3}
      propertyPath: DataJson
      value: 
      objectReference: {fileID: 4900000, guid: 335084fb868d80940a2041f3cc083d05, type: 3}
    - target: {fileID: 8163270755504518690, guid: 87bdab3c41015e1498561e8ae02a40d0, type: 3}
      propertyPath: _highScore.Score
      value: 10
      objectReference: {fileID: 0}
    - target: {fileID: 8163270755504518718, guid: 87bdab3c41015e1498561e8ae02a40d0, type: 3}
      propertyPath: m_Name
      value: Point
      objectReference: {fileID: 0}
    - target: {fileID: 8163270755884031168, guid: 87bdab3c41015e1498561e8ae02a40d0, type: 3}
      propertyPath: m_OnClick.m_PersistentCalls.m_Calls.Array.data[0].m_MethodName
      value: SetActive
      objectReference: {fileID: 0}
    m_RemovedComponents: []
  m_SourcePrefab: {fileID: 100100000, guid: 87bdab3c41015e1498561e8ae02a40d0, type: 3}
