{
    "version": 8,
    "name": "terrian",
    "owner": "vietbando",
    "id": "mapstyleterain",
    "sources": {
        "vietbando": {
            "url": "https://images.vietbando.com/Source/vt_vbddefault/306ec9b5-8146-4a83-9271-bd7b343a574a",
            "type": "vector"
        },
        "building": {
            "url": "https://images.vietbando.com/Source/vt_building/306ec9b5-8146-4a83-9271-bd7b343a574a",
            "type": "vector"
        },
        "vt_background": {
            "url": "https://images.vietbando.com/Source/vt_background/306ec9b5-8146-4a83-9271-bd7b343a574a",
            "type": "vector"
        }
    },
    "sprite": "https://images.vietbando.com/Sprite/terrian",
    "glyphs": "https://images.vietbando.com/Font/{fontstack}/{range}",
    "layers": [
        {
            "id": "background",
            "type": "background",
            "paint": {
                "background-color": "#FFFFD3"
            }
        },
        {
            "id": "region_water_index",
            "source": "vt_background",
            "source-layer": "region_water_index",
            "type": "fill",
            "paint": {
                "fill-color": "#AAE6FF"
            }
        },
        {
            "id": "region-bathymetry-index",
            "source": "vt_background",
            "source-layer": "region_bathymetry_index",
            "type": "fill",
            "paint": {
                "fill-color": "#73B6E6",
                "fill-opacity": 0.15
            }
        },
        {
            "id": "region_island_index",
            "source": "vietbando",
            "source-layer": "region_island_index",
            "type": "fill",
            "paint": {
                "fill-color": "#FFFFD3"
            }
        },
        {
            "id": "region-river-index",
            "source": "vietbando",
            "source-layer": "region_river_index",
            "type": "fill",
            "paint": {
                "fill-color": "#AAE6FF"
            }
        },
        {
            "id": "fill-vnairport-index",
            "source": "vietbando",
            "source-layer": "region_vnairport_index",
            "minzoom": 4,
            "type": "fill",
            "paint": {
                "fill-color": "#DDDCDC"
            }
        },
        {
            "id": "fill-vnbusstation-index",
            "source": "vietbando",
            "source-layer": "region_vnbusstation_index",
            "minzoom": 4,
            "type": "fill",
            "paint": {
                "fill-color": "#DDDCDC"
            }
        },
        {
            "id": "fill-vnbuilding-index",
            "source": "vietbando",
            "source-layer": "region_vnbuilding_index",
            "minzoom": 10,
            "type": "fill",
            "filter": [ "!in", "groupcode", 4, 5, 6],
            "paint": {
                "fill-color": "#DDDCDC"
            }
        },
        {
            "id": "fill-vnbuilding-school-index",
            "source": "vietbando",
            "source-layer": "region_vnbuilding_index",
            "minzoom": 12,
            "type": "fill",
            "filter": [ "==", "groupcode", 4 ],
            "paint": {
                "fill-color": "#dbcda2"
            }
        },
        {
            "id": "fill-vnbuilding-hospital-index",
            "source": "vietbando",
            "source-layer": "region_vnbuilding_index",
            "minzoom": 12,
            "type": "fill",
            "filter": [ "==", "groupcode", 5 ],
            "paint": {
                "fill-color": "#eccbcb"
            }
        },
        {
            "id": "fill-vnbuilding-park-index",
            "source": "vietbando",
            "source-layer": "region_vnbuilding_index",
            "minzoom": 12,
            "type": "fill",
            "filter": [ "==", "groupcode", 6 ],
            "paint": {
                "fill-color": "#7A7"
            }
        },
        {
            "id": "fill-vnpark-index",
            "source": "vietbando",
            "source-layer": "region_vnpark_index",
            "minzoom": 3,
            "type": "fill",
            "paint": {
                "fill-color": "#7A7"
            }
        },
        {
            "id": "line-vntunnel-hemlo-index",
            "type": "line",
            "source": "vietbando",
            "source-layer": "line_vntunnel_index",
            "filter": [ "==", "level", 3],
            "minzoom": 13,
            "layout": {
                "visibility": "visible",
                "line-cap": "square",
                "line-join": "round"
            },
            "paint": {
                "line-opacity": 0.5,
                "line-color": "#aaa",
                "line-width": {
                    "base": 1,
                    "stops": [
                        [ 0, 0 ],
                        [ 13, 0.4 ],
                        [ 14, 2 ],
                        [ 15, 4 ],
                        [ 16, 5 ],
                        [ 17, 5 ],
                        [ 18, 7 ],
                        [ 19, 9 ],
                        [ 20, 14 ]
                    ]
                }
            }
        },
        {
            "id": "line-vntunnel-huyenlo-index",
            "type": "line",
            "source": "vietbando",
            "source-layer": "line_vntunnel_index",
            "filter": [ "==", "level", 2 ],
            "minzoom": 9.5,
            "layout": {
                "visibility": "visible",
                "line-cap": "square",
                "line-join": "round"
            },
            "paint": {
                "line-opacity": 0.5,
                "line-color": "#999",
                "line-width": {
                    "base": 1,
                    "stops": [
                        [ 0, 0.1 ],
                        [ 11, 0.5 ],
                        [ 12, 1.5 ],
                        [ 13, 2 ],
                        [ 14, 3 ],
                        [ 15, 5 ],
                        [ 16, 6 ],
                        [ 17, 8 ],
                        [ 18, 10 ],
                        [ 19, 15 ],
                        [ 20, 20 ]
                    ]
                }
            }
        },
        {
            "id": "line-vntunnel-tinhlo-index",
            "type": "line",
            "source": "vietbando",
            "source-layer": "line_vntunnel_index",
            "filter": [ "==", "level", 1 ],
            "minzoom": 6.5,
            "layout": {
                "visibility": "visible",
                "line-cap": "square",
                "line-join": "round"
            },
            "paint": {
                "line-opacity": 0.5,
                "line-color": "#777",
                "line-width": {
                    "base": 1,
                    "stops": [
                        [ 0, 0.2 ],
                        [ 7, 0.4 ],
                        [ 10, 0.8 ],
                        [ 11, 3.2 ],
                        [ 12, 4 ],
                        [ 13, 4.5 ],
                        [ 14, 5 ],
                        [ 15, 6 ],
                        [ 16, 8 ],
                        [ 17, 13 ],
                        [ 18, 17 ],
                        [ 19, 27 ],
                        [ 20, 37 ]
                    ]
                }
            }
        },
        {
            "id": "line-vntunnel-quoclo-index",
            "type": "line",
            "source": "vietbando",
            "source-layer": "line_vntunnel_index",
            "filter": [ "==", "level", 0],
            "minzoom": 5,
            "layout": {
                "visibility": "visible",
                "line-cap": "square",
                "line-join": "round"
            },
            "paint": {
                "line-opacity": 0.5,
                "line-color": "#666",
                "line-width": {
                    "base": 1,
                    "stops": [
                        [ 0, 0.4 ],
                        [ 7, 0.6 ],
                        [ 8, 0.8 ],
                        [ 9, 3.2 ],
                        [ 10, 3.6 ],
                        [ 11, 3 ],
                        [ 12, 4 ],
                        [ 13, 5 ],
                        [ 14, 7 ],
                        [ 15, 8 ],
                        [ 16, 10 ],
                        [ 17, 12 ],
                        [ 18, 18 ],
                        [ 19, 28 ],
                        [ 20, 38 ]
                    ]
                }
            }
        },
        {
            "id": "line-vntunnel-caotoc-index",
            "type": "line",
            "source": "vietbando",
            "source-layer": "line_vntunnel_index",
            "filter": [ "==", "level", -1],
            "minzoom": 5,
            "layout": {
                "visibility": "visible",
                "line-cap": "square",
                "line-join": "round"
            },
            "paint": {
                "line-opacity": 0.5,
                "line-color": "#666",
                "line-width": {
                    "base": 1,
                    "stops": [
                        [ 0, 0.4 ],
                        [ 7, 0.6 ],
                        [ 8, 0.8 ],
                        [ 9, 3.2 ],
                        [ 10, 3.6 ],
                        [ 11, 3 ],
                        [ 12, 4 ],
                        [ 13, 5 ],
                        [ 14, 7 ],
                        [ 15, 8 ],
                        [ 16, 10 ],
                        [ 17, 12 ],
                        [ 18, 18 ],
                        [ 19, 28 ],
                        [ 20, 38 ]
                    ]
                }
            }
        },
        {
            "id": "fill-vntunnel-hemlo-index",
            "type": "line",
            "source": "vietbando",
            "source-layer": "line_vntunnel_index",
            "minzoom": 14,
            "filter": [ "==", "level", 3 ],
            "layout": {
                "visibility": "visible",
                "line-cap": "round",
                "line-join": "round"
            },
            "paint": {
                "line-dasharray": [ 3, 3],
                "line-width": 1,
                "line-color": "#999",
                "line-gap-width": {
                    "base": 1,
                    "stops": [
                        [ 14, 3 ],
                        [ 15, 5 ],
                        [ 16, 6 ],
                        [ 17, 7 ],
                        [ 18, 9 ],
                        [ 19, 11 ],
                        [ 20, 16 ]
                    ]
                }
            }
        },
        {
            "id": "fill-vntunnel-huyenlo-index",
            "type": "line",
            "source": "vietbando",
            "source-layer": "line_vntunnel_index",
            "filter": [ "==", "level", 2 ],
            "minzoom": 13,
            "layout": {
                "visibility": "visible",
                "line-cap": "round",
                "line-join": "round"
            },
            "paint": {
                "line-dasharray": [ 3, 3],
                "line-width": 1,
                "line-color": "#888",
                "line-gap-width": {
                    "base": 0.1,
                    "stops": [
                        [ 13, 3 ],
                        [ 14, 4 ],
                        [ 15, 6 ],
                        [ 16, 8 ],
                        [ 17, 10 ],
                        [ 18, 12 ],
                        [ 19, 17 ],
                        [ 20, 22 ]
                    ]
                }
            }
        },
        {
            "id": "fill-vntunnel-tinhlo-index",
            "type": "line",
            "source": "vietbando",
            "source-layer": "line_vntunnel_index",
            "filter": [ "==", "level", 1 ],
            "minzoom": 12,
            "layout": {
                "visibility": "visible",
                "line-cap": "round",
                "line-join": "round"
            },
            "paint": {
                "line-dasharray": [ 3, 3],
                "line-width": 1,
                "line-color": "#666",
                "line-gap-width": {
                    "base": 1,
                    "stops": [
                        [ 12, 4.4 ],
                        [ 13, 5 ],
                        [ 14, 6 ],
                        [ 15, 7 ],
                        [ 16, 10 ],
                        [ 17, 15 ],
                        [ 18, 19 ],
                        [ 19, 29 ],
                        [ 20, 39 ]
                    ]
                }
            }
        },
        {
            "id": "fill-vntunnel-quoclo-index",
            "type": "line",
            "source": "vietbando",
            "source-layer": "line_vntunnel_index",
            "filter": [ "==", "level", 0 ],
            "minzoom": 11,
            "layout": {
                "visibility": "visible",
                "line-cap": "round",
                "line-join": "round"
            },
            "paint": {
                "line-dasharray": [ 3, 3],
                "line-width": 1,
                "line-color": "#555",
                "line-gap-width": {
                    "base": 1,
                    "stops": [
                        [ 11, 4 ],
                        [ 12, 5 ],
                        [ 13, 6 ],
                        [ 14, 8 ],
                        [ 15, 10 ],
                        [ 16, 12 ],
                        [ 17, 16 ],
                        [ 18, 22 ],
                        [ 19, 32 ],
                        [ 20, 42 ]
                    ]
                }
            }
        },
        {
            "id": "fill-vntunnel-caotoc-index",
            "type": "line",
            "source": "vietbando",
            "source-layer": "line_vntunnel_index",
            "filter": [ "==", "level", -1 ],
            "minzoom": 11,
            "layout": {
                "visibility": "visible",
                "line-cap": "round",
                "line-join": "round"
            },
            "paint": {
                "line-dasharray": [ 3, 3],
                "line-width": 1,
                "line-color": "#444",
                "line-gap-width": {
                    "base": 1,
                    "stops": [
                        [ 11, 4 ],
                        [ 12, 5 ],
                        [ 13, 6 ],
                        [ 14, 8 ],
                        [ 15, 10 ],
                        [ 16, 12 ],
                        [ 17, 16 ],
                        [ 18, 22 ],
                        [ 19, 32 ],
                        [ 20, 42 ]
                    ]
                }
            }
        },
        {
            "id": "line-vnferry-hemlo-index",
            "type": "line",
            "source": "vietbando",
            "source-layer": "line_vnferry_index",
            "filter": [ "==", "level", 3 ],
            "minzoom": 13,
            "layout": {
                "visibility": "visible",
                "line-cap": "square",
                "line-join": "round"
            },
            "paint": {
                "line-color": "#888",
                "line-dasharray": [ 2, 2 ],
                "line-gap-width": {
                    "base": 1,
                    "stops": [
                        [ 0, 0 ],
                        [ 10, 0.2 ],
                        [ 11, 0.4 ],
                        [ 12, 0.6 ],
                        [ 13, 0.8 ],
                        [ 14, 3 ],
                        [ 15, 5 ],
                        [ 16, 6 ],
                        [ 17, 7 ],
                        [ 18, 9 ],
                        [ 19, 12 ]
                    ]
                }
            }
        },
        {
            "id": "line-vnferry-huyenlo-index",
            "type": "line",
            "source": "vietbando",
            "source-layer": "line_vnferry_index",
            "filter": [ "==", "level", 2 ],
            "minzoom": 9.5,
            "layout": {
                "visibility": "visible",
                "line-cap": "square",
                "line-join": "round"
            },
            "paint": {
                "line-color": "#888",
                "line-width": 1,
                "line-dasharray": [ 2, 2 ],
                "line-gap-width": {
                    "base": 1,
                    "stops": [
                        [ 0, 0 ],
                        [ 11, 0.6 ],
                        [ 12, 3 ],
                        [ 13, 4 ],
                        [ 14, 6 ],
                        [ 15, 8 ],
                        [ 16, 10 ],
                        [ 17, 12 ],
                        [ 18, 14 ]
                    ]
                }
            }
        },
        {
            "id": "line-vnferry-tinhlo-index",
            "type": "line",
            "source": "vietbando",
            "source-layer": "line_vnferry_index",
            "filter": [ "==", "level", 1 ],
            "minzoom": 6.5,
            "layout": {
                "visibility": "visible",
                "line-cap": "square",
                "line-join": "round"
            },
            "paint": {
                "line-color": "#666",
                "line-dasharray": [ 3, 3 ],
                "line-gap-width": {
                    "base": 1,
                    "stops": [
                        [ 0, 0.2 ],
                        [ 7, 0.4 ],
                        [ 10, 0.8 ],
                        [ 11, 1.2 ],
                        [ 12, 2.4 ],
                        [ 13, 3 ],
                        [ 14, 4 ],
                        [ 15, 5 ],
                        [ 16, 8 ],
                        [ 17, 13 ],
                        [ 18, 17 ]
                    ]
                }
            }
        },
        {
            "id": "line-vnferry-quoclo-index",
            "type": "line",
            "source": "vietbando",
            "source-layer": "line_vnferry_index",
            "filter": [ "==", "level", 0 ],
            "layout": {
                "visibility": "visible",
                "line-cap": "square",
                "line-join": "round"
            },
            "paint": {
                "line-color": "#666",
                "line-dasharray": [ 3, 3 ],
                "line-gap-width": {
                    "base": 1,
                    "stops": [
                        [ 0, 0.4 ],
                        [ 7, 0.6 ],
                        [ 8, 0.8 ],
                        [ 9, 1.2 ],
                        [ 10, 1.6 ],
                        [ 11, 2 ],
                        [ 12, 3 ],
                        [ 13, 4 ],
                        [ 14, 6 ],
                        [ 15, 8 ],
                        [ 16, 10 ],
                        [ 17, 14 ],
                        [ 18, 20 ]
                    ]
                }
            }
        },
        {
            "id": "line-vnferry-caotoc-index",
            "type": "line",
            "source": "vietbando",
            "source-layer": "line_vnferry_index",
            "filter": [ "==", "level", -1 ],
            "layout": {
                "visibility": "visible",
                "line-cap": "square",
                "line-join": "round"
            },
            "paint": {
                "line-color": "#666",
                "line-dasharray": [ 3, 3 ],
                "line-gap-width": {
                    "base": 1,
                    "stops": [
                        [ 0, 0.4 ],
                        [ 7, 0.6 ],
                        [ 8, 0.8 ],
                        [ 9, 1.2 ],
                        [ 10, 1.6 ],
                        [ 11, 2 ],
                        [ 12, 3 ],
                        [ 13, 4 ],
                        [ 14, 6 ],
                        [ 15, 8 ],
                        [ 16, 10 ],
                        [ 17, 14 ],
                        [ 18, 20 ]
                    ]
                }
            }
        },
        {
            "id": "line-vnroad-hemlo-index",
            "type": "line",
            "source": "vietbando",
            "source-layer": "line_vnroad_index",
            "filter": [ "==", "level", 3 ],
            "minzoom": 12,
            "layout": {
                "visibility": "visible",
                "line-join": "round",
                "line-cap": "round"
            },
            "paint": {
                "line-color": {
                    "base": 1,
                    "stops": [
                        [ 0, "#aaa" ],
                        [ 14, "#aaa" ],
                        [ 15, "#888" ]
                    ]
                },
                "line-width": {
                    "base": 1,
                    "stops": [
                        [ 12, 0.5 ],
                        [ 13, 1 ],
                        [ 14, 2 ],
                        [ 15, 4 ],
                        [ 16, 6 ],
                        [ 17, 8 ],
                        [ 18, 10 ],
                        [ 19, 12 ],
                        [ 20, 14 ]
                    ]
                }
            }
        },
        {
            "id": "line-vnroad-huyenlo-index",
            "type": "line",
            "source": "vietbando",
            "source-layer": "line_vnroad_index",
            "filter": [ "==", "level", 2 ],
            "minzoom": 11,
            "layout": {
                "visibility": "visible",
                "line-join": "round",
                "line-cap": "round"
            },
            "paint": {
                "line-color": {
                    "base": 1,
                    "stops": [
                        [ 0, "#999" ],
                        [ 13, "#999" ],
                        [ 14, "#777" ]
                    ]
                },
                "line-width": {
                    "base": 0.1,
                    "stops": [
                        [ 11, 0.5 ],
                        [ 12, 1 ],
                        [ 13, 2 ],
                        [ 14, 4 ],
                        [ 15, 6 ],
                        [ 16, 8 ],
                        [ 17, 10 ],
                        [ 18, 12 ],
                        [ 19, 14 ],
                        [ 20, 16 ]
                    ]
                }
            }
        },
        {
            "id": "line-vnroad-tinhlo-index",
            "type": "line",
            "source": "vietbando",
            "source-layer": "line_vnroad_index",
            "filter": [ "==", "level", 1 ],
            "minzoom": 6.5,
            "layout": {
                "visibility": "visible",
                "line-join": "round",
                "line-cap": "round"
            },
            "paint": {
                "line-color": {
                    "base": 1,
                    "stops": [
                        [ 0, "#777" ],
                        [ 12, "#777" ],
                        [ 13, "#555" ]
                    ]
                },
                "line-width": {
                    "base": 1,
                    "stops": [
                        [ 0, 0.2 ],
                        [ 7, 0.4 ],
                        [ 10, 0.8 ],
                        [ 11, 3.2 ],
                        [ 12, 4.4 ],
                        [ 13, 5 ],
                        [ 14, 6 ],
                        [ 15, 7 ],
                        [ 16, 10 ],
                        [ 17, 15 ],
                        [ 18, 19 ],
                        [ 19, 29 ],
                        [ 20, 39 ]
                    ]
                }
            }
        },
        {
            "id": "line-vnroad-quoclo-index",
            "type": "line",
            "source": "vietbando",
            "source-layer": "line_vnroad_index",
            "filter": [ "==", "level", 0 ],
            "minzoom": 5,
            "layout": {
                "visibility": "visible",
                "line-join": "round",
                "line-cap": "round"
            },
            "paint": {
                "line-color": {
                    "base": 1,
                    "stops": [
                        [ 0, "#666" ],
                        [ 11, "#666" ],
                        [ 12, "#444" ]
                    ]
                },
                "line-width": {
                    "base": 1,
                    "stops": [
                        [ 0, 0.4 ],
                        [ 7, 0.6 ],
                        [ 8, 0.8 ],
                        [ 9, 3.2 ],
                        [ 10, 3.6 ],
                        [ 11, 4 ],
                        [ 12, 5 ],
                        [ 13, 6 ],
                        [ 14, 8 ],
                        [ 15, 10 ],
                        [ 16, 12 ],
                        [ 17, 16 ],
                        [ 18, 22 ],
                        [ 19, 32 ],
                        [ 20, 42 ]
                    ]
                }
            }
        },
        {
            "id": "line-vnroad-caotoc-index",
            "type": "line",
            "source": "vietbando",
            "source-layer": "line_vnroad_index",
            "filter": [ "==", "level", -1 ],
            "minzoom": 5,
            "layout": {
                "visibility": "visible",
                "line-join": "round",
                "line-cap": "round"
            },
            "paint": {
                "line-color": {
                    "base": 1,
                    "stops": [
                        [ 0, "#555" ],
                        [ 11, "#555" ],
                        [ 12, "#333" ]
                    ]
                },
                "line-width": {
                    "base": 1,
                    "stops": [
                        [ 0, 0.4 ],
                        [ 7, 0.6 ],
                        [ 8, 0.8 ],
                        [ 9, 3.2 ],
                        [ 10, 3.6 ],
                        [ 11, 4 ],
                        [ 12, 5 ],
                        [ 13, 6 ],
                        [ 14, 8 ],
                        [ 15, 10 ],
                        [ 16, 12 ],
                        [ 17, 16 ],
                        [ 18, 22 ],
                        [ 19, 32 ],
                        [ 20, 42 ]
                    ]
                }
            }
        },
        {
            "id": "fill-vnroad-hemlo-index",
            "type": "line",
            "source": "vietbando",
            "source-layer": "line_vnroad_index",
            "minzoom": 12,
            "filter": [ "==", "level", 3 ],
            "layout": {
                "visibility": "visible",
                "line-cap": "round",
                "line-join": "round"
            },
            "paint": {
                "line-color": "#aaa",
                "line-width": {
                    "base": 1,
                    "stops": [
                        [ 12, 0.2 ],
                        [ 13, 0.5 ],
                        [ 14, 1 ],
                        [ 15, 3 ],
                        [ 16, 5 ],
                        [ 17, 7 ],
                        [ 18, 9 ],
                        [ 19, 11 ],
                        [ 20, 13 ]
                    ]
                }
            }
        },
        {
            "id": "fill-vnroad-huyenlo-index",
            "type": "line",
            "source": "vietbando",
            "source-layer": "line_vnroad_index",
            "minzoom": 11,
            "filter": [ "==", "level", 2 ],
            "layout": {
                "visibility": "visible",
                "line-cap": "round",
                "line-join": "round"
            },
            "paint": {
                "line-color": "#999",
                "line-width": {
                    "base": 1,
                    "stops": [
                        [ 11, 0.2 ],
                        [ 12, 0.5 ],
                        [ 13, 1 ],
                        [ 14, 3 ],
                        [ 15, 5 ],
                        [ 16, 7 ],
                        [ 17, 9 ],
                        [ 18, 11 ],
                        [ 19, 13 ],
                        [ 20, 15 ]
                    ]
                }
            }
        },
        {
            "id": "fill-vnroad-tinhlo-index",
            "type": "line",
            "source": "vietbando",
            "source-layer": "line_vnroad_index",
            "minzoom": 12,
            "filter": [ "in", "level", 1 ],
            "layout": {
                "visibility": "visible",
                "line-cap": "round",
                "line-join": "round"
            },
            "paint": {
                "line-color": "#777",
                "line-width": {
                    "base": 1,
                    "stops": [
                        [ 12, 4 ],
                        [ 13, 4.5 ],
                        [ 14, 5 ],
                        [ 15, 6 ],
                        [ 16, 8 ],
                        [ 17, 13 ],
                        [ 18, 17 ],
                        [ 19, 27 ],
                        [ 20, 37 ]
                    ]
                }
            }
        },
        {
            "id": "fill-vnroad-quoclo-index",
            "type": "line",
            "source": "vietbando",
            "source-layer": "line_vnroad_index",
            "minzoom": 11,
            "filter": [ "==", "level", 0 ],
            "layout": {
                "visibility": "visible",
                "line-cap": "round",
                "line-join": "round"
            },
            "paint": {
                "line-color": "#666",
                "line-width": {
                    "base": 1,
                    "stops": [
                        [ 11, 3 ],
                        [ 12, 4 ],
                        [ 13, 5 ],
                        [ 14, 7 ],
                        [ 15, 8 ],
                        [ 16, 10 ],
                        [ 17, 12 ],
                        [ 18, 18 ],
                        [ 19, 28 ],
                        [ 20, 38 ]
                    ]
                }
            }
        },
        {
            "id": "fill-vnroad-caotoc-index",
            "type": "line",
            "source": "vietbando",
            "source-layer": "line_vnroad_index",
            "minzoom": 11,
            "filter": [ "==", "level", -1 ],
            "layout": {
                "visibility": "visible",
                "line-cap": "round",
                "line-join": "round"
            },
            "paint": {
                "line-color": "#555",
                "line-width": {
                    "base": 1,
                    "stops": [
                        [ 11, 3 ],
                        [ 12, 4 ],
                        [ 13, 5 ],
                        [ 14, 7 ],
                        [ 15, 8 ],
                        [ 16, 10 ],
                        [ 17, 12 ],
                        [ 18, 18 ],
                        [ 19, 28 ],
                        [ 20, 38 ]
                    ]
                }
            }
        },
        {
            "id": "line-vnbridge-hemlo-index",
            "type": "line",
            "source": "vietbando",
            "source-layer": "line_vnbridge_index",
            "filter": [ "==", "level", 3 ],
            "minzoom": 13,
            "layout": {
                "visibility": "visible"
            },
            "paint": {
                "line-color": {
                    "base": 1,
                    "stops": [
                        [ 0, "#aaa" ],
                        [ 14, "#aaa" ],
                        [ 15, "#888" ]
                    ]
                },
                "line-width": {
                    "base": 1,
                    "stops": [
                        [ 0, 0 ],
                        [ 13, 0.4 ],
                        [ 14, 3 ],
                        [ 15, 7 ],
                        [ 16, 8 ],
                        [ 17, 9 ],
                        [ 18, 11 ],
                        [ 19, 13 ],
                        [ 20, 18 ]
                    ]
                }
            }
        },
        {
            "id": "line-vnbridge-huyenlo-index",
            "type": "line",
            "source": "vietbando",
            "source-layer": "line_vnbridge_index",
            "filter": [ "==", "level", 2 ],
            "minzoom": 9,
            "layout": {
                "visibility": "visible"
            },
            "paint": {
                "line-color": {
                    "base": 1,
                    "stops": [
                        [ 0, "#999" ],
                        [ 13, "#999" ],
                        [ 14, "#777" ]
                    ]
                },
                "line-width": {
                    "base": 1,
                    "stops": [
                        [ 0, 0.1 ],
                        [ 11, 0.5 ],
                        [ 12, 1.5 ],
                        [ 13, 3 ],
                        [ 14, 4 ],
                        [ 15, 8 ],
                        [ 16, 10 ],
                        [ 17, 12 ],
                        [ 18, 14 ],
                        [ 19, 19 ],
                        [ 20, 24 ]
                    ]
                }
            }
        },
        {
            "id": "line-vnbridge-tinhlo-index",
            "type": "line",
            "source": "vietbando",
            "source-layer": "line_vnbridge_index",
            "minzoom": 6.5,
            "filter": [ "==", "level", 1 ],
            "layout": {
                "visibility": "visible"
            },
            "paint": {
                "line-color": {
                    "base": 1,
                    "stops": [
                        [ 0, "#777" ],
                        [ 12, "#777" ],
                        [ 13, "#555" ]
                    ]
                },
                "line-width": {
                    "base": 1,
                    "stops": [
                        [ 0, 0.2 ],
                        [ 7, 0.4 ],
                        [ 10, 0.8 ],
                        [ 11, 3.2 ],
                        [ 12, 4.4 ],
                        [ 13, 5 ],
                        [ 14, 6 ],
                        [ 15, 10 ],
                        [ 16, 13 ],
                        [ 17, 18 ],
                        [ 18, 22 ],
                        [ 19, 32 ],
                        [ 20, 42 ]
                    ]
                }
            }
        },
        {
            "id": "line-vnbridge-quoclo-index",
            "type": "line",
            "source": "vietbando",
            "source-layer": "line_vnbridge_index",
            "minzoom": 5,
            "filter": [ "==", "level", 0 ],
            "layout": {
                "visibility": "visible"
            },
            "paint": {
                "line-color": {
                    "base": 1,
                    "stops": [
                        [ 0, "#666" ],
                        [ 11, "#666" ],
                        [ 12, "#444" ]
                    ]
                },
                "line-width": {
                    "base": 1,
                    "stops": [
                        [ 0, 0.4 ],
                        [ 7, 0.6 ],
                        [ 8, 0.8 ],
                        [ 9, 3.2 ],
                        [ 10, 3.6 ],
                        [ 11, 4 ],
                        [ 12, 5 ],
                        [ 13, 6 ],
                        [ 14, 8 ],
                        [ 15, 14 ],
                        [ 16, 16 ],
                        [ 17, 20 ],
                        [ 18, 26 ],
                        [ 19, 36 ],
                        [ 20, 46 ]
                    ]
                }
            }
        },
        {
            "id": "line-vnbridge-caotoc-index",
            "type": "line",
            "source": "vietbando",
            "source-layer": "line_vnbridge_index",
            "minzoom": 5,
            "filter": [ "==", "level", -1 ],
            "layout": {
                "visibility": "visible"
            },
            "paint": {
                "line-color": {
                    "base": 1,
                    "stops": [
                        [ 0, "#555" ],
                        [ 11, "#555" ],
                        [ 12, "#333" ]
                    ]
                },
                "line-width": {
                    "base": 1,
                    "stops": [
                        [ 0, 0.4 ],
                        [ 7, 0.6 ],
                        [ 8, 0.8 ],
                        [ 9, 3.2 ],
                        [ 10, 3.6 ],
                        [ 11, 4 ],
                        [ 12, 5 ],
                        [ 13, 6 ],
                        [ 14, 8 ],
                        [ 15, 14 ],
                        [ 16, 16 ],
                        [ 17, 20 ],
                        [ 18, 26 ],
                        [ 19, 36 ],
                        [ 20, 46 ]
                    ]
                }
            }
        },
        {
            "id": "fill-vnbridge-hemlo-index",
            "type": "line",
            "source": "vietbando",
            "source-layer": "line_vnbridge_index",
            "minzoom": 14,
            "filter": [ "==", "level", 3 ],
            "layout": {
                "visibility": "visible"
            },
            "paint": {
                "line-color": "#aaa",
                "line-width": {
                    "base": 1,
                    "stops": [
                        [ 14, 2 ],
                        [ 15, 4 ],
                        [ 16, 5 ],
                        [ 17, 5 ],
                        [ 18, 7 ],
                        [ 19, 9 ],
                        [ 20, 14 ]
                    ]
                }
            }
        },
        {
            "id": "fill-vnbridge-huyenlo-index",
            "type": "line",
            "source": "vietbando",
            "source-layer": "line_vnbridge_index",
            "minzoom": 13,
            "filter": [ "==", "level", 2 ],
            "layout": {
                "visibility": "visible"
            },
            "paint": {
                "line-color": "#999",
                "line-width": {
                    "base": 1,
                    "stops": [
                        [ 13, 2 ],
                        [ 14, 3 ],
                        [ 15, 5 ],
                        [ 16, 6 ],
                        [ 17, 8 ],
                        [ 18, 10 ],
                        [ 19, 15 ],
                        [ 20, 20 ]
                    ]
                }
            }
        },
        {
            "id": "fill-vnbridge-tinhlo-index",
            "type": "line",
            "source": "vietbando",
            "source-layer": "line_vnbridge_index",
            "minzoom": 12,
            "filter": [ "==", "level", 1 ],
            "layout": {
                "visibility": "visible",
                "line-join": "round"
            },
            "paint": {
                "line-color": "#777",
                "line-width": {
                    "base": 1,
                    "stops": [
                        [ 12, 4 ],
                        [ 13, 4.5 ],
                        [ 14, 5 ],
                        [ 15, 6 ],
                        [ 16, 8 ],
                        [ 17, 13 ],
                        [ 18, 17 ],
                        [ 19, 27 ],
                        [ 20, 37 ]
                    ]
                }
            }
        },
        {
            "id": "fill-vnbridge-quoclo-index",
            "type": "line",
            "source": "vietbando",
            "source-layer": "line_vnbridge_index",
            "minzoom": 11,
            "filter": [ "==", "level", 0 ],
            "layout": {
                "visibility": "visible",
                "line-join": "round"
            },
            "paint": {
                "line-color": "#666",
                "line-width": {
                    "base": 1,
                    "stops": [
                        [ 11, 3 ],
                        [ 12, 4 ],
                        [ 13, 5 ],
                        [ 14, 7 ],
                        [ 15, 8 ],
                        [ 16, 10 ],
                        [ 17, 12 ],
                        [ 18, 18 ],
                        [ 19, 28 ],
                        [ 20, 38 ]
                    ]
                }
            }
        },
        {
            "id": "fill-vnbridge-caotoc-index",
            "type": "line",
            "source": "vietbando",
            "source-layer": "line_vnbridge_index",
            "minzoom": 11,
            "filter": [ "==", "level", -1 ],
            "layout": {
                "visibility": "visible",
                "line-join": "round"
            },
            "paint": {
                "line-color": "#555",
                "line-width": {
                    "base": 1,
                    "stops": [
                        [ 11, 3 ],
                        [ 12, 4 ],
                        [ 13, 5 ],
                        [ 14, 7 ],
                        [ 15, 8 ],
                        [ 16, 10 ],
                        [ 17, 12 ],
                        [ 18, 18 ],
                        [ 19, 28 ],
                        [ 20, 38 ]
                    ]
                }
            }
        },
        {
            "id": "line-vnborder-halo-index",
            "type": "line",
            "source": "vietbando",
            "source-layer": "line_vnborder_index",
            "filter": [ "==", "type", 0 ],
            "layout": {
                "visibility": "visible",
                "line-cap": "round",
                "line-join": "round"
            },
            "paint": {
                "line-color": "#fff",
                "line-opacity": 0.4,
                "line-blur": 4,
                "line-width": {
                    "base": 1,
                    "stops": [
                        [ 0, 4 ],
                        [ 20, 16 ]
                    ]
                }
            }
        },
        {
            "id": "line-vnborder-1-1-index",
            "type": "line",
            "source": "vietbando",
            "source-layer": "line_vnborder_index",
            "filter": [
                "all",
                [ "==", "type", 0 ],
                [ "==", "vietnam", 1 ]
            ],
            "layout": {
                "visibility": "visible"
            },
            "paint": {
                "line-color": "#933",
                "line-dasharray": [ 1, 1, 5, 1 ],
                "line-width": {
                    "base": 1,
                    "stops": [
                        [ 0, 1 ],
                        [ 20, 4 ]
                    ]
                }
            }
        },
        {
            "id": "line-vnborder-1-0-index",
            "type": "line",
            "source": "vietbando",
            "source-layer": "line_vnborder_index",
            "filter": [
                "all",
                [ "==", "type", 0 ],
                [ "==", "vietnam", 0 ]
            ],
            "layout": {
                "visibility": "visible"
            },
            "paint": {
                "line-color": "#444",
                "line-dasharray": [ 1, 1, 5, 1 ],
                "line-width": {
                    "base": 1,
                    "stops": [
                        [ 0, 1 ],
                        [ 20, 4 ]
                    ]
                }
            }
        },
        {
            "id": "line-vnborder-2-index",
            "type": "line",
            "source": "vietbando",
            "source-layer": "line_vnborder_index",
            "minzoom": 4,
            "filter": [
                "all",
                [ "==", "type", 1 ],
                [ "==", "vietnam", 1 ]
            ],
            "layout": {
                "visibility": "visible"
            },
            "paint": {
                "line-color": "#444",
                "line-dasharray": [ 1, 1, 3, 1 ],
                "line-width": {
                    "base": 1,
                    "stops": [
                        [ 0, 1 ],
                        [ 20, 2 ]
                    ]
                }
            }
        },
        {
            "id": "line-vnborder-2-conflict-index",
            "type": "line",
            "source": "vietbando",
            "source-layer": "line_vnborder_conflict_index",
            "minzoom": 4,
            "layout": {
                "visibility": "visible"
            },
            "paint": {
                "line-color": "#933",
                "line-dasharray": [ 1, 1, 3, 1 ],
                "line-width": {
                    "base": 1,
                    "stops": [
                        [ 0, 1 ],
                        [ 20, 2 ]
                    ]
                }
            }
        },
        {
            "id": "line-vnborder-3-index",
            "type": "line",
            "source": "vietbando",
            "source-layer": "line_vnborder_index",
            "minzoom": 11,
            "filter": [
                "all",
                [ "==", "type", 2 ],
                [ "==", "vietnam", 1 ]
            ],
            "layout": {
                "visibility": "visible"
            },
            "paint": {
                "line-color": "#444",
                "line-dasharray": [ 1, 1 ]
            }
        },
        {
            "id": "line-vnrailway-line-index",
            "type": "line",
            "source": "vietbando",
            "source-layer": "line_vnrailway_index",
            "minzoom": 11,
            "layout": {
                "visibility": "visible",
                "line-join": "round"
            },
            "paint": {
                "line-color": "#444",
                "line-opacity": {
                    "base": 1,
                    "stops": [
                        [ 11, 0 ],
                        [ 17, 1 ]
                    ]
                },
                "line-width": 1.0,
                "line-gap-width": {
                    "base": 1,
                    "stops": [
                        [ 0, 1 ],
                        [ 20, 4 ]
                    ]
                }
            }
        },
        {
            "id": "line-vnrailway-track-index",
            "ref": "line-vnrailway-line-index",
            "paint": {
                "line-color": "#444",
                "line-opacity": {
                    "base": 1,
                    "stops": [
                        [ 11, 0 ],
                        [ 17, 1 ]
                    ]
                },
                "line-dasharray": [ 0.1, 0.5],
                "line-width": {
                    "base": 1,
                    "stops": [
                        [ 0, 3 ],
                        [ 20, 12 ]
                    ]
                }
            }
        },
        {
            "id": "region_building3d_index",
            "source-layer": "region_building3d_index",
            "source": "building",
            "type": "fill-extrusion",
            "minzoom": 15,
            "paint": {
                "fill-extrusion-color": "#ddd",
                "fill-extrusion-height": {
                    "type": "identity",
                    "property": "height"
                },
                "fill-extrusion-base": {
                    "type": "identity",
                    "property": "base_height"
                },
                "fill-extrusion-opacity": 0.6
            }
        },
        {
            "id": "label_vnmarine_line_index",
            "type": "symbol",
            "source": "vietbando",
            "source-layer": "label_vnmarine_line_index",
            "layout": {
                "text-field": "{name}",
                "text-font": [ "Noto Sans Italic" ],
                "text-transform": "uppercase",
                "text-size": {
                    "stops": [
                        [ 4, 16 ],
                        [ 12, 40 ]
                    ]
                },
                "text-letter-spacing": {
                    "stops": [
                        [ 0, 0.1 ],
                        [ 10, 0.5 ]
                    ]
                },
                "symbol-placement": "line"
            },
            "paint": {
                "text-color": "#000",
                "text-halo-color": "#fff",
                "text-halo-width": {
                    "stops": [
                        [ 8, 1 ],
                        [ 14, 2 ]
                    ]
                },
                "text-halo-blur": 0,
                "text-opacity": {
                    "stops": [
                        [ 0, 0.5 ],
                        [ 10, 1 ]
                    ]
                }
            }
        },
        {
            "id": "label-vnriver-index",
            "type": "symbol",
            "source": "vietbando",
            "source-layer": "label_vnriver_index",
            "layout": {
                "text-field": "{name}",
                "text-font": [ "Noto Sans Medium" ],
                "text-size": {
                    "base": 1,
                    "stops": [
                        [ 8, 8 ],
                        [ 20, 20 ]
                    ]
                },
                "text-pitch-alignment": "viewport",
                "text-letter-spacing": 0.01,
                "symbol-placement": "line",
                "symbol-spacing": 200
            },
            "paint": {
                "text-color": "hsl(205, 57%, 34%)",
                "text-halo-width": 1,
                "text-halo-color": "#FFF"
            }
        },
        {
            "id": "symbol-vnway-left-index",
            "type": "symbol",
            "source": "vietbando",
            "source-layer": "symbol_vnway_index",
            "minzoom": 16,
            "filter": [ "==", "direction", 2 ],
            "layout": {
                "icon-image": "arrow_left",
                "icon-rotation-alignment": "map",
                "icon-padding": 0,
                "symbol-placement": "line",
                "symbol-spacing": 150
            },
            "paint": {}
        },
        {
            "id": "symbol-vnway-right-index",
            "type": "symbol",
            "source": "vietbando",
            "source-layer": "symbol_vnway_index",
            "minzoom": 16,
            "filter": [ "==", "direction", 1 ],
            "layout": {
                "icon-image": "arrow_right",
                "icon-rotation-alignment": "map",
                "icon-padding": 0,
                "symbol-placement": "line",
                "symbol-spacing": 150
            },
            "paint": {}
        },
        {
            "id": "symbol-vnway-no-index",
            "type": "symbol",
            "source": "vietbando",
            "source-layer": "symbol_vnway_index",
            "minzoom": 16,
            "filter": [ "==", "direction", 3 ],
            "layout": {
                "icon-image": "no_entry",
                "icon-rotation-alignment": "viewport",
                "icon-padding": 0,
                "symbol-placement": "line",
                "symbol-spacing": 100
            },
            "paint": {}
        },
        {
            "id": "label-vnroad-hemlo-index",
            "type": "symbol",
            "source": "vietbando",
            "source-layer": "label_vnroad_index",
            "minzoom": 12,
            "filter": [ "==", "level", 3 ],
            "layout": {
                "text-field": "{name}",
                "text-size": {
                    "base": 1,
                    "stops": [
                        [ 0, 8 ],
                        [ 20, 12 ]
                    ]
                },
                "text-font": [ "Noto Sans Medium" ],
                "text-max-angle": 30,
                "text-pitch-alignment": "viewport",
                "text-letter-spacing": 0.01,
                "symbol-placement": "line",
                "symbol-spacing": 100
            },
            "paint": {
                "text-translate-anchor": "viewport",
                "text-halo-width": 2.0,
                "text-halo-color": "#444",
                "text-color": "#fff"
            }
        },
        {
            "id": "label-vnroad-huyenlo-index",
            "type": "symbol",
            "source": "vietbando",
            "source-layer": "label_vnroad_index",
            "minzoom": 10,
            "filter": [ "==", "level", 2 ],
            "layout": {
                "text-field": "{name}",
                "text-size": {
                    "base": 1,
                    "stops": [
                        [ 0, 8 ],
                        [ 20, 14 ]
                    ]
                },
                "text-font": [ "Noto Sans Medium" ],
                "text-transform": "uppercase",
                "text-max-angle": 30,
                "text-pitch-alignment": "viewport",
                "text-letter-spacing": 0.01,
                "symbol-placement": "line",
                "symbol-spacing": 130
            },
            "paint": {
                "text-translate-anchor": "viewport",
                "text-halo-width": 2.0,
                "text-halo-color": "#444",
                "text-color": "#fff"
            }
        },
        {
            "id": "label-vnroad-tinhlo-index",
            "type": "symbol",
            "source": "vietbando",
            "source-layer": "label_vnroad_index",
            "minzoom": 8,
            "filter": [ "==", "level", 1 ],
            "layout": {
                "text-field": "{name}",
                "text-size": {
                    "base": 1,
                    "stops": [
                        [ 0, 8 ],
                        [ 20, 16 ]
                    ]
                },
                "text-font": [ "Noto Sans Medium" ],
                "text-transform": "uppercase",
                "text-max-angle": 30,
                "text-pitch-alignment": "viewport",
                "text-letter-spacing": 0.01,
                "symbol-placement": "line",
                "symbol-spacing": 200
            },
            "paint": {
                "text-translate-anchor": "viewport",
                "text-halo-width": 2.0,
                "text-halo-color": "#444",
                "text-color": "#fff"
            }
        },
        {
            "id": "label-vnroad-quoclo-index",
            "source": "vietbando",
            "source-layer": "label_vnroad_index",
            "type": "symbol",
            "minzoom": 6,
            "filter": [ "==", "level", 0 ],
            "layout": {
                "text-field": "{name}",
                "text-size": {
                    "base": 1,
                    "stops": [
                        [ 0, 8 ],
                        [ 20, 18 ]
                    ]
                },
                "text-font": [ "Noto Sans Medium" ],
                "text-transform": "uppercase",
                "text-max-angle": 30,
                "text-pitch-alignment": "viewport",
                "text-letter-spacing": 0.01,
                "symbol-placement": "line",
                "symbol-spacing": 200
            },
            "paint": {
                "text-translate-anchor": "viewport",
                "text-halo-width": 2.0,
                "text-halo-color": "#444",
                "text-color": "#fff"
            }
        },
        {
            "id": "label-vnroad-caotoc-index",
            "type": "symbol",
            "source": "vietbando",
            "source-layer": "label_vnroad_index",
            "filter": [ "==", "level", -1 ],
            "layout": {
                "text-field": "{name}",
                "text-size": {
                    "base": 1,
                    "stops": [
                        [ 0, 8 ],
                        [ 20, 18 ]
                    ]
                },
                "text-font": [ "Noto Sans Medium" ],
                "text-transform": "uppercase",
                "text-max-angle": 30,
                "text-pitch-alignment": "viewport",
                "text-letter-spacing": 0.01,
                "symbol-placement": "line",
                "symbol-spacing": 200
            },
            "paint": {
                "text-translate-anchor": "viewport",
                "text-halo-width": 2.0,
                "text-halo-color": "#444",
                "text-color": "#fff"
            }
        },
        {
            "id": "label-vnroad-shield1-index",
            "type": "symbol",
            "source": "vietbando",
            "source-layer": "label_vnshield_1_index",
            "layout": {
                "icon-image": "road_red_level1",
                "icon-rotation-alignment": "viewport",
                "symbol-placement": "line",
                "symbol-spacing": 200,
                "text-font": [ "Noto Sans Medium" ],
                "text-size": 9,
                "text-transform": "uppercase",
                "text-rotation-alignment": "viewport",
                "text-pitch-alignment": "viewport",
                "text-field": "{name}"
            },
            "paint": {
                "text-color": "#fff"
            }
        },
        {
            "id": "label-vnroad-shield2-index",
            "type": "symbol",
            "source": "vietbando",
            "source-layer": "label_vnshield_2_index",
            "layout": {
                "icon-image": "road_yellow_level1",
                "icon-rotation-alignment": "viewport",
                "symbol-placement": "line",
                "symbol-spacing": 200,
                "text-font": [ "Noto Sans Medium" ],
                "text-size": 8,
                "text-transform": "uppercase",
                "text-rotation-alignment": "viewport",
                "text-pitch-alignment": "viewport",
                "text-field": "{name}"
            },
            "paint": {
                "text-color": "#000",
                "text-translate-anchor": "viewport",
                "icon-opacity": 1
            }
        },
        {
            "id": "label-vnpoi-hospital-index",
            "source": "vietbando",
            "source-layer": "label_vnpoi_index",
            "type": "symbol",
            "minzoom": 8,
            "filter": [ "==", "groupcode", 5 ],
            "layout": {
                "text-field": "{name}",
                "text-font": [ "Noto Sans Medium" ],
                "text-size": {
                    "base": 1,
                    "stops": [
                        [ 0, 10 ],
                        [ 20, 15 ]
                    ]
                },
                "text-anchor": "top",
                "text-padding": 0,
                "text-letter-spacing": 0.01,
                "text-pitch-alignment": "viewport",
                "text-offset": [ 0,  0.8 ],
                "icon-image": "{categoryco}",
                "icon-padding": 0,
                "icon-allow-overlap": false
            },
            "paint": {
                "text-color": "#933",
                "text-halo-color": "#fff",
                "text-halo-width": 0.3
            }
        },
        {
            "id": "label-vnpoi-park-index",
            "source": "vietbando",
            "source-layer": "label_vnpoi_index",
            "type": "symbol",
            "minzoom": 8,
            "filter": [ "==", "categoryco", 9362 ],
            "layout": {
                "text-field": "{name}",
                "text-font": [ "Noto Sans Medium" ],
                "text-size": {
                    "base": 1,
                    "stops": [
                        [ 0, 10 ],
                        [ 20, 15 ]
                    ]
                },
                "text-anchor": "top",
                "text-padding": 0,
                "text-letter-spacing": 0.01,
                "text-pitch-alignment": "viewport",
                "text-offset": [ 0,  0.8 ],
                "icon-image": "{categoryco}",
                "icon-padding": 0,
                "icon-allow-overlap": false
            },
            "paint": {
                "text-color": "#096009",
                "text-halo-color": "#fff",
                "text-halo-width": 0.5
            }
        },
        {
            "id": "label-vnpoi-index",
            "source": "vietbando",
            "source-layer": "label_vnpoi_index",
            "type": "symbol",
            "minzoom": 8,
            "filter": [
                "all",
                ["!=", "groupcode", 5],
                ["!=", "categoryco", 9362]
            ],
            "layout": {
                "text-field": "{name}",
                "text-font": [ "Noto Sans Medium" ],
                "text-size": {
                    "base": 1,
                    "stops": [
                        [ 0, 10 ],
                        [ 20, 15 ]
                    ]
                },
                "text-anchor": "top",
                "text-padding": 0,
                "text-letter-spacing": 0.01,
                "text-pitch-alignment": "viewport",
                "text-offset": [ 0,  0.8 ],
                "icon-image": "{categoryco}",
                "icon-padding": 0,
                "icon-allow-overlap": false
            },
            "paint": {
                "text-color": "#000",
                "text-halo-color": "#fff",
                "text-halo-width": 0.5
            }
        },
        {
            "type": "symbol",
            "source": "vietbando",
            "source-layer": "label_vnadmin_index",
            "id": "label-vnadmin-10-index",
            "minzoom": 14,
            "layout": {
                "text-field": "{name}",
                "text-letter-spacing": {
                    "base": 1,
                    "stops": [
                        [ 0, 0 ],
                        [ 20, 0.2 ]
                    ]
                },
                "text-font": [ "Noto Sans Medium" ],
                "text-size": {
                    "base": 1,
                    "stops": [
                        [ 14, 10 ],
                        [ 20, 18 ]
                    ]
                }
            },
            "filter": [ "==", "level", 10 ],
            "paint": {
                "text-color": "#613000",
                "text-halo-color": "#fff",
                "text-halo-width": {
                    "base": 1,
                    "stops": [
                        [ 8, 1 ],
                        [ 20, 2 ]
                    ]
                }
            }
        },
        {
            "type": "symbol",
            "source": "vietbando",
            "source-layer": "label_vnadmin_index",
            "id": "label-vnadmin-789-index",
            "minzoom": 13,
            "layout": {
                "text-field": "{name}",
                "text-letter-spacing": {
                    "base": 1,
                    "stops": [
                        [ 0, 0 ],
                        [ 20, 0.2 ]
                    ]
                },
                "text-transform": "uppercase",
                "text-font": [ "Roboto Condensed Bold" ],
                "text-size": {
                    "base": 1,
                    "stops": [
                        [ 13, 10 ],
                        [ 20, 18 ]
                    ]
                }
            },
            "filter": [ "in", "level", 7, 8, 9 ],
            "paint": {
                "text-color": "#613000",
                "text-halo-color": "#fff",
                "text-halo-width": {
                    "base": 1,
                    "stops": [
                        [ 8, 1 ],
                        [ 20, 2 ]
                    ]
                }
            }
        },
        {
            "type": "symbol",
            "source": "vietbando",
            "source-layer": "label_vnadmin_index",
            "id": "label-vnadmin-456-index",
            "minzoom": 9,
            "layout": {
                "text-field": "{name}",
                "text-letter-spacing": {
                    "base": 1,
                    "stops": [
                        [ 0, 0 ],
                        [ 18, 0.2 ]
                    ]
                },
                "text-font": [ "Roboto Condensed Bold" ],
                "text-transform": "uppercase",
                "text-size": {
                    "base": 1,
                    "stops": [
                        [ 6, 10 ],
                        [ 18, 20 ]
                    ]
                }
            },
            "filter": [ "in", "level", 4, 5, 6 ],
            "paint": {
                "text-color": "#613000",
                "text-halo-color": "#fff",
                "text-halo-width": {
                    "base": 1,
                    "stops": [
                        [ 8, 1 ],
                        [ 18, 2 ]
                    ]
                }
            }
        },
        {
            "id": "label-vncities-index",
            "source": "vietbando",
            "source-layer": "label_vncities_index",
            "maxzoom": 13,
            "type": "symbol",
            "layout": {
                "text-field": "{name}",
                "text-font":[ "Roboto Bold" ],
                "text-size": {
                    "base": 1,
                    "stops": [
                        [ 0, 8 ],
                        [ 16, 18 ]
                    ]
                },
                "icon-image": "city_level1",
                "text-anchor": "bottom",
                "icon-offset": [ 0, 6]
            },
            "paint": {
                "text-color": "#000",
                "text-halo-color": "#fff",
                "text-halo-width": 1
            }
        },
        {
            "type": "symbol",
            "source": "vietbando",
            "source-layer": "label_vnadmin_index",
            "id": "label-vnadmin-12-index",
            "minzoom": 5,
            "maxzoom": 12,
            "layout": {
                "text-field": "{name}",
                "text-transform": "uppercase",
                "text-letter-spacing": {
                    "base": 1,
                    "stops": [
                        [ 0, 0 ],
                        [ 12, 0.2 ]
                    ]
                },
                "text-font": [ "Roboto Bold" ],
                "text-size": {
                    "base": 1,
                    "stops": [
                        [ 2, 8 ],
                        [ 12, 18 ]
                    ]
                }
            },
            "filter": [ "in", "level", 1, 2 ],
            "paint": {
                "text-color": "#111",
                "text-halo-color": "#fff",
                "text-halo-width": {
                    "base": 1,
                    "stops": [
                        [ 8, 1 ],
                        [ 12, 2 ]
                    ]
                }
            }
        },
        {
            "id": "label_wcountry_index",
            "source": "vietbando",
            "source-layer": "label_wcountry_index",
            "type": "symbol",
            "minzoom": 20,
            "maxzoom": 20,
            "layout": {
                "text-field": "{name}",
                "text-font": [ "Roboto Bold" ],
                "text-transform": "uppercase",
                "text-size": {
                    "base": 1,
                    "stops": [
                        [ 1, 10 ],
                        [ 10, 30 ]
                    ]
                }
            },
            "paint": {
                "text-color": "#111",
                "text-halo-color": "#fff",
                "text-halo-width": 1
            }
        },
        {
            "type": "symbol",
            "source": "vietbando",
            "source-layer": "label_wcapitals_index",
            "id": "label-wcapitals-index",
            "maxzoom": 11,
            "layout": {
                "visibility": "visible",
                "text-field": "{name}",
                "text-font": [ "Roboto Bold" ],
                "text-size": {
                    "base": 1,
                    "stops": [
                        [ 0, 8 ],
                        [ 10, 18 ]
                    ]
                },
                "icon-image": "capital",
                "text-anchor": "bottom",
                "icon-offset": [ 0, 6 ]
            },
            "paint": {
                "text-color": "#933",
                "text-halo-color": "#fff",
                "text-halo-width": 1
            }
        },
        {
            "type": "symbol",
            "source": "vietbando",
            "source-layer": "label_wmarine_index",
            "id": "label-wmarine-sea-index",
            "minzoom": 4,
            "maxzoom": 14,
            "filter": [ "in", "featurecla", "sea" ],
            "layout": {
                "text-field": "{name}",
                "text-size": {
                    "base": 1,
                    "stops": [
                        [ 0, 10 ],
                        [ 5, 12 ],
                        [ 6, 16 ],
                        [ 7, 20 ],
                        [ 8, 28 ]
                    ]
                },
                "text-letter-spacing": {
                    "base": 1,
                    "stops": [
                        [ 0, 0.1 ],
                        [ 5, 0.2 ],
                        [ 6, 0.4 ],
                        [ 7, 0.8 ],
                        [ 8, 1.2 ]
                    ]
                },
                "text-max-width": 20,
                "text-transform": "uppercase",
                "text-font": [ "Noto Sans Medium" ]
            },
            "paint": {
                "text-color": "#fff"
            }
        },
        {
            "id": "label-vnisland-index",
            "source": "vietbando",
            "source-layer": "label_vnisland_index",
            "type": "symbol",
            "minzoom": 4,
            "layout": {
                "text-field": "{name}",
                "text-font": [ "Noto Sans Medium" ],
                "text-size": {
                    "base": 1,
                    "stops": [
                        [ 4, 10 ],
                        [ 19, 18 ]
                    ]
                }
            },
            "paint": {
                "text-color": "#005291",
                "text-halo-color": "#fff",
                "text-halo-width": 1
            }
        },
        {
            "type": "symbol",
            "source": "vietbando",
            "source-layer": "label_wmarine_index",
            "id": "label-wmarine-ocean-index",
            "filter": [ "in", "featurecla", "ocean" ],
            "maxzoom": 10,
            "layout": {
                "text-field": "{name}",
                "text-font": [ "Noto Sans Italic" ],
                "text-size": {
                    "base": 1,
                    "stops": [
                        [ 0, 8 ],
                        [ 1, 10 ],
                        [ 2, 20 ],
                        [ 3, 30 ]
                    ]
                },
                "text-letter-spacing": {
                    "base": 1,
                    "stops": [
                        [ 0, 0 ],
                        [ 1, 0.1 ],
                        [ 2, 0.2 ],
                        [ 3, 0.4 ]
                    ]
                }
            },
            "paint": {
                "text-color": "#fff"
            }
        },
        {
            "type": "symbol",
            "source": "vietbando",
            "source-layer": "label_wcontient_index",
            "id": "label-wcontient-index",
            "layout": {
                "visibility": "visible",
                "text-field": "{name}",
                "text-font": [ "Noto Sans Italic" ],
                "text-transform": "uppercase",
                "text-size": {
                    "base": 1,
                    "stops": [
                        [ 0, 8 ],
                        [ 1, 10 ],
                        [ 2, 20 ],
                        [ 3, 30 ]
                    ]
                },
                "text-letter-spacing": {
                    "base": 1,
                    "stops": [
                        [ 0, 0 ],
                        [ 1, 0.1 ],
                        [ 2, 0.2 ],
                        [ 3, 0.4 ]
                    ]
                }
            },
            "paint": {
                "text-color": "#000",
                "text-halo-color": "#fff",
                "text-halo-width": {
                    "base": 1,
                    "stops": [
                        [ 0, 1 ],
                        [ 1, 2 ],
                        [ 2, 2 ],
                        [ 3, 2 ]
                    ]
                }
            }
        }
    ]
}
