[
    {
      "type": "circle",
      "x": 10,
      "y": 10,
      "radius": 4,
      "think": 4,
      "color": "#FF0000"
    },
    {
      "type": "circle",
      "x": 4,
      "y": 6,
      "radius": 3,
      "think": 2,
      "color": "black"
    },
    {
      "type": "rectangle",
      "x": 12.2,
      "y": 4,
      "width": 7,
      "height": 2.54,
      "think": 2,
      "color": "green"
    },
    {
      "type": "polygon",
      "think": 1,
      "color": "yellow",
      "data": [
        {"x": 1, "y": 1},
        {"x": 2, "y": 4},
        {"x": 3, "y": 2},
        {"x": 10, "y": 4},
        {"x": 2, "y": 1},
        {"x": 4, "y": 6}
      ]
    }
  ]