{
    "Sự kiện": "Events",
    "Chi tiết đối tượng": "Object details",
    "Thông tin chung": "General info",
    "Hình ảnh": "Image",
    "Thời gian cập nhật": "Update time",
    "Thông tin đặc biệt": "Special info",
    "Họ tên": "Full name",
    "Độ chính xác": "Accuracy",
    "Tên gọi khác": "Other name",
    "Giới tính": "Gender",
    "Ngày sinh": "Date of birth",
    "Địa chỉ": "Address",
    "Quốc tịch": "Nationality",
    "Tỉnh thành": "Province",
    "Quận huyện": "District",
    "Màu mắt": "Eye color",
    "Màu tóc": "Hair color",
    "Ghi chú": "Note",
    "Xóa sự kiện": "Delete event",

    "Bổ sung": "Add to",
    "Bổ sung vào sự cố": "Add to incident",
    "Chọn sự cố": "Select incident",
    "Thêm": "Add",

    "Tạo sự cố": "Add new",
    "Sự cố": "Incidents",

    "Quy trình": "Workflow",
    "Công cụ": "Tool",
    "Chọn lực lượng": "Select forces",
    "Chọn lực lượng tham gia": "Select forces",
    "Bản đồ tác chiến": "Operation map",
    "Nhãn": "Label",
    "Điểm": "Point",
    "Đường": "Line",
    "Vùng": "Polygon",
    "Màu sắc": "Color",
    "Kích thước chữ": "Font size",
    "Nhập tiêu đề": "Input the title",
    "Biểu tượng": "Symbol",

    "Ảnh/ video": "Image/Video",
    "Kích thước ảnh": "Image size",
    "Chọn 1 ảnh/video": "Pick a image/video",
    "Video quá lớn!": "Video too large!",
    "Ảnh quá lớn!": "Image too large!",
    "Ảnh 512 x 512 px": "Image 512 x 512 px",
    "Video nhỏ hơn 10MB": "Video smaller than 10MB",

    "Phong tỏa": "Blockade",
    "Bán kính": "Radius",
    "Bán kính (%0%):": "Radius (%0%):",

    "Lớp dữ liệu": "Layers",
    "Nội dung": "Content",
    "Chọn lớp dữ liệu": "Select layers",
    "Nhập từ khóa để tìm kiếm": "Enter keyword to search",
    "Kết quả tìm kiếm": "Search results",

    "Mô tả": "Description",
    "Kích hoạt": "Trigger",
    "Vào": "In",
    "Ra": "Out",
    "Tin nhắn mẫu": "Message template",
    "Đường chim bay": "Air distance",
    "Đường đi": "Road distance",

    "Xuất bản": "Publish",

    "Rào chắn ảo": "Geofence",
    "Các lực lượng đang di chuyển": "Moving forces",
    "Nhập mô tả": "Enter description",
    "Danh sách theo dõi": "Watch list",
    "Các lực lượng đang tham gia": "Engaged forces",

    "Xe cảnh sát": "Police car",
    "Xe theo dõi": "Tracking vehicle",
    "Thiết bị di động": "Mobile device",
    "Xe máy": "Motorcycle",

    "Xem lịch sử theo dõi": "View tracking history",

    "Độ rộng của đường viền": "Line width",
    "Hút vào đường": "Snap to road",
    "Loại đường": "Line style",
    "Loại mũi tên": "Head style",
    "Nhập từ khóa": "Enter the keyword",
    "Độ trong suốt": "Transparency",
    "Chọn dữ liệu": "Select layers",

    "Thiết lập truy vấn nâng cao": "Setup advanced queries",
    "Có": "Yes",
    "Không": "Not",
    "Và": "And",
    "Hoặc": "Or",
    "Rỗng": "Empty",
    "Không rỗng": "Not empty",
    "Giữa": "Between",
    "Thêm điều kiện": "Add condition",
    "Thêm nhóm": "Add group",
    "Bằng": "Equal",
    "Giống": "Like",
    "Giá trị": "Value",
    "Chọn thuộc tính": "Select property",
    "Chọn toán tử": "Select operator",
    "Tìm kiếm thuộc tính": "Search property",

    "Thiết lập": "Setup",

    "Tạo sự cố mới": "Add new incident",
    "Loại sự cố": "Incident type",
    "Chọn loại sự cố": "Select incident type",
    "Mức độ": "Level",
    "Chọn mức độ": "Select level",
    "Vui lòng điền thông tin mô tả về sự cố ở đây...": "Please enter description of an incident here...",
    "Chọn vị trí": "Select location",
    "Thành phố": "City",

    "Ít nghiêm trọng": "Less critical",
    "Nghiêm trọng": "Critical",
    "Đặc biệt nghiêm trọng": "High Critical",

    "Hiện biển số": "Show vehicle plate",
    "Giám sát hành trình": "Tracking",

    "Quản lý": "Administrator",

    "Tốc độ": "Speed",
    "Vị trí": "Location",
    "Giờ cập nhật": "Update time",
    "Tổ công tác": "Team",
    "Lịch sử di chuyển": "Tracking history",

    "Vụ việc": "Case",
    "Chưa có sắp xếp nào được áp dụng": "No sorts applied to this view",
    "Chọn thuộc tính để sắp xếp": "Pick a field to sort by",
    "Sắp xếp": "Sort",
    "sau đó": "then by",
    "theo": "from",
    "Tăng dần": "Ascending",
    "Giảm dần": "Descending",
    "Hủy bỏ": "Cancel",
    "Chưa có bộ lọc nào được áp dụng": "No filters applied to this view",
    "Thêm bộ lọc": "Add filter",
    "Nhập giá trị": "Enter value",
    "Chọn giá trị": "Select value",
    "Tự động": "Auto",

    "Tài nguyên và tính năng": "Assets and features",
    "Tổng cục đường bộ": "Road Administration Department",
    "Dữ liệu tích hợp": "Integrated Data",
    "Trung tâm thông tin chỉ huy": "C4I2",
    "Giao thông": "Traffic",
    "Bưu chính viễn thông": "Postel",

    "Tìm kiếm vị trí": "Search location",
    "Tìm vị trí": "Search location",

    "Kế hoạch lộ trình": "Route planning",
    "g": "h",
    "ph": "m",
    "gi": "s",
    "Chướng ngại vật": "Blockage",
    "Từ đây": "From here",
    "Đến đây": "To here",
    "Đây là đâu?": "What's here?",
    "Nhanh nhất": "Fastest",
    "Ngắn nhất": "Shortest",
    "Xóa hết": "Clear all",
    "Áp dụng": "Apply",

    "Chọn điểm xuất phát": "Choose starting point",
    "Chọn điểm đi qua": "Choose passing point",
    "Chọn điểm đến": "Choose destination",

    "Vị trí của bạn": "Your location",
    "Nhà riêng": "Your Home",
    "Cơ quan": "Your Company",

    "Kênh liên lạc": "Communication channel",

    "Nhận dạng gương mặt": "Face Recognition",
    "Nhận dạng tổng hợp": "General Detection",
    "Tải ảnh": "Upload",
    "Chọn 1 ảnh...": "Select an image...",

    "Tuổi": "Age",
    "Quốc gia": "Country",
    "Việt Nam": "Vietnam",
    "Mỹ": "United States",
    "Nhật": "Japan",
    "Trung Quốc": "China",
    "Vui lòng chọn ảnh để nhận dạng": "Please select an image to recognition",
    "Không nhận dạng được mặt.": "Can't recognize",

    "Hình gương mặt": "Face image",
    "Người khớp nhất": "Best match",

    "Họ và tên": "Full name",
    "Nhập họ và tên": "Enter full name",

    "Hình toàn cảnh": "Overview image",

    "Thông tin chi tiết": "Detail",
    "Các khả năng": "Candidates",
    "Ảnh cần nhận dạng": "Probe",
    "Kết quả nhận dạng": "Result",

    "Thông tin nhận dạng": "Probe Information",
    "Thời gian": "Time",
    "Vị trí bản đồ": "Location",
    "Quét bởi": "Scaned by",
    "Nhà cung cấp": "Owner",
    "Chi tiết ảnh": "Image detail",
    "Lịch sử nhận dạng": "History of detection",
    "Lịch sử": "History",
    "STT": "No.",

    "Tìm lại": "Search again",
    "So sánh": "Compare",

    "Xóa những mục đã chọn (%0%)": "Delete the selected items (%0%)",

    "Thư viện": "Gallery",
    "Nam": "Female",
    "Nữ": "Male",
    "Khác": "Other",

    "Thêm mới": "Add new",
    "Ngày cập nhật": "Updated date",
    "Thêm/Sửa thư viện": "Add/Update gallery",

    "Tên đầy đủ": "Full name",
    "Tỉnh/Thành phố": "Province",
    "Ảnh chính": "Primary Image",
    "Các ảnh phụ": "Alternative Images",

    "Id cá nhân": "Personal ID",
    "Bí danh": "Alias",
    "Tổ chức": "Organization",
    "Số điện thoại": "Phone number",
    "Màu da": "Skin color",
    "Nơi làm việc": "Workplace",
    "Biệt danh": "Nickname",
    "Vết sẹo/Hình xăm": "Scars/Tattoos",
    "Xác thực": "Verify",
    "Thông tin theo dõi": "WatchList note",
    "Thông tin lưu ý": "Information note",
    "Tên": "Name",
    "Tiền án/Tiền sử": "History",
    "Liên lạc #": "Contact #",
    "Thêm vào danh sách theo dõi": "Add to WatchList",
    "Cập nhật theo dõi": "Update tracking",
    "Xóa theo dõi": "Delete tracking",

    "Thời hạn": "Expire date",
    "Không thời hạn": "Indefinite",

    "Theo dõi": "WatchList",
    "Kênh": "Channel",

    "Người dùng": "User",

    "Nhập Id cá nhân": "Enter personal id",
    "Nhập bí danh": "Enter alias",
    "Nhập tổ chức": "Enter organization",
    "Nhập số điện thoại": "Enter phone number",
    "Nhập email": "Enter email",
    "Chọn giới tính": "Select gender",
    "Nhập địa chỉ": "Enter adrress",
    "Nhập tỉnh thành": "Enter province",
    "Chọn quốc gia": "Select country",

    "Diễn biến": "Events",
    "Nhập diễn biến mới": "Enter new event",
    "Thêm diễn biến": "Add new event",

    "Thêm theo dõi": "Add WatchList",

    "Chiều cao": "Height",
    "Cân nặng": "Weight",
    "Note": "Note",
    "Trạng thái": "Status",
    "Ngày bắt đầu": "Start Date",
    "Ngày kết thúc": "Expire Date",

    "Trực tiếp": "Live view",
    "Tên Camera": "Camera name",

    "Nhóm Camera": "Camera group",
    "Nhập tên nhóm camera": "Enter camera group",

    "Đường dẫn trực tiếp": "Direct Url",
    "Khử trùng lặp sự kiện": "Deduplicate",
    "(Giây)": "(Second)",
    "Ngưỡng tin cậy": "Confidence threshold",
    "Thêm/Sửa camera": "Add/Update camera",
    "Nhập tên camera": "Enter camera name",
    "Nhập đường dẫn trực tiếp": "Enter stream url",
    "Vị trí": "Location",
    "Thêm/Sửa nhóm camera": "Add/Update camera group",
    "Thêm/Sửa danh sách theo dõi": "Add/Update WatchList",
    "Thông tin cơ bản": "General Info",
    "Nhập tên danh sách theo dõi": "Enter WatchList name",
    "Hoạt động": "Active",

    "Nhận dạng biển số xe": "License plate recognition",
    "Phát hiện": "Detect",
    "Thông tin": "Information",
    "Xóa những mục đã chọn": "Delete the selected items",

    "Biển số": "Plate",
    "Chứa trong": "Contains",
    "Nhập biển số": "Input plate number",
    "Hình biển số": "Plage image",

    "Kiểu phát hiện": "Type of detection",
    "Tất cả": "All",
    "Chưa xác định": "Unidentified",
    "Có thể khớp": "Possible match",
    "Khớp tốt": "Good match",
    "Watch list": "WatchList",

    "Dữ liệu": "Data",
    "Khoảng thời gian": "Time range",
    "Cách đây": "Time ago",
    "%0% tiếng": "%0% hours",
    "%0% ngày": "%0% days",
    "Giới hạn": "Limit",
    "%0% dòng": "%0% rows",
    "Bắt đầu": "Start",
    "Kết thúc": "End",

    "Truy vấn không gian": "Spatial query",

    "Xóa thành công": "Delete successfully",
    "Thêm mới thành công": "Add new successfully",
    "Thêm thành công": "Add successfully",
    "Chỉnh sửa thành công": "Update successfully",
    "Cập nhật thành công": "Update successfully",

    "Đã cập nhật nhân viên": "Employee updated",
    "Không thêm được nhân viên": "Failed to add employee",
    "Không xóa được nhân viên": "Failed to delete employee",
    "Cập nhật nhân viên thất bại": "Employee updated failed",

    "Thêm tài khoản mới thành công": "Create account successfully",
    "Thêm mới tài khoản thấy bại": "Failed to create account",
    "Kích hoạt tài khoản thất bại": "Failed to activate account",
    "Tài khoản đã kích hoạt": "Account is activated",
    "Không thể vô hiệu hóa nhân viên": "Unable to disable employee",
    "Nhân viên đã bị vô hiệu hóa": "Employee was disabled",
    "Không thể kích hoạt nhân viên": "Unable to enable employee",
    "Nhân viên đã được kích hoạt": "Employee was enabled",
    "Đặt lại mật khẩu thất bại": "Failed to reset password",
    "Mật khẩu đã được đặt lại thành công": "Password was reset successfully",

    "Hủy sự cố thành công": "Cancel incident successfully",
    "Hủy sự cố thất bại. ": "Cancel incident failed. ",

    "Hoàn thành sự cố thành công": "Complete incident successfully",
    "Hoàn thành sự cố thất bại. ": "Complete incident failed",

    "Đã có bản cập nhật mới, hệ thống tự cập nhật mới...": "A new update is available, the system updates itself ...",
    "Vui lòng bấm vào ": "Please click",
    "để tải xuống": "to download",

    "Camera đang tải": "Camera is loading",
    "Sẽ tự động hiển thị khi có dữ liệu": "Will automatically display when data is available",

    "Để xem được video, vui lòng bật Javascript và xem xét cập nhật phiên bản web bowser mới nhất hỗ trợ HTML5": "\nTo view the video, please enable Javascript and consider updating to the latest version of the web browser that supports HTML5",

    "Tên nhóm camera không được bỏ trống": "Camera is required",
    "Tên danh sách theo dõi không được bỏ trống": "WatchList is required",
    "Theo dõi không được bỏ trống": "WatchList is required",
    "Ngày kết thúc không được bỏ trống": "Expire date is required",
    "SMS không đúng định dạng": "SMS format was wrong",
    "Email không đúng định dạng": "Email format was wrong",
    "Id cá nhân không được bỏ trống": "PersonalId is required",
    "Số điện thoại không đúng định dạng": "Phone number format was wrong",
    "Bạn chưa chọn loại sự cố": "Incident is required",
    "Bạn chưa chọn mức độ": "Level is required",
    "Bạn chưa nhập mô tả": "Description is required",
    "Có lỗi xảy ra, vui lòng thử lại sau.": "An error occur.Try it again.",
    "Chúng tôi không thể tìm thấy chỉ dẫn giữa hai địa điểm": "We could not find directions between the two locations",
    "Không thể xem trực tiếp trên trình duyệt.": "Unable to view directly in the browser.",

    "Bạn có chắc chắn muốn xóa sự kiện này không ?": "Do you really want to delete this event?",
    "Bạn có chắc muốn xóa những Camera đã chọn?": "Do you really want to delete this cameras?",
    "Bạn có chắc chắn muốn xóa những thư viện này?": "Do you really want to delete this galleries?",
    "Bạn có chắc chắn muốn xóa danh sách theo dõi này?": "Do you really want to delete this WatchList?",
    "Bạn có chắc chắn muốn hủy sự cố này?": "Do you really want to cancel this incident?",
    "Bạn có chắc chắn muốn hoàn thành sự cố này?": "Do you really want to complete this incident?",
    "Bạn có thực sự muốn phân công người này không?": "Do you really want to assign this person?",

    "Tháng": "Month",
    "Ngày": "Date",
    "Giờ": "Hour",
    "Phút": "Minute",

    "CN": "Su",
    "T2": "Mo",
    "T3": "Tu",
    "T4": "We",
    "T5": "Th",
    "T6": "Fr",
    "T7": "Sa",

    "Từ": "From",
    "Đến": "To",
    "KIỂU XEM": "VIEWS",
    "Chi tiết": "Detail",
    "Thông báo": "Notification",
    "Tiêu đề": "Title",
    "Tìm": "Search",
    "Tìm kiếm": "Search",
    "Tìm kiếm nâng cao": "Advance search",

    "Gửi": "Send",
    "Hủy": "Cancel",
    "Xóa": "Delete",
    "Hoàn thành": "Complete",
    "Xác nhận": "Confirm",
    "Cập nhật": "Update",
    "Chỉnh sửa": "Update",
    "Tạo": "Create",

    "ĐĂNG NHẬP": "LOGIN",
    "Tiêu chuẩn": "Default",
    "Màu Tối": "Dark",
    "Vệ Tinh": "Satellite",
    "Địa hình": "Terrain",
    "Ranh giới": "Boundary",
    "Tòa nhà 3D": "3D buildings",
    "Tòa vuông": "3D blocks",

    "Ranh giới hành chính": "Administrative boundaries",

    "Tổng khoảng cách: %0% m": "Total distance: %0% m",

    "Biển số xe": "Plate number",
    "Nhập biển số xe": "Enter plate number",
    "Màu xe": "Vehicle color",
    "Nhập màu xe": "Enter vehicle color",
    "Loại xe": "Vehicle type",
    "Nhập loại xe": "Enter vehicle type",
    "Chủ sở hữu": "Owner",
    "Nhập tên chủ sở hữu": "Enter owner name",
    "Ngày sự kiện": "Event date",
    "Mã sự kiện": "Event ID",
    "Giờ GMT": "GMT date time",
    "Chiều cao chữ": "Character height",
    "Mã phát hiện": "Detecting ID",
    "Mã theo dõi": "Tracking ID",
    "Hệ thống": "System",
    "Nguồn": "Source",
    "Múi giờ": "Time zone",
    "Cập nhật": "Update",
    "Người dùng": "User",
    "Nhập người dùng": "Username here",
    "Phiên bản": "Version",

    "Thiết lập hệ thống": "System Configuration",
    "Đăng xuất": "Log out",
    "Trang chủ": "Homepage",

    "Công việc": "Job",
    "Trạng thái công việc": "Duty Status",
    "Loại phương tiện": "Tracker Type",
    "Trạng thái kết nối": "Connection Status",
    "Chức vụ nhân viên": "Employee Type",
    "Nhân viên": "Employee",
    "Công ty": "Organization",
    "Đang làm việc": "On-duty",
    "Đang nghỉ": "Off-duty",
    "Tài xế": "Driver",
    "Kĩ thuật viên": "Technician",
    "Quản lý": "Senior Technician",
    "Trực tuyến": "Online",
    "Ngoại tuyến": "Offline",
    "Ngắt kết nối": "Disconnected",

    "Giám sát chất lượng camera": "Camera Monitoring",
    "Logs hệ thống": "System logs",
    "Nhật ký hoạt động": "Activity logs",
    "Trạng thái chất lượng": "Quality condition",
    "Trạng thái tín hiệu": "Signal condition",
    "Không có dữ liệu": "No data",
    "Tốt": "Good",
    "Kém": "Bad",
    "Hỏng": "Broken",
    "%0% giờ": "%0% hours",
    "%0% ngày": "%0% days",
    "Chất lượng %0% giờ": "Condition in %0% hours",
    "Chất lượng %0% ngày": "Condition in %0% days",

    "Chế độ xem phố": "Street view",

    "Mặc định": "Default",
    "Xanh tối": "Dark blue",
    "Thép tối": "Dark steel",
    "Đỏ sáng": "Light red",
    "Đỏ tối": "Dark red",
    "Xanh lá": "Green",
    "Tím": "Purple",
    "Xám tối": "Dark gray",
    "Xám sáng": "Light gray",
    "Giao diện màu tối": "Dark theme",
    "Giao diện màu sáng": "Light theme",

    "Face": "Gương mặt",
    "LPR": "Biển số",
    "Object": "Đối tượng",

    "Loại": "Type",
    "Ngày Tạo": "Created At",
    "Trước": "Before",
    "Sau": "After",
    "Hành Động": "Action",
    "Thay Đổi": "Change",
    "Xem đầy đủ": "Show full",
    "Xem rút gọn": "Show less",

    "Không tìm thấy trang": "Page not found",
    "Không có quyền truy cập": "You are not authorized to access",
    "Đăng nhập lại": "Login again",
    "Quay lại trang trước": "Go back",

    "--------------------------------": "FFMS START",

    "Điền địa chỉ...": "Enter Address...",
    "Điền tên thành phố...": "Enter City Name...",
    "Điền tên quốc gia...": "Enter Country...",
    "Không tìm thấy dữ liệu": "No data was found",
    "Giao cho": "Assigned to",
    "Chưa phân công": "Unassigned",
    "Khách hàng": "Customer",
    "Thời gian dự kiến": "Estimated time",
    "Điểm đến": "Destination",
    "Sau": "After",
    "Trước": "Before",
    "Thời gian thực hiện": "Duration",
    "Khoảng cách": "Distance",
    "Không có dữ liệu vị trí": "No location data",
    "Tạo mới công việc": "Job created",
    "bởi": "by",
    "Nhập giá trị cần tìm": "Enter keyword to search",
    "Chi tiết địa điểm": "View detail",

    "Đã tải lên thành công!": "Upload successfully!",
    "Đã tải tập tin lên": "File uploaded",
    "Vui lòng kiểm tra kết quả nhập liệu": "Please check your import status.",
    "Đã thực hiện tác vụ nhập liệu": "Import started",

    "Bạn có chắc chắn muốn ĐẶT LẠI MẬT KHẨU cho tài khoản nhân viên này không?":  "Do you really want to RESET PASSWORD for this employee?",
    "Mật khẩu mới": "New password",
    "Cấp mật khẩu mới": "Set new password",
    "Mật khẩu": "Password",
    "Nhập mật khẩu": "Enter password",
    "Xác nhận mật khẩu": "Confirm Password",
    "Nhập lại mật khẩu": "Enter confirm password",
    "Đặt lại": "Reset",
    "Sau khi bạn đặt mật khẩu mới, người dùng sẽ không thể đăng nhập bằng mật khẩu trước đó của họ nữa": "Once you set new password, the user will no longer be able to login using their previous password",
    "Mật khẩu xác nhận không trùng khớp":"Confirm password does not match",

    "Khóa tài khoản nhân viên": "Disable employee",
    "Nhân viên này sẽ không thể đăng nhập vào hệ thống": "This employee will be blocked for logging into system",
    "Khóa": "Disable",
    "Bạn có chắc chắn muốn KHÓA TÀI KHOẢN của nhân viên '%0%' không?": "Do you really want to DISABLE this employee '%0%'?",
    "Nhân viên '%0%' đang được giao %1% công việc":"This employee '%0%' was assigned to %1% job(s)",
    "Tạo tài khoản nhân viên": "Create account",
    "Tạo tài khoản": "Create",
    "Một khi bạn tạo tài khoản cho nhân viên thì bạn không thể xóa nhân viên đó. Thay vào đó bạn chỉ có thể khóa tài khoản": "Once you create an account for an employee, you cannot delete the employee. Instead, you can just disable the account",

    "Thông tin tài khoản": "Account Information",
    "(Đang tạm khóa)": "(Disabled)",
    "(Đang hoạt động)": "(Activated)",
    "(Chưa kích hoạt)": "(In-activated)",
    "Sao chép vào bộ nhớ": "Copy to clipboard",

    "Bạn có chắc chắn muốn KÍCH HOẠT tài khoản của nhân viên này không?": "Do you really want to ACTIVATE ACCOUNT for this employee?",
    "Kích hoạt tài khoản nhân viên": "Activate Employee",
    "Một khi tài khoản được kích hoạt, nhân viên này sẽ có thể đăng nhập vào hệ thống và có thể truy xuất tới những chức năng được cấp quyền": "Once you click on activate, this employee will be able to log into the system and have access to authorized features",
    "Kích hoạt ngay": "Activate now",
    "Nhân viên này sẽ có thể đăng nhập lại vào hệ thống và có thể truy xuất tới những chức năng được cấp quyền": "Once you disable account, this employee will be able to log into the system and have access to authorized features",
    "Mở khóa tài khoản nhân viên": "Enable Employee",
    "Mở khóa": "Enable",

    "Bạn có chắc chắn muốn MỞ KHÓA TÀI KHOẢN của nhân viên '%0%' không?": "Do you really want to ENABLE ACCOUNT for this employee '%0%'?",
    "Đã sao chép vào bộ nhớ": "Copied to clipboard",

    "Chọn một công việc...": "Select a job...",
    "Phân công cho": "Assign to",
    "Chọn một nhân viên để phân công": "Select employee to assign this job to",
    "Ghi chú công việc": "Job Notes",
    "Bạn có chắc chắn muốn xóa công việc \"%0%\" không?": "Do you really want to delete the job \"%0%\"?",
    "Bạn có chắc chắn muốn xóa thông tin nhân viên '%0%' không?": "Do you really want to delete employee '%0%' information?",

    "Không thể tạo công việc mới": "Failed to add new job",
    "Đã tạo công việc": "Create job successfully",
    "Cập nhật thông tin công việc không thành công": "Failed to update job information",
    "Đã cập nhật thông tin công việc": "Update job successfully",
    "Đã xóa công việc thành công": "Job was deleted successfully",
    "Xóa công việc thất bại": "Unable to delete job",
    "Thêm khách hàng mới...": "Create new customer...",
    "Chọn một khách hàng...": "Select a customer...",
    "Đã lưu thông tin khách hàng": "Customer information was saved successfully",

    "PHÂN CÔNG (%0%)": "ASSIGN JOBS (%0%)",
    "Phân công công việc": "Assign Jobs To Employee",
    "Danh sách công việc": "Jobs",
    "Danh sách công việc đã chọn": "Selected Jobs",
    "Danh sách nhân viên phù hợp": "Available Employees",
    "Phân công ngay": "Assign now",
    "Đã hoàn tất phân công nhân viên cho các công việc được chọn": "Selected jobs was successfully assigned to employee",
    "Tác vụ không thể được thực hiện": "Unable to procceed this action",
    "Không có thông tin nhân viên": "Employee info is missing",
    "Vui lòng chọn ít nhất một công việc để thực hiện phân công công việc": "Please select at least one job to assign to employee",
    "Không có nhân viên nào đủ điều kiện nhập công việc này": "No one is eligible to accept these jobs",

    "Lọc dữ liệu": "Filter by",
    "QUẢN LÝ NHÂN VIÊN": "EMPLOYEE MANAGEMENT",
    "Danh sách khách hàng": "Customers",
    "QUẢN LÝ KHÁCH HÀNG": "CUSTOMER MANAGEMENT",
    "Quản lý công việc": "Job management",
    "Nhập danh sách công việc": "Import manager",
    "Nhập liệu": "Import",
    "Nhập liệu (thử nghiệm)": "Import excel (under-construction)",
    "Thông tin thêm": "More detail",
    "Hồ sơ": "Profile",
    "Tài khoản": "Account",

    "ngày sinh": "Dob",
    "Kiểu": "Type",
    "Đội": "Team",
    "Ca": "Shift",
    "Xe": "Vehicle",
    "Điện thoại": "Phone",

    "Chưa có thời gian dự kiến": "No estimated time",
    "Không có địa chỉ": "No address",
    "(*) Vui lòng chọn một nhân viên": "(*) Please select an employee",
    "Chọn một nhân viên": "Select an employee name",
    "Tên nhân viên": "Full Name",
    "Loại nhân viên": "Worker Type",
    "Tên người dùng": "Username",
    "Nhóm": "Team",
    "Trạng thái nhân viên": "Status",

    "Lịch trình": "Tracking History",
    "Hướng": "Direction",
    "Phân công vào lúc": "Assigned Time",
    "Loại công việc": "Job Type",
    "Tên công việc": "Job Name",
    "Ngày bắt đầu": "Start Date",
    "Ngày hoàn thành": "Completed Date",
    "Chọn một giá trị": "Select one value",
    "Chọn ngày bắt đầu công việc": "Select start date",
    "Chọn ngày hoàn thành công việc": "Select completed date",
    "Chọn ngày phân công công việc": "Select assigned date",

    "Chọn bang": "Select state",
    "Chọn quận": "Select district",
    "Chọn thị trấn": "Select tehsil",
    "Nhập bang": "Enter state",
    "Nhập quận": "Enter district",
    "Nhập thị trấn": "Enter tehsil",
    "Nhập làng": "Enter tehsil",
    "Bang": "State",
    "Quận": "District",
    "Thị trấn": "Tehsil",
    "Làng": "Village",

    "Thay đổi thông tin công việc": "Edit job",
    "Tạo công việc mới": "Create new job",
    "Nhập tên khách hàng": "Enter customer's name",
    "Tạo khách hàng mới": "Create new customer",
    "Thay đổi thông tin khách hàng": "Edit customer",
    "Nhập số liên lạc": "Contact Number here",
    "Số liên lạc": "Contact Number",
    "Tên khách hàng": "Customer Name",
    "Thông tin khách hàng": "Customer infomation",
    "Thông tin công việc": "Job infomation",
    "Địa điểm": "Location",
    "Địa điểm công việc": "Job Location",
    "Địa điểm khách hàng": "Customer Location",
    "Loại khách hàng": "Customer Type",
    "Điện thoại khác hàng": "Contact No.",
    "Chọn loại khách hàng": "Select customer Type",
    "Đã tạo khách hàng": "Create customer successfully",
    "Đã xóa khách hàng thành công": "Customer was deleted successfully",
    "Đã xóa khách hàng thất bại": "Unable to delete customer",
    "Bạn có chắc chắn muốn xóa khách hàng này không?": "Do you really want to delete this customer?",
    "Xác thực dữ liệu không thành công": "Data validation failed",
    "Vui lòng xem lý do cụ thể ở từng ô nhập dữ liệu": "Please check each fields for more detail",
    "Chọn tập tin...": "Upload...",
    "Bắt đầu nhập": "Start import",
    "Ngày tải lên": "Upload date",
    "Tổng số dữ liệu": "Total Rows",
    "Tổng số lỗi": "Total Fails",
    "Nhập liệu thành công": "Success",
    "Nhập liệu thất bại": "Import failed",
    "Chờ xử lý": "Processing",
    "Nhập file thành công": "Import successfully",
    "Vui lòng kiểm tra trạng thái dòng trong bảng": "Please check import status on the list below",
    "Thành công": "Success",
    "Lỗi dữ liệu": "Data error",
    "Lỗi Geocode": "Geocode failed",
    "Chưa xử lý": "Not import",
    "Lọc danh sách file nhập liệu":"Filter import files by",
    "Tải lại danh sách": "Refresh",
    "Tải tập tin mẫu": "Download template",
    "Trạng thái nhập liệu": "Import Status",
    "Tải lên bởi": "Upload by",
    "Tải lên lúc": "Uploaded at",
    "Tải lên vào ngày": "Uploaded on",
    "Ngày nhập liệu": "Imported at",
    "Ngày sửa": "Modified date",
    "Ngày tạo": "Created date",
    "vào lúc": "on",
    "Xóa (chỉ xóa tập tin, không xóa dữ liệu)": "Remove file (excel file only, not the import data)",
    "Tải tập tin này": "Download this file",
    "Bạn có chắc chắn muốn xóa tập tin này không?": "Do you really want to delete this file?",
    "Xuất danh sách": "Export...",
    "Chỉ xuất danh sách dữ liệu bên dưới (có áp dụng bộ lọc)": "Export only filtered data below",
    "Nhập Số điện thoại": "Enter contact number",
    "Nhập tên công việc": "Enter job title here",
    "Chọn loại công việc...": "Select a job type...",
    "Công việc trước": "Select a previous job",
    "Số phòng": "Room number",
    "Phòng": "Room",
    "Tầng lầu": "Floor",
    "Khu": "Block",
    "Tòa nhà": "Building",
    "Số tòa nhà": "Building number",
    "Đường/xá": "Street",
    "Nhập số phòng": "Enter room number",
    "Nhập tầng lầu": "Enter floor",
    "Nhập khu": "Enter block",
    "Nhập tòa nhà": "Enter building",
    "Nhập số tòa nhà": "Enter building number",
    "Nhập đường/xá": "Enter street name",
    "Mốc thời gian": "Timeline",

    "LỰA CHỌN BỘ LỌC": "FILTER OPTION",
    "TRẠNG THÁI": "STATUS",
    "THỜI GIAN": "TIME",
    "CÔNG VIỆC VÀO": "JOBS ON",
    "GIÁM SÁT": "MONITORING",
    "Tải lên tập tin EXCEL": "IMPORT EXCEL",
    "TẠO CÔNG VIỆC": "CREATE JOB",
    "TẠO NHÂN VIÊN": "CREATE EMPLOYEE",
    "TẠO KHÁCH HÀNG": "CREATE CUSTOMER",
    "BÁO CÁO CÔNG VIỆC": "JOB REPORT",

    "Trường này là bắt buộc": "This field is required",
    "Trường này là định dạng không hợp lệ": "This field is invalid format",
    "Trường này phải lớn hơn %0%": "This field must be greater than %0%",
    "Trường này phải nhỏ hơn %0%": "This field must be less than %0%",
    "Trường này phải có độ dài tối đa %0% ký tự": "This field must have maximum %0% characters length",
    "Trường này phải có độ dài tối thiểu %0% ký tự": "This field must have minimum %0% characters length",
    "Chỉ các chữ cái thường và số, ít nhất %0% ký tự, nhưng không giới hạn.": "Only lowercase letters and numbers, at least %0% characters, but no limit.",
    "Email hợp lệ chỉ có thể chứa: chữ cái latin, số, '@' và '.'": "Valid e-mail can contain only: latin letters, numbers, '@' and '.'",
    "Tối thiểu %0% ký tự, chứa ít nhất một số, danh sách các ký tự được sử dụng:\n%1%": "Minimum %0% characters, contain at least 1 number, list of characters used:\n%1%",
    "-- không tên --": "-- Empty name --",
    "Đang tải...": "Loading...",
    "Chữ ký": "Signature",
    "Xem báo cáo công việc": "View Job Report",
    "Không tìm thấy dữ liệu lịch sử cho": "No history data found for",

    "Công việc đã tạo": "Job created",
    "Công việc được phân công cho": "Job assigned to",
    "Công việc đã bắt đầu": "Job started",
    "Công việc đã hoàn thành": "Job completed",
    "Công việc đã hủy bỏ": "Job cancelled",

    "Mới": "New",
    "Chưa kích hoạt": "Inactive",
    "Đã kích hoạt": "Active",
    "Vô hiệu hóa": "Disabled",
    "Thao tác": "Actions",

    "Mã": "Id",
    "Chọn": "Select",
    "Mã người dùng": "User ID",
    "Mã trường hợp": "Case ID",
    "Trường hợp": "Case",
    "Mã tờ công việc": "Jobsheet ID",
    "Tờ công việc": "Jobsheet",
    "Tạo bởi": "Created by",
    "Mã công việc": "Job ID",
    "Phân công": "Assigned",
    "Đã tạo": "Created",
    "Thời gian khởi hành dự kiến": "estimated depart time",
    "Thời gian bắt đầu dự kiến": "estimated start time",
    "Ứớc tính trước hoàn thành": "estimated completed before time",
    "Ước tính sau hoàn thành": "estimated completed after time",
    "Ước tính khoảng cách": "estimated distance",
    "Thời gian khởi hành": "Depart time",
    "Mã khách hàng": "Customer ID",
    "Sđt khách hàng": "Customer No",
    "Mã pin": "Pincode",
    "Thời gian ước tính": "estimated duration",
    "Thời hạn công việc": "job duration",
    "Kiểu công việc": "Job Type",
    "Kiểu nhân viên": "Employee Type",
    "dòng": "rows",
    "Ẩn tất cả": "Hide all" ,
    "Hiện tất cả": "Show all",
    "Cột hiển thị": "Columns",
    "Đang xem  %0% - %1% / %2% kết quả": "Showing %0% - %1% / %2% results",
    "Không dữ liệu vị trí": "No location data",
    "Kiểu khách hàng": "Customer type",
    "Nhập họ tên": "Enter contact name",
    "Chọn kiểu khách hàng...": "Select a customer type...",
    "Địa điểm làm việc": "Job location",
    "Đã có dữ liệu": "Updated",
    "Lỗi nhập liệu": "Import error",
    "Danh sách báo cáo": "REPORT LIST",
    "Nhập tên báo cáo cần tìm": "Enter report name to search",
    "Tên liên lạc": "Contact name",
    "Địa chỉ công việc": "Job Address",
    "Mở trình quản lý Nhập (để thử nghiệm)": "Open Import manager (for testing)",
    "Bạn có chắc chắn muốn xóa": "Do you really want to delete",
    "Xóa file thành công": "Delete file successfully",
    "Tài khoản %0% đã tồn tại": "Username: %0% is exist",
    "Tài khoản '%0%' đã tồn tại": "Username: '%0%' is exist",
    "Tên người dùng này đã tồn tại": "This username already exists",
    "Chọn loại nhân viên...": "Select type employee...",
    "Chọn đội cho nhân viên...": "Select team for employee...",
    "Chọn ca cho nhân viên...": "Select shift for employee...",
    "Chọn tổ chức cho nhân viên...": "Select organization for employee...",
    "Chọn ngày sinh": "Select date of birth",
    "Email này đã tồn tại": "This email already exists",
    "Số điện thoại này đã tồn tại": "This phone number already exists",
    "Phương tiện": "Vehicle",
    "Tải tập tin CSV": "Download as CSV",
    "Tải tập tin GPX": "Download as GPX",
    "Tự động chạy lại": "Auto Replay",

    "Tạo nhóm mới": "Create new group",
    "Thêm thành viên": "Add new member",
    "Tên nhóm": "Group name",
    "Tùy chỉnh": "Settings",
    "Rời nhóm": "Leave group",

    "Sửa thông tin": "Change info",

    "Bạn có chắc chắn muốn lưu báo cáo '%0%'?": "Do you really want to save report '%0%'?",
    "Không có kiểu nhân viên": "No employee type",
    "Không có đội": "No team",
    "Chọn danh sách công việc với trạng thái mới khi giao cho nhân viên": "Select the job list with the new status when assigning to the employee",
    "Lựa chọn không hợp lệ. Loại công việc phải là duy nhất.": "Selection is invalid. Job type must be unique.",
    "Công việc %0% có trạng thái không phù hợp \n": "Job %0% has status is not suitable \n",
    "Thông tin dữ liệu chưa đúng": "Data information is not correct",
    "Chi tiết: ": "Detail:",
    "Di chuyển bản đồ theo": "Pan map along with tracker",
    "Tài khoản '%0%' không tạo được": "Create account '%0%' failed",
    "Bạn có thay đổi chưa lưu. Bạn có muốn lưu những thay đổi này trước khi tắt không?":"You have unsaved changes on this form. Do you want to save them first before closing?",
    "Không, vẫn đóng": "No, close anyway",
    "Có, lưu và đóng": "Yes, save and close",
    "Bạn có thay đổi chưa lưu. Bạn có thực sự muốn tắt không?": "You have unsaved changes on this form. Do you really want to close it?",
    "Không, giữ nguyên cửa sổ": "No, keep open and stay",
    "Xác nhận đóng": "Yes, close anyway",
    "Bạn chưa được phân quyền thực hiện tác vụ này": "You are not authorized to perform this action",
    "Xem chi tiết": "View detail",
    "Lịch trình nhân viên": "Worker tracking",
    "Danh sách nhân viên": "List Worker",
    "Không có mã": "No TrackerId",
    "Ngày cập nhật cuối cùng" : "Last updated date",
    "Mã người theo dõi": "TrackerId",
    "Chưa cập nhật": "No update",
    "Nhân viên ": "Worker",
    "Thiết bị": "Device",
    "Chưa có thiết bị": "No device",
    "Chưa có phương tiện": "No vehicle",
    "Xóa tất cả bộ lọc": "Clear all filters",
    "Không thể hủy %0% công việc": "Unable to cancel %0% jobs",
    "Công việc theo ngày": "Jobs on date",
    "Bảng tổng quan": "Dashboard",
    "Báo cáo": "Report",
    "Quản lý khách hàng": "Customer management",
    "Quản lý nhân viên": "Employee management",
    "Lớp dữ liệu trên bản đồ": "Map layer switcher",
    "Chuyển đổi ngôn ngữ": "Change language",
    "Màu giao diện": "Theme",
    "Người được giao": "Assignee",
    "Chức năng chỉ dành cho công việc chưa phân công": "Only available on unassigned job",
    "Loại bộ lọc": "TYPE OF FILTER",
    "Bộ lọc": "Filter",
    "Đang xuất excel...": "Exporting",
    "Xuất excel": "Export",
    "Bảng điều khiển": "DASHBOARD",
    "Làm mới cài đặt theo thời gian": "Refresh interval setting",
    "Hiển thị cột rỗng": "Display null column",
    "phút": "minutes",
    "Ngày cập nhật mới nhất":"Last updated",
    "Nhóm theo": "Group By",
    "Tổng": "Total",
    "Hôm nay": "Today",
    "Không có dữ liệu phân tích": "Nothing to analyze",
    "Ngày ": "Day",
    "Ngày trong tuần": "Day of Week",
    "Tuần": "Week",
    "Giờ trong ngày": "Hour of Day",
    "Ki-lô-mét": "Kilometers",
    "tỷ lệ Ki-lô-mét trên công việc": "kilometers per jobs",
    "tỷ lệ giờ trên công việc" :"hours per jobs",
    "Chọn %0%...": "Select %0%...",
    "Tạo dữ liệu cho lớp %0%": "Create data for layer %0%",
    "Chỉnh sửa %0%": "Update %0%",
    "Đã tạo dữ liệu thành công": "Data entered successfully",
    "Chỉnh sửa dữ liệu thành công": "Update data successfully",
    "Nhấp để đặt vị trí": "Click to set location...",
    "Tìm kiếm địa chỉ hoặc tọa độ...": "Search for an address or coordinates...",
    "Lớp dữ liệu này không được phép thêm mới": "Feature is not supported for this layer",
    "Lớp dữ liệu này không được phép xóa": "Feature is not supported for this layer",
    "Bạn có chắc chắn muốn xóa dữ liệu \"%0%\" không?": "Do you really want to delete \"%0%\"?",
    "Đã xóa dữ liệu thành công": "Data was deleted successfully",

    "Chủ đề": "Theme",
    "Hiển thị dữ liệu": "Column toggle",
    "Thông tin cá nhân": "Profile",
    "Đăng nhập": "Login",

    "Đường không được bỏ trống": "Address is required",
    "Tỉnh/Thành phố không được bỏ trống": "Province is required",
    "Ngày bắt đầu không được lớn hơn ngày kết thúc": "Start date can't be greater than end date",
    "Gương mặt": "Face",
    "Mặt nạ": "Mask",
    "Chung cho tất cả đối tượng": "All Objects",
    "Điều kiện %0% (%1%)": "Conditon %0% (%1%)",
    "Kiểu tìm kiếm": "Search type",
    "Theo biển số": "By Plate",
    "Theo Mac": "By Mac",
    "Từ ngày": "From date",
    "Đến ngày": "To date",
    "Số lần khớp": "Match times",

    "Bạn đang nhập liệu, bạn có chắc chắn muốn thoát ?": "Your data is changed, do you want to exit ?",
    "Cảnh báo": "Warning",
    "Đồng ý": "Ok"
}
