[
  {
    "name": "logo-vbd",
    "path": [
      {
        "d": "M12 0c6.627,0 12,5.373 12,12 0,6.627 -5.373,12 -12,12 -6.627,0 -12,-5.373 -12,-12 0,-6.627 5.373,-12 12,-12z",
        "fill": "white"
      },
      {
        "d": "M18.82 21.202c0,0 5.262,-3.915 4.294,-11.155 0,0 -0.169,-1.81 -1.81,-4.04 0,0 -2.063,-1.474 -5.473,-1.264 0,0 5.851,2.442 5.893,8.966 0,0 -0.463,-7.156 -8.208,-8.46 0,0 -1.221,0.381 -3.031,1.705 0,0 5.009,0 7.619,3.388 0,0 4.378,4.882 0.716,10.86zm-13.644 -18.416c0,0 -5.243,4.437 -4.294,11.155 0,0 0.169,1.81 1.81,4.041 0,0 2.063,1.474 5.472,1.263 0,0 -5.85,-2.442 -5.893,-8.966 0,0 0.463,7.156 8.208,8.461 0,0 1.221,-0.381 3.031,-1.706 0,0 -5.009,0 -7.619,-3.388 0,0 -4.378,-4.882 -0.715,-10.86z",
        "fill": "#494949"
      },
      {
        "d": "M2.948 18.753c0,0 3.915,5.262 11.155,4.294 0,0 1.81,-0.169 4.041,-1.81 0,0 1.473,-2.063 1.263,-5.473 0,0 -2.442,5.851 -8.966,5.893 0,0 7.156,-0.463 8.461,-8.208 0,0 -0.382,-1.221 -1.706,-3.03 0,0 0,5.009 -3.388,7.619 0,0 -4.882,4.377 -10.86,0.715zm18.244 -13.477c0,0 -4.099,-5.393 -11.155,-4.294 0,0 -1.81,0.169 -4.041,1.811 0,0 -1.473,2.062 -1.263,5.472 0,0 2.442,-5.851 8.966,-5.893 0,0 -7.155,0.463 -8.46,8.208 0,0 0.381,1.221 1.706,3.031 0,0 0,-5.009 3.387,-7.619 0,0 4.883,-4.378 10.86,-0.716z",
        "fill": "#B91E23"
      },
      {
        "d": "M8.94 10.358c0.195,0.029 0.351,0.111 0.479,0.248l0 0c0.208,0.224 0.36,0.422 0.454,0.592l2.429 4.344 0.157 -0.022 0.038 -0.006 2.39 -4.122c0.01,-0.017 0.015,-0.025 0.025,-0.042 0.055,-0.085 0.157,-0.216 0.305,-0.383l0 -0.001c0.234,-0.265 0.472,-0.451 0.71,-0.56 0.028,-0.012 0.015,-0.009 0.045,-0.017 0.07,-0.021 0.133,-0.032 0.19,-0.032l0.08 0 0 -0.264 -2.367 0 0 0.264 0.08 0c0.242,0.001 0.425,0.058 0.56,0.167l0 0c0.134,0.111 0.197,0.245 0.198,0.427 0,0.12 -0.03,0.23 -0.091,0.338l0 -0.001 -1.717 2.946 -1.654 -2.945 0 0c-0.05,-0.086 -0.087,-0.155 -0.111,-0.207 -0.018,-0.038 -0.03,-0.068 -0.035,-0.084l0 -0.001c0.048,-0.177 0.147,-0.324 0.303,-0.45l0 0c0.159,-0.126 0.352,-0.189 0.593,-0.19l0.079 0 0 -0.264 -3.222 0 0 0.254 0.057 0.008c0.008,0.001 0.016,0.002 0.025,0.003zm0.84 0.203c-0.067,-0.078 -0.138,-0.146 -0.212,-0.203l0 -0.001 1.353 0c-0.222,0.2 -0.359,0.406 -0.405,0.625l-0.002 0.013 0.001 0.013c0.02,0.154 0.067,0.295 0.14,0.423l0 0 1.885 3.326 0.006 0.024 0.006 0.032 -0.012 0.047 -0.147 0.255 -2.277 -4.067 -0.001 -0.001c-0.098,-0.172 -0.203,-0.323 -0.312,-0.457 -0.008,-0.009 -0.016,-0.02 -0.023,-0.029zm4.952 -0.204l0.478 0c-0.104,0.155 -0.186,0.281 -0.248,0.379l-0.001 0c-0.048,-0.144 -0.125,-0.271 -0.229,-0.378l0 -0.001z",
        "fill": "#A6A8AB"
      },
      {
        "d": "M8.806 10.362c0.185,0.032 0.334,0.112 0.457,0.244l0 0c0.208,0.224 0.36,0.422 0.455,0.592l2.429 4.344 0.194 -0.028 2.396 -4.132c0.007,-0.012 0.01,-0.016 0.017,-0.029 0.054,-0.085 0.157,-0.217 0.307,-0.386l0 -0.001c0.237,-0.267 0.476,-0.454 0.716,-0.563 0.075,-0.027 0.149,-0.046 0.229,-0.046l0.08 0 0 -0.264 -2.366 0 0 0.264 0.079 0c0.243,0.001 0.425,0.058 0.56,0.167l0 0c0.134,0.111 0.197,0.245 0.198,0.427 0,0.12 -0.03,0.23 -0.091,0.338l0 -0.001 -1.717 2.946 -1.654 -2.945 0 0c-0.049,-0.086 -0.087,-0.155 -0.111,-0.207 -0.018,-0.036 -0.029,-0.065 -0.034,-0.082l0 -0.005c0.048,-0.176 0.146,-0.323 0.302,-0.448l0 0c0.159,-0.126 0.352,-0.189 0.593,-0.19l0.079 0 0 -0.264 -3.222 0 0 0.254c0.034,0.005 0.069,0.009 0.104,0.015zm0.816 0.198c-0.066,-0.077 -0.137,-0.145 -0.211,-0.203l1.354 0c-0.222,0.199 -0.36,0.406 -0.405,0.625l-0.002 0.013 0.001 0.013c0.02,0.154 0.067,0.295 0.141,0.423l-0.001 0 1.885 3.326 0.006 0.024 0.006 0.032 -0.012 0.047 -0.147 0.255 -2.277 -4.067 -0.001 -0.001c-0.098,-0.172 -0.203,-0.325 -0.313,-0.459 -0.007,-0.008 -0.017,-0.019 -0.024,-0.028zm4.954 -0.203l0.478 0c-0.104,0.155 -0.187,0.281 -0.249,0.38 -0.048,-0.144 -0.125,-0.271 -0.229,-0.379l0 -0.001z",
        "fill": "#494949"
      }
    ]
  },
  {
    "name": "",
    "path": [
      {
        "d": "",
        "fill": ""
      },
      {
        "d": "",
        "fill": ""
      }
    ]
  },
  {
    "name": "",
    "path": [
      {
        "d": ""
      }
    ]
  },
  {
    "name": "",
    "path": [
      {
        "d": ""
      }
    ]
  }
]