module bai_tap

go 1.17

require (
	github.com/golang/protobuf v1.2.0 // indirect
	github.com/google/go-querystring v1.1.0 // indirect
	github.com/hashicorp/go-cleanhttp v0.5.1 // indirect
	github.com/hashicorp/go-retryablehttp v0.6.8 // indirect
	github.com/hashicorp/logutils v1.0.0 // indirect
	github.com/json-iterator/go v1.1.11 // indirect
	github.com/modern-go/concurrent v0.0.0-20180306012644-bacd9c7ef1dd // indirect
	github.com/modern-go/reflect2 v1.0.1 // indirect
	github.com/plouc/go-gitlab-client v2.0.0-beta.5+incompatible // indirect
	github.com/sendgrid/rest v2.6.5+incompatible // indirect
	github.com/sendgrid/sendgrid-go v3.10.2+incompatible // indirect
	github.com/sunshine69/golang-tools/utils v0.0.0-20211220044450-fe9f51356515 // indirect
	github.com/xanzy/go-gitlab v0.52.2 // indirect
	golang.org/x/crypto v0.0.0-20211115234514-b4de73f9ece8 // indirect
	golang.org/x/net v0.0.0-20210903162142-ad29c8ab022f // indirect
	golang.org/x/oauth2 v0.0.0-20181106182150-f42d05182288 // indirect
	golang.org/x/time v0.0.0-20191024005414-555d28b269f0 // indirect
	google.golang.org/appengine v1.3.0 // indirect
	gopkg.in/yaml.v2 v2.4.0 // indirect
)
