<?xml version="1.0" encoding="UTF-8"?>
<svg width="177px" height="176px" viewBox="0 0 177 176" version="1.1" xmlns="http://www.w3.org/2000/svg" xmlns:xlink="http://www.w3.org/1999/xlink">
    <title>6AEDFB50-4BCA-42D6-859E-F719D3920F60@1x</title>
    <g id="Product-management" stroke="none" stroke-width="1" fill="none" fill-rule="evenodd">
        <g id="1.-Listing---Empty" transform="translate(-690.000000, -241.000000)" fill-rule="nonzero">
            <g id="Illustration" transform="translate(690.000000, 90.000000)">
                <g id="FnD_nodata" transform="translate(0.000000, 151.000000)">
                    <rect id="Rectangle" fill="#0E1738" x="0" y="169.824561" width="176.441103" height="1"></rect>
                    <polygon id="Path" fill="#E8E9FD" points="80.8673684 52.4647619 80.8673684 86.6369925 48.63599 86.6369925 48.63599 44.7322306 73.1304261 44.7322306"></polygon>
                    <path d="M80.8673684,52.4647669 L75.0668672,52.4647669 C74.5536971,52.4659335 74.0611437,52.2628983 73.6978632,51.9004453 C73.3345827,51.5379923 73.1304261,51.0459032 73.1304261,50.5327318 L73.1304261,44.7322306 L80.8673684,52.4647669 Z" id="Path" fill="#CFD7FE"></path>
                    <path d="M64.47599,69.5222055 C64.263033,69.5153008 64.0615559,69.4240228 63.9159394,69.268478 C63.770323,69.1129331 63.692513,68.9058816 63.6996491,68.6929323 L63.840802,64.7230075 C63.8575626,64.2806045 64.2275289,63.9342531 64.6700752,63.9466667 C65.5955568,63.9799913 66.4499585,63.4524569 66.8347749,62.6101131 C67.2195913,61.7677694 67.0590161,60.7765528 66.4279438,60.0987811 C65.7968715,59.4210094 64.8196194,59.1901995 63.9519922,59.5140045 C63.0843649,59.8378094 62.4972796,60.6524416 62.4645614,61.5779449 C62.4499445,62.0213229 62.0786663,62.3689026 61.6352882,62.3542857 C61.1919101,62.3396689 60.8443305,61.9683906 60.8589474,61.5250125 C60.9263778,59.4759581 62.5690274,57.8290737 64.6179014,57.7563676 C66.6667754,57.6836616 68.4220283,59.2099685 68.6345312,61.2490893 C68.8470341,63.28821 67.4442011,65.1436305 65.4243609,65.4949373 L65.3140852,68.7326316 C65.3107208,68.9495011 65.2197483,69.1557815 65.0618781,69.3045118 C64.9040079,69.4532422 64.6926748,69.5317655 64.47599,69.5222055 L64.47599,69.5222055 Z" id="Path" fill="#CFD7FE"></path>
                    <path d="M65.7860652,72.3408521 C65.7714001,72.8626789 65.4432115,73.3240484 64.9550681,73.5090732 C64.4669246,73.6940979 63.9153748,73.5661823 63.5585041,73.1851816 C63.2016335,72.8041809 63.1100264,72.2454522 63.3265485,71.7704402 C63.5430706,71.2954282 64.0248965,70.9980843 64.5465664,71.0175439 C65.2517402,71.046233 65.8035096,71.6353106 65.7860652,72.3408521 L65.7860652,72.3408521 Z" id="Path" fill="#CFD7FE"></path>
                    <polygon id="Path" fill="#E8E9FD" points="32.7430576 33.1400501 45.8173434 64.7097744 16.0340852 77.0430075 0 38.3274185 22.6329825 28.953985"></polygon>
                    <path d="M32.7430576,33.1400501 L27.3792481,35.3455639 C26.904948,35.5424136 26.3717933,35.5423395 25.8975479,35.345358 C25.4233025,35.1483765 25.0469894,34.7706961 24.8517293,34.2957393 L22.6462155,28.9363409 L32.7430576,33.1400501 Z" id="Path" fill="#CFD7FE"></path>
                    <polygon id="Rectangle" fill="#CFD7FE" transform="translate(22.911036, 51.519973) rotate(-157.500000) translate(-22.911036, -51.519973) " points="20.4937932 43.4610253 25.3282794 43.4610253 25.3282794 59.5789201 20.4937932 59.5789201"></polygon>
                    <polygon id="Rectangle" fill="#CFD7FE" transform="translate(22.907295, 51.520961) rotate(-67.500000) translate(-22.907295, -51.520961) " points="20.4900523 43.4620138 25.3245386 43.4620138 25.3245386 59.5799085 20.4900523 59.5799085"></polygon>
                    <path d="M54.9702256,11.0275689 C54.5623212,11.1652864 54.1195938,10.9488418 53.9777444,10.5423559 L52.7250125,6.90766917 C52.6563917,6.71176228 52.6690835,6.49653407 52.7602535,6.31004987 C52.8514236,6.12356568 53.0134777,5.98135906 53.2102256,5.91518797 C54.3537781,5.51066468 54.9560317,4.25861266 54.5582627,3.11269327 C54.1604938,1.96677387 52.912017,1.35714325 51.7637706,1.74814406 C50.6155242,2.13914488 49.9985379,3.38400292 50.3827569,4.53453634 C50.5204743,4.94244073 50.3040298,5.38516815 49.8975439,5.52701754 C49.701637,5.59563838 49.4864088,5.5829466 49.2999246,5.49177655 C49.1134404,5.4006065 48.9712337,5.23855237 48.9050627,5.04180451 C48.2580549,3.1615489 49.1764456,1.1012477 51.0073632,0.32554111 C52.8382809,-0.450165475 54.9572533,0.3232933 55.8579317,2.09607607 C56.75861,3.86885885 56.1337994,6.03632146 54.4276692,7.05764411 L55.4554386,10.0350877 C55.593156,10.4429921 55.3767115,10.8857195 54.9702256,11.0275689 L54.9702256,11.0275689 Z" id="Path" fill="#E8E9FD"></path>
                    <path d="M57.1404511,13.1095739 C57.3079047,13.5885999 57.1698329,14.1213283 56.7907835,14.4587125 C56.411734,14.7960966 55.8665915,14.871483 55.4102064,14.6496291 C54.9538213,14.4277752 54.6763565,13.9525103 54.7075251,13.4460174 C54.7386936,12.9395245 55.0723378,12.5018659 55.5524812,12.3376441 C55.8654216,12.2293797 56.2085557,12.24989 56.5063712,12.3946614 C56.8041868,12.5394329 57.0322785,12.7966018 57.1404511,13.1095739 L57.1404511,13.1095739 Z" id="Path" fill="#E8E9FD"></path>
                    <path d="M87.6603509,18.9674185 C87.4270938,18.8873159 87.2354104,18.7175016 87.1277725,18.4956021 C87.0201347,18.2737025 87.0054302,18.0180402 87.0869173,17.7852632 L88.5778446,13.4580451 C88.7448538,12.9721524 89.2740005,12.7135024 89.76,12.8802005 C91.1418893,13.3523853 92.6450921,12.6160556 93.1190838,11.234785 C93.5930755,9.85351451 92.8587125,8.34934995 91.478063,7.87355212 C90.0974136,7.39775429 88.5922899,8.13014947 88.1146867,9.51017544 C87.9478109,9.99740409 87.4175545,10.2571014 86.9303258,10.0902256 C86.4430972,9.92334975 86.1833999,9.39309331 86.3502757,8.90586466 C87.1236349,6.66784995 89.4966439,5.409583 91.783095,6.02516049 C94.0695461,6.64073797 95.4900633,8.92032974 95.0352584,11.2441083 C94.5804535,13.5678869 92.4053546,15.1437524 90.0555388,14.8519298 L88.8336842,18.3807519 C88.7561786,18.6143498 88.5888954,18.8074997 88.3687589,18.9175679 C88.1486224,19.0276362 87.8937326,19.0455728 87.6603509,18.9674185 Z" id="Path" fill="#E8E9FD"></path>
                    <circle id="Oval" fill="#E8E9FD" cx="86.7472682" cy="22.0551378" r="1.48651629"></circle>
                    <path d="M158.382356,58.5122807 C156.00584,56.1348262 156.006347,52.2810499 158.383489,49.904221 C160.760631,47.5273922 164.614407,47.5273922 166.991549,49.904221 C169.36869,52.2810499 169.369198,56.1348262 166.992682,58.5122807 C165.851038,59.6543754 164.302366,60.2960355 162.687519,60.2960355 C161.072672,60.2960355 159.524,59.6543754 158.382356,58.5122807 L158.382356,58.5122807 Z M159.167519,57.7271178 C161.114502,59.6659328 164.263888,59.6615191 166.20543,57.7172545 C168.146971,55.77299 168.146971,52.6236014 166.20543,50.6793369 C164.263888,48.7350724 161.114502,48.7306587 159.167519,50.6694737 C158.229046,51.6040089 157.701485,52.8738762 157.701485,54.1982957 C157.701485,55.5227152 158.229046,56.7925825 159.167519,57.7271178 Z" id="Shape" fill="#E8E9FD"></path>
                    <path d="M150.927719,65.1861654 L158.35589,57.753584 L159.141053,58.5343358 L151.70406,65.9713283 C151.600617,66.0750335 151.46016,66.1333165 151.313684,66.1333165 C151.167208,66.1333165 151.026752,66.0750335 150.923308,65.9713283 L150.923308,65.9713283 C150.708034,65.7531614 150.710007,65.4018998 150.927719,65.1861654 L150.927719,65.1861654 Z" id="Path" fill="#E8E9FD"></path>
                    <path d="M147.235689,138.770927 C150.923308,139.600201 157.786867,136.031679 158.810226,131.003108 C159.767419,126.314185 158.920501,121.131228 163.190376,117.624461 C167.460251,114.117694 173.159298,101.859449 171.844812,99.8215539 C169.934837,96.8749875 160.605514,100.02005 156.847318,104.431078 C153.089123,108.842105 154.478596,111.77985 151.840802,115.105764 C149.203008,118.431679 145.56391,122.304561 143.967118,127.416942 C142.370326,132.529323 147.235689,138.770927 147.235689,138.770927 Z" id="Path" fill="#5FD284"></path>
                    <path d="M147.681203,138.845915 C148.259048,137.081504 149.167719,135.339148 150.477794,134.267268 C151.468508,133.49474 152.560956,132.862426 153.724311,132.38817 C155.546065,131.563308 157.116391,130.848722 158.739649,127.844812 C158.920907,127.508702 159.1258,127.185886 159.352782,126.878797 C159.237017,128.263503 159.051518,129.641492 158.796992,131.007519 C157.826566,135.859649 151.448221,139.322306 147.681203,138.845915 Z" id="Path" fill="#38C092"></path>
                    <path d="M139.247318,166.004612 L139.247318,166.004612 C139.343432,166.028151 139.444994,166.011285 139.52834,165.957944 C139.611687,165.904602 139.66954,165.819442 139.688421,165.722306 C139.741353,165.453233 145.228672,138.815038 159.149875,112.573835 C159.227154,112.398604 159.156327,112.193425 158.987408,112.103181 C158.818489,112.012937 158.608563,112.068124 158.505865,112.229774 C144.527318,138.56802 139.022356,165.307669 138.969424,165.576742 C138.931072,165.771054 139.054201,165.960635 139.247318,166.004612 Z" id="Path" fill="#38C092"></path>
                    <path d="M149.55589,148.276692 C147.125414,145.506566 148.563409,137.725514 151.40411,135.400902 C154.244812,133.076291 157.222256,133.746767 160.027669,128.537343 C162.60812,123.746967 172.537343,120.597494 173.34015,121.35619 C174.879599,122.816241 172.987268,131.329524 168.902657,134.306967 C162.259649,139.159098 163.146266,144.200902 159.692431,147.165113 C155.175539,151.033584 149.55589,148.276692 149.55589,148.276692 Z" id="Path" fill="#5FD284"></path>
                    <path d="M141.377845,166.533935 C141.572528,166.581271 141.7691,166.463328 141.818947,166.269273 C145.753584,150.491028 160.098246,134.712782 160.239398,134.558396 C160.377041,134.409791 160.368154,134.177742 160.219549,134.0401 C160.070944,133.902458 159.838895,133.911345 159.701253,134.05995 C159.555689,134.218747 145.087519,150.129323 141.108772,166.092832 C141.061713,166.288872 141.182001,166.486065 141.377845,166.533935 Z" id="Path" fill="#38C092"></path>
                    <path d="M120.526917,44.966015 C119.56593,45.9281279 118.119908,46.2164193 116.863429,45.6963995 C115.606951,45.1763798 114.787595,43.9505144 114.787595,42.5906767 C114.787595,41.230839 115.606951,40.0049736 116.863429,39.4849538 C118.119908,38.9649341 119.56593,39.2532254 120.526917,40.2153383 C121.837695,41.5276509 121.837695,43.6537025 120.526917,44.966015 Z" id="Path" fill="#0E1738"></path>
                    <path d="M116.451128,45.3365414 C115.497069,44.4786323 115.094007,43.164441 115.403015,41.9191499 C115.712023,40.6738589 116.682708,39.7005507 117.927161,39.3881828 C119.171613,39.0758148 120.486887,39.4753282 121.347368,40.4270677 C122.01366,41.0903796 122.381585,41.9961118 122.36661,42.9361663 C122.351636,43.8762209 121.95505,44.769775 121.26797,45.4115288 C119.901683,46.6944967 117.763696,46.6613042 116.437895,45.3365414 L116.451128,45.3365414 Z M116.451128,45.3365414 C117.272964,46.1575897 118.470396,46.4778252 119.592363,46.1766183 C120.71433,45.8754114 121.590378,44.9985226 121.890508,43.8762674 C122.190639,42.7540122 121.869255,41.5568878 121.047419,40.7358396 C120.129711,39.8175655 118.753656,39.533324 117.54722,40.0128296 C116.340784,40.4923352 115.535297,41.6436445 115.498346,42.9413534 C115.475968,43.8362823 115.820148,44.7015117 116.451128,45.3365414 L116.451128,45.3365414 Z" id="Shape" fill="#0E1738"></path>
                    <ellipse id="Oval" fill="#FF5F81" transform="translate(115.924964, 44.528307) rotate(-45.000000) translate(-115.924964, -44.528307) " cx="115.924964" cy="44.5283072" rx="3.43177945" ry="3.68320802"></ellipse>
                    <path d="M119.759398,49.4035088 C119.759398,54.2027068 116.230576,58.0932331 111.872481,58.0932331 C107.514386,58.0932331 103.989975,51.1679198 103.989975,48.1904762 C103.989975,43.3912782 108.211328,40.7270175 112.565013,40.7270175 C116.918697,40.7270175 119.759398,44.6175439 119.759398,49.4035088 Z" id="Path" fill="#0E1738"></path>
                    <path d="M108.449524,61.8426065 C104.479599,63.2232581 100.950777,67.7092732 94.0078195,77.6340852 C94.0078195,77.6340852 96.0765915,78.0443108 101.00812,79.2573434 L110.205113,69.4075188 L108.449524,61.8426065 Z" id="Path" fill="#FFC3BD"></path>
                    <path d="M108.449524,61.8426065 L116.861353,61.8426065 L122.882406,63.2982456 C124.74386,66.8270677 121.294436,80.9423559 124.342456,93.6461153 C124.342456,93.6461153 109.296441,96.1824561 101.471278,93.6461153 C101.471278,93.6461153 105.0001,88.0793985 103.284211,80.0336842 C101.784461,73.0113283 101.078697,69.5354386 103.690025,64.8906266 L108.449524,61.8426065 Z" id="Path" fill="#FF5F81"></path>
                    <path d="M118.581654,50.881203 C118.07268,50.4774739 117.352684,50.4774739 116.843709,50.881203 L116.843709,48.962406 C116.841275,46.4086145 114.770334,44.3396491 112.216541,44.3396491 C108.37718,44.3396491 105.264744,47.4520668 105.264744,51.2914286 L105.264744,53.9380451 C105.259291,56.1199485 106.482368,58.1191762 108.427469,59.1077694 L108.427469,62.9321303 L116.861353,61.8646617 L116.861353,54.6482206 C118.396391,55.0099248 119.662356,51.7898747 118.581654,50.881203 Z" id="Path" fill="#FFC3BD"></path>
                    <path d="M108.427469,59.1077694 L108.427469,60.316391 C114.130927,61.5603008 115.758596,56.6640602 115.758596,56.6640602 C112.842907,59.9899749 109.59198,59.5488722 108.427469,59.1077694 Z" id="Path" fill="#FF847F"></path>
                    <path d="M122.882406,63.2982456 C121.22386,63.9069674 120.129925,70.5190977 121.65614,73.0422055 L126.927318,83.6286717 L126.362707,92.0493233 C130.301754,93.8578446 130.015038,92.5610025 130.015038,92.5610025 C130.015038,92.5610025 132.017644,87.4883208 132.017644,82.4906266 C132.017644,79.0720802 126.433283,64.7274185 122.882406,63.2982456 Z" id="Path" fill="#FFC3BD"></path>
                    <circle id="Oval" fill="#0E1738" cx="111.4799" cy="51.4678697" r="1"></circle>
                    <circle id="Oval" fill="#0E1738" cx="107.412932" cy="51.4678697" r="1"></circle>
                    <path d="M108.90386,51.6090226 C108.727419,52.15599 108.484812,52.6632581 108.286316,53.1749373 C108.237874,53.2974026 108.196634,53.4225954 108.162807,53.5498747 C108.13193,53.6733835 108.109875,53.7968922 108.162807,53.8365915 C108.340984,54.0420566 108.537335,54.2310265 108.749474,54.401203 C108.453787,54.3418326 108.178639,54.2065389 107.951078,54.0086216 C107.913287,53.9681664 107.884696,53.9200139 107.867268,53.8674687 C107.859113,53.8207711 107.859113,53.7730133 107.867268,53.7263158 C107.85801,53.6457119 107.85801,53.5643131 107.867268,53.4837093 C107.898649,53.3331528 107.942923,53.1855746 107.999599,53.0426065 C108.211694,52.5139164 108.518091,52.0281652 108.90386,51.6090226 L108.90386,51.6090226 Z" id="Path" fill="#FF847F"></path>
                    <path d="M112.842907,50.7621053 C112.451545,50.4937154 112.029503,50.2730692 111.585764,50.1048622 C111.137132,49.9752734 110.664621,49.9511195 110.205113,50.0342857 C110.394768,49.8431149 110.635005,49.7099899 110.897644,49.6505263 C111.170513,49.5879277 111.455081,49.59858 111.722506,49.6814035 C112.237511,49.8580642 112.64779,50.2538057 112.842907,50.7621053 Z" id="Path" fill="#0E1738"></path>
                    <path d="M105.749975,50.7621053 C105.942448,50.25206 106.353722,49.8553591 106.870376,49.6814035 C107.136282,49.5985338 107.419444,49.5878771 107.690827,49.6505263 C107.954186,49.7080934 108.19493,49.8414996 108.383358,50.0342857 C107.923851,49.9511195 107.451339,49.9752734 107.002707,50.1048622 C106.560804,50.2740678 106.140338,50.4946644 105.749975,50.7621053 L105.749975,50.7621053 Z" id="Path" fill="#0E1738"></path>
                    <path d="M116.892231,53.5763409 C117.134837,53.3293233 117.412732,52.967619 117.178947,52.795589 L117.081905,52.6985464 C117.044699,52.6592226 117.013487,52.614634 116.989273,52.5662155 C116.939123,52.4736765 116.903422,52.3740111 116.883409,52.2706767 C116.843592,52.0685598 116.852666,51.8598533 116.909875,51.6619549 C116.943774,51.5438663 117.011192,51.4381427 117.10396,51.357594 C117.19909,51.2928752 117.307694,51.2506404 117.421554,51.2340852 C117.626495,51.1943421 117.83866,51.2174035 118.030276,51.3002506 C118.222911,51.3915467 118.36396,51.5650209 118.414035,51.7722306 C118.454013,51.9568243 118.454013,52.1478373 118.414035,52.3324311 C118.369925,51.9751378 118.237594,51.6090226 117.946466,51.5384461 C117.802189,51.4981797 117.649641,51.4981797 117.505363,51.5384461 C117.441714,51.5522179 117.380665,51.576042 117.324511,51.6090226 C117.287051,51.6517451 117.261226,51.7033958 117.249524,51.7589975 C117.20494,51.9015091 117.191403,52.0519182 117.209825,52.2001003 C117.219694,52.2742877 117.238963,52.3469178 117.267168,52.4162406 C117.282164,52.4485572 117.299872,52.4795452 117.3201,52.5088722 C117.3201,52.5088722 117.359799,52.5662155 117.399499,52.6103258 C117.474032,52.7039578 117.511692,52.8216452 117.505363,52.9411529 C117.491958,53.0502841 117.44405,53.1522819 117.368622,53.2322807 C117.235632,53.3790201 117.073341,53.4962307 116.892231,53.5763409 L116.892231,53.5763409 Z" id="Path" fill="#FF847F"></path>
                    <path d="M123.464662,67.7622055 L121.087118,67.3784461 C121.060652,71.2733835 118.237594,78.55599 111.52401,77.8193484 C111.52401,77.8193484 121.541454,81.3834586 120.92391,84.4711779 C120.306366,87.5588972 111.05203,90.4260652 109.239098,90.6466165 C107.426165,90.8671679 109.190576,91.8993484 116.843709,91.8993484 C119.168321,91.8993484 120.076992,92.8653634 120.222556,94.2019048 C122.697143,93.92401 124.342456,93.6461153 124.342456,93.6461153 C122.057544,84.1227068 123.420551,73.8141353 123.464662,67.7622055 Z" id="Path" fill="#0E1738" opacity="0.15"></path>
                    <path d="M125.753985,93.7255138 L122.613333,93.3593985 C122.243651,93.3168056 121.964708,93.0037066 121.964912,92.6315789 L121.964912,92.6315789 C121.964912,92.2271792 122.292743,91.8993484 122.697143,91.8993484 L125.753985,91.8993484 L125.753985,93.7255138 Z" id="Path" fill="#FFC3BD"></path>
                    <path d="M116.861353,61.8426065 L108.440702,61.8426065 C108.440702,61.8426065 107.210025,63.7922807 108.440702,64.6833083 C108.84951,64.9417361 109.316652,65.0934055 109.799298,65.124411 L110.205113,70.0691729 L112.141554,64.9964912 C114.452932,64.5730326 116.861353,63.3864662 116.861353,61.8426065 Z" id="Path" fill="#FFC3BD"></path>
                    <path d="M110.910877,55.7156892 C110.970159,55.9509848 110.877305,56.1983767 110.677846,56.3365593 C110.478387,56.4747419 110.214144,56.4747419 110.014685,56.3365593 C109.815226,56.1983767 109.722372,55.9509848 109.781654,55.7156892 C109.722372,55.4803936 109.815226,55.2330017 110.014685,55.0948191 C110.214144,54.9566366 110.478387,54.9566366 110.677846,55.0948191 C110.877305,55.2330017 110.970159,55.4803936 110.910877,55.7156892 Z" id="Path" fill="#FF847F"></path>
                    <path d="M104.982456,62.4954386 L107.87609,64.5465664 L101.246316,78.8250627 C100.744486,79.9015275 99.7689859,80.682085 98.6086684,80.935607 C97.4483509,81.1891291 96.2361949,80.8865604 95.3311278,80.1174937 L95.3311278,80.1174937 C93.7379949,78.7766144 93.5178821,76.4045051 94.8370927,74.7933835 L104.982456,62.4954386 Z" id="Path" fill="#FFC3BD"></path>
                    <path d="M104.982456,62.4954386 L104.541353,60.2061153 C104.532527,60.1417213 104.532527,60.0764241 104.541353,60.0120301 L105.12802,57.0389975 C105.14612,56.9461056 105.19052,56.8603672 105.25594,56.7919799 L105.917594,56.0994486 C106.011105,56.00571 106.13807,55.953029 106.270476,55.953029 C106.402882,55.953029 106.529847,56.00571 106.623358,56.0994486 L106.795388,56.2714787 C106.964498,56.440218 106.988641,56.7057874 106.852732,56.9022556 L106.446917,57.4977444 C106.384849,57.5883989 106.35389,57.6967545 106.358697,57.8065163 L106.358697,57.8065163 C106.374372,58.0094091 106.51181,58.1823996 106.705906,58.2435397 C106.900001,58.3046798 107.111773,58.2416906 107.240902,58.084411 L109.283208,55.5392481 C109.438203,55.3440214 109.714356,55.2948433 109.927218,55.4245614 L112.335639,56.9110777 C112.547271,57.040428 112.628748,57.3075981 112.525313,57.5330326 L110.509474,62.0190476 C110.483544,62.0774433 110.446028,62.1299663 110.399198,62.1734336 L107.898145,64.5553885 L104.982456,62.4954386 Z" id="Path" fill="#FFC3BD"></path>
                    <path d="M105.913183,56.0994486 C106.061617,55.9360289 106.298127,55.8862373 106.49985,55.9759398 C106.594551,56.0270017 106.679632,56.0941713 106.751278,56.1744361 C106.838195,56.2431936 106.906449,56.3326818 106.949774,56.4346867 C106.985163,56.5436309 106.985163,56.6609806 106.949774,56.7699248 C106.9122,56.8745883 106.858632,56.9727963 106.790977,57.0610526 C106.685113,57.2330827 106.557193,57.4183459 106.464561,57.5815539 C106.386666,57.7403348 106.420572,57.9312781 106.548371,58.0535338 C106.675447,58.1717067 106.864073,58.1948401 107.01594,58.1108772 C107.160362,57.980309 107.28781,57.8321144 107.395288,57.6697744 L107.779048,57.1757393 L108.546566,56.1876692 L108.939148,55.6980451 L109.133233,55.4510276 C109.213652,55.3424831 109.326374,55.2621882 109.455238,55.2216541 C109.585766,55.1797957 109.726114,55.1797957 109.856642,55.2216541 C109.963519,55.2670572 110.065498,55.3232196 110.161003,55.3892732 L110.694737,55.7156892 L111.766617,56.3641103 L112.29594,56.6949373 C112.406874,56.7537757 112.50448,56.8348636 112.582657,56.9331328 C112.663896,57.0461778 112.707143,57.1820983 112.706182,57.3213033 C112.700247,57.4485919 112.663948,57.5726151 112.600301,57.6830075 L112.472381,57.9697243 L112.21213,58.5387469 C111.863659,59.2974436 111.52401,60.0605514 111.162306,60.8148371 L110.628571,61.9484712 C110.589012,62.0590254 110.524043,62.1587448 110.438897,62.239599 L110.209524,62.4513283 L109.768421,62.8924311 C109.146466,63.4482206 108.528922,64.0128321 107.898145,64.5597995 C108.47599,63.9598997 109.071479,63.3688221 109.662556,62.7733333 L110.103659,62.3322306 L110.324211,62.1160902 C110.387094,62.047963 110.43383,61.9665512 110.460952,61.8778947 L110.954987,60.7266165 C111.276992,59.9546867 111.625464,59.19599 111.960702,58.4328822 L112.21213,57.8594486 C112.301264,57.6956009 112.368025,57.5205405 112.410627,57.3389474 C112.411625,57.2672077 112.388304,57.1972436 112.344461,57.1404511 C112.292518,57.0758337 112.226007,57.024439 112.150376,56.9904762 L111.612231,56.6640602 L110.553584,55.997995 L110.01985,55.6671679 C109.825764,55.5392481 109.7199,55.4730827 109.578747,55.521604 C109.506568,55.5442803 109.443317,55.589019 109.397895,55.6495238 L109.199398,55.8921303 L108.806817,56.3773434 L108.008421,57.3477694 L107.611429,57.8285714 L107.408521,58.0711779 C107.340286,58.1686984 107.251437,58.2500178 107.148271,58.3093734 C106.917964,58.4268463 106.638169,58.3822929 106.455739,58.1990977 C106.277752,58.0188433 106.236733,57.7441931 106.354286,57.5197995 C106.482206,57.3301253 106.601303,57.1757393 106.724812,57.0037093 C106.790071,56.9283504 106.843604,56.8435897 106.883609,56.7522807 C106.91355,56.6620686 106.91355,56.5645981 106.883609,56.474386 C106.850772,56.3821835 106.79453,56.3001008 106.720401,56.2361905 C106.656552,56.1571441 106.580631,56.0886665 106.495439,56.0332832 C106.308784,55.9208494 106.069851,55.9480008 105.913183,56.0994486 L105.913183,56.0994486 Z" id="Path" fill="#FF847F"></path>
                    <path d="M110.275689,55.6362907 C110.190138,56.213312 110.009796,56.7722238 109.741955,57.2904261 C109.608273,57.5531192 109.450255,57.8026993 109.269975,58.0358897 C109.09488,58.276737 108.867058,58.4743836 108.60391,58.6137343 C108.771281,58.3856025 108.918852,58.1435859 109.045013,57.8903258 C109.177343,57.6433083 109.309674,57.3962907 109.433183,57.1404511 C109.711078,56.642005 109.958095,56.1303258 110.275689,55.6362907 Z" id="Path" fill="#FF847F"></path>
                    <path d="M111.157895,56.165614 C111.120627,56.7048549 110.984565,57.2326539 110.756491,57.7227068 C110.548382,58.2279475 110.216115,58.6724875 109.790476,59.0151378 C110.028672,58.5255138 110.231579,58.0667669 110.456541,57.5859649 C110.681504,57.1051629 110.866767,56.637594 111.157895,56.165614 Z" id="Path" fill="#FF847F"></path>
                    <path d="M111.876892,56.6199499 C111.842043,57.1666402 111.719931,57.7042312 111.515188,58.2123308 C111.327696,58.7325478 111.026277,59.2042691 110.632982,59.5929825 L111.202005,58.0932331 C111.393105,57.5873223 111.618594,57.0950785 111.876892,56.6199499 Z" id="Path" fill="#FF847F"></path>
                    <path d="M122.882406,63.2982456 C121.22386,63.9069674 120.129925,70.5190977 121.65614,73.0422055 L124.14396,78.8294737 L130.279699,73.9464662 C127.888922,69.0414035 124.83208,64.0789975 122.882406,63.2982456 Z" id="Path" fill="#FF5F81"></path>
                    <path d="M114.898446,43.2280702 C112.591479,42.2796992 105.749975,42.6987469 104.836892,45.605614 L104.836892,49.1344361 C104.836892,49.1344361 105.670576,49.1829574 106.826266,49.2182456 L107.412932,46.4657644 L107.743759,49.2403008 C109.010703,49.2704447 110.278357,49.2351094 111.541654,49.1344361 L111.876892,47.1494737 L112.317995,49.2491228 L114.232381,49.606416 C114.232381,49.606416 116.085013,52.2530326 115.974737,58.8386967 L116.856942,50.8459148 C116.856942,50.8459148 117.205414,44.1896742 114.898446,43.2280702 Z" id="Path" fill="#0E1738"></path>
                    <path d="M123.336742,76.9503759 C124.200833,75.9723242 125.126064,75.0500399 126.106867,74.1890727 C127.073981,73.3139544 128.09652,72.5021112 129.16812,71.7585965 C128.306302,72.738786 127.380929,73.6612126 126.397995,74.5198997 C125.431112,75.39529 124.408555,76.2071476 123.336742,76.9503759 L123.336742,76.9503759 Z" id="Path" fill="#FFFFFF"></path>
                    <path d="M78.2251629,86.7472682 L77.0827068,83.518396 C75.8372806,79.9918322 72.5035273,77.6340852 68.7635088,77.6340852 L30.8992481,77.6340852 C26.0269616,77.6340852 22.077193,81.5838538 22.077193,86.4561404 L22.077193,161.002506 C22.077193,165.874793 26.0269616,169.824561 30.8992481,169.824561 L135.881704,169.824561 C140.753991,169.824561 144.703759,165.874793 144.703759,161.002506 L144.703759,101.453634 C144.703759,96.5813476 140.753991,92.6315789 135.881704,92.6315789 L86.5443609,92.6315789 C82.8043424,92.6318526 79.4705891,90.273832 78.2251629,86.7472682 Z" id="Path" fill="#FF8A72"></path>
                    <path d="M6.7356391,124.170585 C6.5267057,124.176012 6.34253354,124.034199 6.29453634,123.830777 L1.28802005,102.265263 C1.23279238,102.029087 1.37860738,101.792631 1.61443609,101.73594 C1.72913726,101.708214 1.85016525,101.727603 1.95046506,101.789772 C2.05076488,101.851942 2.12197267,101.951707 2.14817043,102.066767 L7.1679198,123.62787 C7.19431838,123.741938 7.17428363,123.861822 7.11222962,123.961108 C7.05017562,124.060395 6.95119406,124.130937 6.83709273,124.157193 C6.80403839,124.166219 6.76990277,124.170585 6.7356391,124.170585 Z" id="Path" fill="#FFC592"></path>
                    <path d="M10.6879198,141.152882 C10.4776638,141.158021 10.2930244,141.014002 10.246817,140.808822 L7.54726817,129.20782 C7.52086959,129.093751 7.54090434,128.973867 7.60295835,128.874581 C7.66501235,128.775294 7.76399391,128.704752 7.87809524,128.678496 C7.99216366,128.652098 8.11204758,128.672132 8.21133399,128.734186 C8.3106204,128.79624 8.38116257,128.895222 8.40741855,129.009323 L11.1069674,140.610326 C11.133366,140.724394 11.1133312,140.844278 11.0512772,140.943565 C10.9892232,141.042851 10.8902417,141.113393 10.7761404,141.139649 C10.7473828,141.14764 10.7177561,141.152084 10.6879198,141.152882 L10.6879198,141.152882 Z" id="Path" fill="#FFC592"></path>
                    <path d="M144.703759,159.5601 L144.703759,161.002506 C144.703759,165.874793 140.753991,169.824561 135.881704,169.824561 L29.4656642,169.824561 C24.6135338,169.824561 19.8143358,166.273684 18.7953885,161.884712 L3.18035088,94.8370927 C2.15699248,90.4481203 5.29323308,86.8972431 10.1453634,86.8972431 L48.0140351,86.8972431 C51.8789171,86.9659318 55.4574018,88.9493876 57.5639098,92.1904762 L59.3812531,95.0929323 C61.4877611,98.3340209 65.0662458,100.317477 68.9311278,100.386165 L118.277293,100.386165 C123.151479,100.386165 127.928622,103.941454 128.947569,108.326015 L140.994085,160.054135 C141.242054,160.966006 142.126025,161.554076 143.062884,161.430424 C143.999744,161.306772 144.700869,160.509492 144.703759,159.564511 L144.703759,159.5601 Z" id="Path" fill="#FFC592"></path>
                    <polygon id="Path" fill="#FF8A72" points="67.3916792 146.022657 61.0927318 141.029373 77.2106266 119.199198 83.5051629 124.18807"></polygon>
                    <polygon id="Path" fill="#FF8A72" points="56.6817043 124.18807 60.3649123 119.199198 87.9161905 141.029373 84.2329825 146.022657"></polygon>
                    <path d="M90.3510777,140.711779 L84.5682206,148.541353 L77.8502256,143.217243 L75.5873684,141.421955 C76.8459704,138.335293 79.0900796,135.751544 81.9701253,134.073183 L84.316792,135.930226 L90.3510777,140.711779 Z" id="Path" fill="#FF8A72"></path>
                    <path d="M100.161203,157.173734 C95.8595642,161.476209 89.389673,162.76364 83.7686522,160.435656 C78.1476314,158.107673 74.4825462,152.622774 74.4825462,146.538747 C74.4825462,140.45472 78.1476314,134.969821 83.7686522,132.641837 C89.389673,130.313854 95.8595642,131.601285 100.161203,135.903759 C106.031504,141.778643 106.031504,151.298851 100.161203,157.173734 Z M98.2247619,155.241704 C101.745321,151.722315 102.798985,146.428635 100.894371,141.829409 C98.9897575,137.230183 94.5020049,134.231293 89.52401,134.231293 C84.5460152,134.231293 80.0582626,137.230183 78.1536486,141.829409 C76.2490347,146.428635 77.3026992,151.722315 80.8232581,155.241704 C85.6310316,160.041004 93.4169885,160.041004 98.2247619,155.241704 Z" id="Shape" fill="#0E1738"></path>
                    <path d="M116.654035,175.598596 L98.2821053,157.231078 L100.218546,155.299048 L118.586065,173.666566 C119.118882,174.200371 119.118882,175.064792 118.586065,175.598596 L118.586065,175.598596 C118.052261,176.131413 117.18784,176.131413 116.654035,175.598596 Z" id="Path" fill="#0E1738"></path>
                    <circle id="Oval" fill="#FFFFFF" opacity="0.15" cx="89.5262155" cy="146.538747" r="12.3067669"></circle>
                    <path d="M90.3510777,136.499248 C97.766015,136.499248 102.005013,147.416541 98.1806516,152.04812 C98.3076646,148.944532 97.6106266,145.862649 96.160401,143.115789 C94.7582468,140.493086 92.770328,138.228941 90.3510777,136.499248 Z" id="Path" fill="#FFFFFF" opacity="0.5"></path>
                    <path d="M129.979749,91.3347368 L125.917193,91.3347368 C125.731178,91.3323823 125.551848,91.4040259 125.418661,91.5339039 C125.285474,91.6637819 125.209343,91.841253 125.207018,92.0272682 L125.207018,94.2768922 C125.207691,94.4416689 125.277117,94.5986847 125.398549,94.7100672 C125.519981,94.8214496 125.682395,94.8770868 125.846617,94.8635589 L125.934837,94.8635589 C126.269228,94.866857 126.548907,94.6103239 126.574436,94.2768922 L126.574436,94.2768922 C126.597747,94.6096326 126.876083,94.866707 127.209624,94.8635589 L127.297845,94.8635589 C127.631406,94.864703 127.90984,94.6093113 127.937444,94.2768922 L127.937444,94.2768922 C127.965047,94.6093113 128.243481,94.864703 128.577043,94.8635589 L128.665263,94.8635589 C129.309273,94.8635589 129.278396,94.3518797 129.300451,94.0254637 L129.300451,94.0254637 C129.32598,94.3588953 129.605659,94.6154285 129.94005,94.6121303 L130.028271,94.6121303 C130.361812,94.6152784 130.640148,94.358204 130.663459,94.0254637 L130.663459,94.0254637 L130.663459,92.0272682 C130.658833,91.6501404 130.356787,91.3441967 129.979749,91.3347368 Z" id="Path" fill="#FFC3BD"></path>
                    <path d="M126.596491,91.3347368 C126.710956,91.8173828 126.767229,92.3119963 126.76411,92.8080201 C126.770913,93.3025217 126.716088,93.7959449 126.600902,94.2768922 C126.380092,93.3086027 126.380092,92.3030264 126.600902,91.3347368 L126.596491,91.3347368 Z" id="Path" fill="#FF847F"></path>
                    <path d="M127.946266,91.3347368 C128.169827,92.3027147 128.169827,93.3089144 127.946266,94.2768922 C127.728728,93.3082371 127.728728,92.303392 127.946266,91.3347368 Z" id="Path" fill="#FF847F"></path>
                    <path d="M129.322506,91.3347368 C129.546001,92.217723 129.546001,93.1424775 129.322506,94.0254637 C129.104967,93.1417454 129.104967,92.2184551 129.322506,91.3347368 L129.322506,91.3347368 Z" id="Path" fill="#FF847F"></path>
                    <path d="M141.796892,30.242005 C141.636582,30.2362612 141.485134,30.1670151 141.375918,30.0495247 C141.266701,29.9320343 141.208679,29.7759411 141.214637,29.6156391 L141.320501,26.6381955 C141.325071,26.4774818 141.39396,26.3253282 141.511719,26.2158626 C141.629477,26.106397 141.786248,26.0487817 141.946867,26.0559398 C142.895899,26.0818392 143.687414,25.3358784 143.717749,24.3869775 C143.748083,23.4380767 143.00583,22.6430843 142.057081,22.6083152 C141.108332,22.5735461 140.30988,23.3120758 140.270677,24.2606516 C140.266082,24.4205686 140.197801,24.5720256 140.08101,24.6813619 C139.964219,24.7906981 139.808594,24.848855 139.648722,24.8429073 C139.488426,24.8382955 139.336535,24.7701601 139.2265,24.6535057 C139.116464,24.5368513 139.057307,24.3812445 139.062055,24.2209524 C139.115551,22.6811434 140.351216,21.4451584 141.891011,21.3912631 C143.430806,21.3373679 144.749864,22.4839336 144.910889,24.0162339 C145.071914,25.5485343 144.020018,26.9442567 142.502657,27.2116291 L142.414436,29.6509273 C142.412143,29.8115996 142.345487,29.9646355 142.229402,30.0757448 C142.113318,30.1868541 141.957511,30.2467475 141.796892,30.242005 Z" id="Path" fill="#9CAFCD"></path>
                    <path d="M142.784962,32.3681203 C142.772212,32.7607123 142.524052,33.1068993 142.156348,33.2450474 C141.788644,33.3831955 141.373925,33.2860555 141.10582,32.9989818 C140.837716,32.7119081 140.769111,32.2915251 140.932035,31.9341083 C141.09496,31.5766916 141.457278,31.3527404 141.849825,31.366817 C142.106863,31.3748606 142.350086,31.4850616 142.525613,31.6730081 C142.70114,31.8609547 142.794482,32.1111319 142.784962,32.3681203 Z" id="Path" fill="#9CAFCD"></path>
                    <path d="M128.299148,42.7472682 L131.214837,33.4311779 C128.165575,28.0230593 129.587858,21.1932345 134.542459,17.4518875 C139.49706,13.7105406 146.455362,14.2119692 150.822339,18.6250469 C155.189316,23.0381246 155.617649,30.0013084 151.82448,34.9163484 C148.031312,39.8313884 141.186928,41.1818738 135.811128,38.07599 L128.299148,42.7472682 Z M142.004211,16.2811028 C138.025123,16.2829297 134.353299,18.4206974 132.387278,21.8801633 C130.421258,25.3396291 130.463703,29.5882223 132.498446,33.0077193 L132.652832,33.2591479 L130.62817,39.7345363 L135.806717,36.5144862 L136.155188,36.7350376 C140.141301,39.2170968 145.260035,38.9123172 148.923455,35.9747895 C152.586876,33.0372618 153.996714,28.1070815 152.440182,23.6768525 C150.883651,19.2466235 146.699923,16.2817051 142.004211,16.2811028 L142.004211,16.2811028 Z" id="Shape" fill="#CFD7FE"></path>
                </g>
            </g>
        </g>
    </g>
</svg>