<?xml version="1.0" encoding="UTF-8"?>
<svg width="96px" height="96px" viewBox="0 0 96 96" version="1.1" xmlns="http://www.w3.org/2000/svg" xmlns:xlink="http://www.w3.org/1999/xlink">
    <title>83E6A9B1-5CFA-4B33-B1A9-3DD687404254@1x</title>
    <g id="Product-management" stroke="none" stroke-width="1" fill="none" fill-rule="evenodd">
        <g id="2.7.2-Listing---Search---Empty" transform="translate(-730.000000, -358.000000)" fill-rule="nonzero">
            <g id="Empty" transform="translate(593.000000, 358.000000)">
                <g id="Fnd_No-result" transform="translate(137.000000, 0.000000)">
                    <ellipse id="Oval" fill="#ECF3FE" cx="50.9387755" cy="45.5510204" rx="45.0612245" ry="45.5510204"></ellipse>
                    <path d="M88.1541812,23.6908847 L41.9647322,18.6247415 C40.751072,18.4955301 39.6621969,19.3829105 39.5276755,20.6108243 L33.3186138,78.6593242 C33.1902448,79.8873489 34.0657571,80.9897353 35.2780504,81.1265154 L81.4639172,86.1914498 C82.6773598,86.3213768 83.7664683,85.4343465 83.9009739,84.2065758 L90.1100356,26.1580759 C90.2378175,24.9315172 89.3646903,23.8301203 88.1541812,23.6908847 Z" id="Path" fill="#3A7EC1" opacity="0.2" style="mix-blend-mode: multiply;"></path>
                    <path d="M81.4578167,84.2391488 L32.2585023,78.931433 C31.6981904,78.8695924 31.293373,78.368468 31.3527115,77.8101524 L37.9060897,17.5608932 C37.9681844,17.002875 38.4713687,16.5997147 39.0319792,16.6588104 L88.2312936,21.9665262 C88.7916055,22.0283667 89.1964229,22.5294912 89.1370844,23.0878068 L82.5837062,83.337066 C82.5216115,83.8950842 82.0184272,84.2982445 81.4578167,84.2391488 Z" id="Path" fill="#FFFFFF"></path>
                    <path d="M43.6497664,22.9239165 L57.7454212,22.9315353 C58.5623435,22.9319769 59.2244789,23.5941141 59.2249183,24.4110363 C59.2253571,25.2268206 58.564389,25.8885001 57.7486047,25.8889389 C57.7480738,25.8889391 57.7475428,25.8889391 57.7470119,25.8889389 L43.651357,25.88132 C42.8344348,25.8808785 42.1722993,25.2187413 42.1718599,24.401819 C42.1714212,23.5860348 42.8323893,22.9243553 43.6481735,22.9239165 C43.6487045,22.9239162 43.6492354,22.9239162 43.6497664,22.9239165 Z" id="Rectangle" fill="#52D1BD" transform="translate(50.698389, 24.406428) rotate(6.180000) translate(-50.698389, -24.406428) "></path>
                    <path d="M42.8650956,30.8368731 L80.3868451,30.8571539 C81.2037673,30.8575954 81.8659028,31.5197326 81.8663422,32.3366549 C81.8667809,33.1524391 81.2058128,33.8141186 80.3900286,33.8145574 C80.3894976,33.8145577 80.3889667,33.8145577 80.3884357,33.8145574 L42.8666862,33.7942766 C42.049764,33.793835 41.3876285,33.1316978 41.3871891,32.3147756 C41.3867504,31.4989913 42.0477185,30.8373118 42.8635027,30.8368731 C42.8640337,30.8368728 42.8645646,30.8368728 42.8650956,30.8368731 Z" id="Rectangle" fill="#E4ECF9" transform="translate(61.626766, 32.325715) rotate(6.180000) translate(-61.626766, -32.325715) "></path>
                    <path d="M42.1482988,37.4891901 L79.6700483,37.5094709 C80.4869706,37.5099125 81.149106,38.1720497 81.1495454,38.9889719 C81.1499842,39.8047562 80.4890161,40.4664357 79.6732318,40.4668744 C79.6727009,40.4668747 79.6721699,40.4668747 79.671639,40.4668744 L42.1498894,40.4465936 C41.3329672,40.4461521 40.6708317,39.7840149 40.6703924,38.9670926 C40.6699536,38.1513084 41.3309217,37.4896289 42.1467059,37.4891901 C42.1472369,37.4891898 42.1477678,37.4891898 42.1482988,37.4891901 Z" id="Rectangle" fill="#E4ECF9" transform="translate(60.909969, 38.978032) rotate(6.180000) translate(-60.909969, -38.978032) "></path>
                    <path d="M41.4316389,44.1401716 L78.9533884,44.1604524 C79.7703106,44.1608939 80.4324461,44.8230312 80.4328855,45.6399534 C80.4333242,46.4557377 79.7723561,47.1174171 78.9565719,47.1178559 C78.9560409,47.1178562 78.95551,47.1178562 78.954979,47.1178559 L41.4332295,47.0975751 C40.6163073,47.0971336 39.9541718,46.4349964 39.9537324,45.6180741 C39.9532937,44.8022899 40.6142618,44.1406104 41.430046,44.1401716 C41.430577,44.1401713 41.4311079,44.1401713 41.4316389,44.1401716 Z" id="Rectangle" fill="#E4ECF9" transform="translate(60.193309, 45.629014) rotate(6.180000) translate(-60.193309, -45.629014) "></path>
                    <path d="M40.7148421,50.7924887 L78.2365916,50.8127694 C79.0535139,50.813211 79.7156493,51.4753482 79.7160887,52.2922705 C79.7165275,53.1080547 79.0555594,53.7697342 78.2397751,53.770173 C78.2392442,53.7701733 78.2387132,53.7701733 78.2381823,53.770173 L40.7164327,53.7498922 C39.8995105,53.7494506 39.237375,53.0873134 39.2369357,52.2703912 C39.2364969,51.4546069 39.897465,50.7929274 40.7132492,50.7924887 C40.7137802,50.7924884 40.7143111,50.7924884 40.7148421,50.7924887 Z" id="Rectangle" fill="#E4ECF9" transform="translate(59.476512, 52.281331) rotate(6.180000) translate(-59.476512, -52.281331) "></path>
                    <path d="M50.8712773,58.0380068 L77.4874639,58.052393 C78.3043862,58.0528346 78.9665216,58.7149718 78.966961,59.5318941 C78.9673998,60.3476783 78.3064317,61.0093578 77.4906474,61.0097966 C77.4901165,61.0097969 77.4895855,61.0097969 77.4890546,61.0097966 L50.8728679,60.9954103 C50.0559457,60.9949688 49.3938102,60.3328316 49.3933709,59.5159093 C49.3929321,58.7001251 50.0539002,58.0384456 50.8696844,58.0380068 C50.8702154,58.0380065 50.8707463,58.0380065 50.8712773,58.0380068 Z" id="Rectangle" fill="#E4ECF9" transform="translate(64.180166, 59.523902) rotate(6.180000) translate(-64.180166, -59.523902) "></path>
                    <path d="M39.2812556,64.0969923 L76.8030051,64.1172731 C77.6199273,64.1177146 78.2820628,64.7798518 78.2825022,65.5967741 C78.2829409,66.4125583 77.6219728,67.0742378 76.8061886,67.0746766 C76.8056576,67.0746769 76.8051267,67.0746769 76.8045957,67.0746766 L39.2828462,67.0543958 C38.465924,67.0539543 37.8037885,66.391817 37.8033491,65.5748948 C37.8029104,64.7591106 38.4638785,64.0974311 39.2796627,64.0969923 C39.2801937,64.096992 39.2807246,64.096992 39.2812556,64.0969923 Z" id="Rectangle" fill="#E4ECF9" transform="translate(58.042926, 65.585834) rotate(6.180000) translate(-58.042926, -65.585834) "></path>
                    <path d="M38.5645956,70.7479738 L76.0863452,70.7682546 C76.9032674,70.7686961 77.5654029,71.4308333 77.5658422,72.2477556 C77.566281,73.0635398 76.9053129,73.7252193 76.0895287,73.7256581 C76.0889977,73.7256584 76.0884668,73.7256584 76.0879358,73.7256581 L38.5661863,73.7053773 C37.749264,73.7049357 37.0871286,73.0427985 37.0866892,72.2258763 C37.0862504,71.410092 37.7472185,70.7484125 38.5630028,70.7479738 C38.5635337,70.7479735 38.5640647,70.7479735 38.5645956,70.7479738 Z" id="Rectangle" fill="#E4ECF9" transform="translate(57.326266, 72.236816) rotate(6.180000) translate(-57.326266, -72.236816) "></path>
                    <path d="M52.989277,32.0310449 C46.5802485,26.7489258 37.1510013,27.3030243 31.4126294,33.298971 C25.6742574,39.2949177 25.5871513,48.6843272 31.2133072,54.7844591 L28.7092842,57.7928542 L27.690347,56.953415 L14.1451934,73.2327144 C13.8277281,73.6140619 13.6757231,74.1051911 13.722641,74.5979847 C13.7695588,75.0907783 14.0115533,75.5448383 14.3953517,75.8602078 L16.9201195,77.9369709 C17.7175879,78.5949208 18.900465,78.4863449 19.5632549,77.6943584 L33.1084084,61.4162721 L32.0882509,60.5768328 L34.5922739,57.5684377 C41.6775734,61.9398556 50.959172,60.0989613 55.8144014,53.3592821 C60.6696308,46.6196029 59.4340491,37.2915967 52.989277,32.0310449 Z M52.8867731,52.3789561 C48.3198858,57.8638799 40.1449006,58.6302157 34.6270802,54.0906479 C29.1092598,49.5510801 28.3379253,41.4245148 32.9042231,35.939106 C37.4705209,30.4536972 45.6454237,29.6864933 51.163732,34.2254751 C53.8166716,36.404862 55.4890134,39.5434356 55.8122178,42.9495378 C56.1354223,46.35564 55.0829627,49.7497183 52.8867731,52.3838083 L52.8867731,52.3789561 Z" id="Shape" fill="#3A7EC1" opacity="0.2" style="mix-blend-mode: multiply;"></path>
                    <circle id="Oval" fill="#4684AF" opacity="0.2" transform="translate(41.527294, 42.338706) rotate(-45.000000) translate(-41.527294, -42.338706) " cx="41.5272937" cy="42.3387055" r="13.8258252"></circle>
                    <path d="M41.1538346,52.3964576 C41.1488902,52.3683366 41.1456119,52.3398826 41.1440212,52.3112804 C41.1344652,52.1464902 41.1840425,51.9842264 41.2818188,51.8602755 C41.3795951,51.7363247 41.5175387,51.6608687 41.6652267,51.6505491 C41.8898466,51.6351361 42.1162839,51.6095829 42.3445385,51.5738897 C45.0326975,51.1478697 47.388638,49.3461248 48.7147522,46.702162 C50.0408663,44.0581993 50.1851739,40.8750318 49.1049447,38.0952141 C48.9820949,37.7800325 49.1114635,37.4133907 49.3938975,37.2762967 C49.6763316,37.1392028 50.004879,37.2835714 50.1277287,37.598753 C51.3468038,40.735043 51.184482,44.3265408 49.6888166,47.3100329 C48.1931513,50.293525 45.5355076,52.3271785 42.5026447,52.8089583 C42.2474939,52.8495189 41.99307,52.8787225 41.7393731,52.8965691 C41.4594232,52.9173294 41.2090025,52.7034436 41.1538346,52.3964576 L41.1538346,52.3964576 Z" id="Path" fill="#FFFFFF" opacity="0.6"></path>
                    <polygon id="Rectangle" fill="#565656" transform="translate(30.485143, 55.755875) rotate(39.600000) translate(-30.485143, -55.755875) " points="28.3074878 52.8473509 32.6484377 52.8580967 32.6627974 58.6643992 28.3218474 58.6536534"></polygon>
                    <path d="M52.1116644,30.044868 C45.4413331,24.5282304 35.5617809,25.4633586 30.0450037,32.1335413 C24.5282265,38.8037239 25.463291,48.6831282 32.1335347,54.1998716 C38.8037785,59.716615 48.6833455,58.7816436 54.2002286,52.1115485 C59.7165453,45.4410915 58.7815073,35.5619673 52.1116644,30.044868 Z M52.0101957,50.3068835 C47.4897691,55.7689086 39.3974173,56.5325088 33.9350461,52.0124679 C28.4726748,47.4924269 27.7085966,39.4002463 32.2283941,33.9377007 C36.7481915,28.475155 44.8404553,27.7106228 50.3033471,32.2300347 C52.9286786,34.3994227 54.5841287,37.5232903 54.9051698,40.9137665 C55.2262109,44.3042428 54.1865172,47.683303 52.0150275,50.3068835 L52.0101957,50.3068835 Z" id="Shape" fill="#636466"></path>
                    <path d="M18.3823298,54.7236291 L25.3457356,54.7408666 L25.4003467,76.8217512 C25.4015006,77.2893997 25.0236918,77.6675661 24.5564846,77.6664122 L19.2874028,77.6533662 C18.8201956,77.6522097 18.4405117,77.2721681 18.4393552,76.8045197 L18.3847468,54.7236291 L18.3823298,54.7236291 Z" id="Path" fill="#636466" transform="translate(21.891338, 66.195021) rotate(39.600000) translate(-21.891338, -66.195021) "></path>
                    <path d="M82.063829,8.91608999 L83.9069559,7.9034798 C84.0985326,7.80067717 84.3292153,7.81953121 84.5031628,7.95220869 C84.6771103,8.08488616 84.7645897,8.30870833 84.729256,8.53068441 L84.3768417,10.6749632 C84.3452047,10.8680797 84.4067329,11.0650766 84.5413017,11.2015205 L86.0320143,12.7198221 C86.1873451,12.8777507 86.2432324,13.114214 86.1761189,13.3295388 C86.1090053,13.5448636 85.930566,13.7015918 85.7160161,13.7336597 L83.655567,14.0466483 C83.4705083,14.0749833 83.3106241,14.1966037 83.227971,14.371911 L82.3058202,16.3222596 C82.2096428,16.5248864 82.0118744,16.6530612 81.7954067,16.6530612 C81.5789391,16.6530612 81.3811707,16.5248864 81.2849933,16.3222596 L80.3640172,14.371911 C80.2809755,14.1964202 80.1206626,14.0748079 79.9352465,14.0466483 L77.8747974,13.7336597 C77.6604504,13.7012064 77.4823675,13.5443282 77.4155254,13.3290741 C77.3486833,13.1138201 77.4046933,12.8775823 77.5599739,12.7198221 L79.0506865,11.2015205 C79.1844735,11.0646057 79.2454902,10.8678409 79.2139718,10.6749632 L78.8615575,8.53068441 C78.8252798,8.30844928 78.9125231,8.08390825 79.0867947,7.95098356 C79.2610664,7.81805887 79.4923324,7.79965878 79.6838576,7.9034798 L81.5258098,8.91608999 C81.6939081,9.00991859 81.8957307,9.00991859 82.063829,8.91608999 L82.063829,8.91608999 Z" id="Path" fill="#4786D1"></path>
                    <circle id="Oval" fill="#4786D1" cx="68.0816327" cy="94.5306122" r="1.46938776"></circle>
                    <ellipse id="Oval" fill="#4786D1" transform="translate(91.007459, 52.498006) rotate(-22.500000) translate(-91.007459, -52.498006) " cx="91.0074593" cy="52.4980056" rx="1.86107701" ry="1.86771844"></ellipse>
                    <circle id="Oval" fill="#4786D1" cx="1.95918367" cy="64.6530612" r="1.95918367"></circle>
                </g>
            </g>
        </g>
    </g>
</svg>