{
  "-1": {
    "precision": 0.3333333333333333,
    "recall": 0.13333333333333333,
    "f1-score": 0.19047619047619044,
    "support": 15
  },
  "0": {
    "precision": 0.6888888888888889,
    "recall": 0.8378378378378378,
    "f1-score": 0.7560975609756098,
    "support": 37
  },
  "1": {
    "precision": 0.3333333333333333,
    "recall": 0.5,
    "f1-score": 0.4,
    "support": 2
  },
  "accuracy": 0.6296296296296297,
  "macro avg": {
    "precision": 0.4518518518518518,
    "recall": 0.49039039039039034,
    "f1-score": 0.4488579171506,
    "support": 54
  },
  "weighted avg": {
    "precision": 0.5769547325102881,
    "recall": 0.6296296296296297,
    "f1-score": 0.5857917150600078,
    "support": 54
  }
}