{
  "results": [
    {
      "video_title": "",
      "evidences": [
        {
          "id": 0,
          "claim": "The minority of people who get COVID-19 will recover",
          "evidences": []
        },
        {
          "id": 3,
          "claim": "Many of the viruses that infect humans are of plant origin source",
          "evidences": []
        },
        {
          "id": 6,
          "claim": "Officials announced that the novel coronavirus are not transmitted between humans",
          "evidences": [
            {
              "title": "Sense and Sensibility: Characterizing Social Media Users Regarding the   Use of Controversial Terms for COVID-19",
              "abstract": [
                "With the world-wide development of 2019 novel coronavirus, although WHO has officially announced the disease as COVID-19, one controversial term - \"Chinese Virus\" is still being used by a great number of people.",
                "In the meantime, global online media coverage about COVID-19-related racial attacks increases steadily, most of which are anti-Chinese or anti-Asian.",
                "As this pandemic becomes increasingly severe, more people start to talk about it on social media platforms such as Twitter.",
                "When they refer to COVID-19, there are mainly two ways: using controversial terms like \"Chinese Virus\" or \"Wuhan Virus\", or using non-controversial terms like \"Coronavirus\".",
                "In this study, we attempt to characterize the Twitter users who use controversial terms and those who use non-controversial terms.",
                "We use the Tweepy API to retrieve 17 million related tweets and the information of their authors.",
                "We find significant differences between these two groups of Twitter users across their demographics, user-level features like the number of followers, political following status, as well as their geo-locations.",
                "Moreover, we apply classification models to predict Twitter users who are more likely to use controversial terms.",
                "To our best knowledge, this is the first large-scale social media-based study to characterize users with respect to their usage of controversial terms during a major crisis."
              ],
              "url": "http://arxiv.org/abs/2004.06307v3",
              "doi": "10.1109/TBDATA.2020.2996401",
              "evidence": [
                0
              ],
              "evidence_confidence": [
                0.6776043772697449
              ],
              "label": "NOT_ENOUGH_INFO",
              "label_confidence": [
                0.44060850143432617,
                0.512341320514679,
                0.04705018177628517
              ]
            }
          ]
        },
        {
          "id": 9,
          "claim": "The symptoms of Covid are like loss of sight",
          "evidences": []
        },
        {
          "id": 11,
          "claim": "In fact, people age of 1 or under are susceptible to the coronavirus as it causes severe symptoms",
          "evidences": [
            {
              "title": "The Adoption of ICT Powered Healthcare Technologies towards Managing   Global Pandemics",
              "abstract": [
                "Pandemic is an outbreak that happens over a large geographic area affecting a greater portion of the population as new pathogens appear for which people have less immune and no vaccines are available.",
                "It can spread from person to person in a very short time, and in fact, the health workers are at greater risk of infection because of the patients who carry the disease.",
                "In the 21st century, where everyone is connected through digital technologies, Information and Communication Technology (ICT) plays a critical role in improving health care for individuals and larger communities.",
                "ICT has currently been severed in a variety of application domains which signifies its importance as a major technological paradigm, and it has drawn higher attention for its potential to alleviate the burden on healthcare systems caused by a rise in chronic diseases, aging and increased population and pandemic situations.",
                "This paper surveys and offers substantial knowledge about how effective ICT Healthcare strategy can be used to manage global pandemics by presenting a four-phased framework, which can be deployed to alleviate the strain on healthcare during a pandemic.",
                "In addition, we discuss how ICT powered technologies can be used towards managing a pandemic during the transformation of simple disease outbreak into a global pandemic."
              ],
              "url": "http://arxiv.org/abs/2009.05716v1",
              "doi": null,
              "evidence": [
                1
              ],
              "evidence_confidence": [
                0.6117445230484009
              ],
              "label": "NOT_ENOUGH_INFO",
              "label_confidence": [
                0.00578650925308466,
                0.9801046848297119,
                0.014108882285654545
              ]
            }
          ]
        },
        {
          "id": 13,
          "claim": "They're looking at statistics here and they're saying that the coronavirus is less lethal than the flu",
          "evidences": []
        },
        {
          "id": 14,
          "claim": "SARS-CoV-2 is less contagious in the first two weeks of incubation in patients with no symptoms",
          "evidences": [
            {
              "title": "Alternating quarantine for sustainable epidemic mitigation",
              "abstract": [
                "Absent a drug or vaccine, containing epidemic outbreaks is achieved by means of social distancing, specifically mobility restrictions and lock-downs.",
                "Such measures impose a hurtful toll on the economy, and are difficult to sustain for extended periods.",
                "As an alternative, we propose here an alternating quarantine strategy, in which at every instance, half of the population remains under lock-down while the other half continues to be active, maintaining a routine of weekly succession between activity and quarantine.",
                "This regime affords a dual partition:\\ half of the population interacts for only half of the time, resulting in a dramatic reduction in transmission, comparable to that achieved by a population-wide lock-down.",
                "All the while, it enables socioeconomic continuity at $50\\%$ capacity.",
                "The proposed weekly alternations also address an additional challenge, with specific relevance to COVID-19.",
                "Indeed, SARS-CoV-2 exhibits a relatively long incubation period, in which individuals experience no symptoms, but may already contribute to the spread.",
                "Unable to selectively isolate these invisible spreaders, we resort to population-wide restrictions.",
                "However, under the alternating quarantine routine, if an individual was exposed during their active week, by the time they complete their quarantine they will, in most cases, begin to exhibit symptoms.",
                "Hence this strategy isolates the majority of pre-symptomatic individuals during their infectious phase, leading to a rapid decline in the viral spread, thus addressing one of the main challenges in COVID-19 mitigation."
              ],
              "url": "http://arxiv.org/abs/2004.01453v4",
              "doi": null,
              "evidence": [
                6,
                8
              ],
              "evidence_confidence": [
                0.978261411190033,
                0.564873456954956
              ],
              "label": "REFUTE",
              "label_confidence": [
                0.833682656288147,
                0.11126985400915146,
                0.05504753813147545
              ]
            }
          ]
        },
        {
          "id": 17,
          "claim": "The flu vaccine does not protect against influenza",
          "evidences": [
            {
              "title": "Influenza Virus Vaccine Efficacy Based On Conserved Sequence Alignment",
              "abstract": [
                "The rapid outbreak of bird flu challenges the outcome of effective vaccine for the upcoming years.",
                "The recent research established different norms to eliminate flu pandemics.",
                "This can be made possible with skilled experimental analyses and by tracking the recent virulent strain and can be broadly applicable with effective testing of vaccine efficacy.",
                "Every year World Health Organization (WHO) reveals the administration of drug and vaccine to counter arrest the spread of flu among the population.",
                "As there are recurrent failures in priming the population, the complete eradication of the flu pandemic is still appears to be an unresolved problem.",
                "To overcome the current scenario, high level efforts with theoretical and practical research is required and it can enhance the scope in this field.",
                "The recent advancements also allow the researchers to endeavor effective vaccine to meet the emerging flu types.",
                "Only the standardized vaccination among the population at the time of flu pandemics will revolutionalize the current propositions against influenza virus.",
                "This paper shows the deficiencies of vaccine fitness research as there are reported failures and less efficacy of vaccine even after priming the population from referred evidences and studies.",
                "It also shows simple experimental approach in detecting the effective vaccine among the vaccines announced by WHO."
              ],
              "url": "http://arxiv.org/abs/1206.1029v1",
              "doi": "10.1109/ICoBE.2012.6179031",
              "evidence": [
                6,
                7
              ],
              "evidence_confidence": [
                0.5997500419616699,
                0.8788493275642395
              ],
              "label": "REFUTE",
              "label_confidence": [
                0.9481301307678223,
                0.037187691777944565,
                0.01468218769878149
              ]
            },
            {
              "title": "Increasing Herd Immunity with Influenza Revaccination",
              "abstract": [
                "Seasonal influenza is a significant public health concern in the United States and globally.",
                "While influenza vaccines are the single most effective intervention to reduce influenza morbidity and mortality, there is considerable debate surrounding the merits and consequences of repeated seasonal vaccination.",
                "Here, we describe a two-season influenza epidemic contact network model and use it to demonstrate that increasing the level of continuity in vaccination across seasons reduces the burden on public health.",
                "We show that revaccination reduces the influenza attack rate not only because it reduces the overall number of susceptible individuals, but also because it better protects highly-connected individuals, who would otherwise make a disproportionately large contribution to influenza transmission.",
                "Our work thus contributes a population-level perspective to debates about the merits of repeated influenza vaccination and advocates for public health policy to incorporate individual vaccine histories."
              ],
              "url": "http://arxiv.org/abs/1308.5365v2",
              "doi": null,
              "evidence": [
                3,
                4
              ],
              "evidence_confidence": [
                0.5278501510620117,
                0.6659111380577087
              ],
              "label": "REFUTE",
              "label_confidence": [
                0.8974530100822449,
                0.09463361650705338,
                0.007913365960121155
              ]
            }
          ]
        },
        {
          "id": 21,
          "claim": "Then SARS-CoV-2 goes into the liver and it can cause blood to clot",
          "evidences": []
        },
        {
          "id": 27,
          "claim": "It's a SARS-CoV-2 virus that causes high blood pressure, and it attacks your heart",
          "evidences": []
        },
        {
          "id": 28,
          "claim": "Yes, it comes out to 2 days, but that's not the incubation period of this infection to this symptom",
          "evidences": [
            {
              "title": "A simulation of a COVID-19 epidemic based on a deterministic SEIR model",
              "abstract": [
                "An epidemic disease caused by a new coronavirus has spread in Northern Italy with a strong contagion rate.",
                "We implement an SEIR model to compute the infected population and number of casualties of this epidemic.",
                "The example may ideally regard the situation in the Italian Region of Lombardy, where the epidemic started on February 25.",
                "We calibrate the model with the number of dead individuals to date (May 5, 2020) and constraint the parameters on the basis of values reported in the literature.",
                "The peak occurs at day 37 (March 31) approximately, when there is a rapid decrease, with a reproduction ratio R0 = 3 initially, 1.36 at day 22 and 0.8 after day 35, indicating different degrees of lockdown.",
                "The predicted death toll is approximately 15600 casualties, with 2.7 million infected individuals at the end of the epidemic.",
                "The incubation period providing a better fit of the dead individuals is 4.25 days and the infection period is 4 days, with a fatality rate of 0.00144/day [values based on the reported (official) number of casualties].",
                "The infection fatality rate (IFR) is 0.57 %, and 2.36 % if twice the reported number of casualties is assumed.",
                "However, these rates depend on the initially exposed individuals.",
                "If approximately nine times more individuals are exposed, there are three times more infected people at the end of the epidemic and IFR = 0.47 %.",
                "If we relax these constraints and use a wider range of lower and upper bounds for the incubation and infection periods, we observe that a higher incubation period (13 versus 4.25 days) gives the same IFR (0.6 versus 0.57 %), but nine times more exposed individuals in the first case.",
                "Therefore, a precise determination of the fatality rate is subject to the knowledge of the characteristics of the epidemic."
              ],
              "url": "http://arxiv.org/abs/2004.03575v10",
              "doi": null,
              "evidence": [
                6,
                10
              ],
              "evidence_confidence": [
                0.8687391877174377,
                0.7635847926139832
              ],
              "label": "REFUTE",
              "label_confidence": [
                0.6496873497962952,
                0.2732749581336975,
                0.07703765481710434
              ]
            },
            {
              "title": "BETS: The dangers of selection bias in early analyses of the coronavirus   disease (COVID-19) pandemic",
              "abstract": [
                "The coronavirus disease 2019 (COVID-19) has quickly grown from a regional outbreak in Wuhan, China to a global pandemic.",
                "Early estimates of the epidemic growth and incubation period of COVID-19 may have been biased due to sample selection.",
                "Using detailed case reports from 14 locations in and outside mainland China, we obtained 378 Wuhan-exported cases who left Wuhan before an abrupt travel quarantine.",
                "We developed a generative model we call BETS for four key epidemiological events---Beginning of exposure, End of exposure, time of Transmission, and time of Symptom onset (BETS)---and derived explicit formulas to correct for the sample selection.",
                "We gave a detailed illustration of why some early and highly influential analyses of the COVID-19 pandemic were severely biased.",
                "All our analyses, regardless of which subsample and model were being used, point to an epidemic doubling time of 2 to 2.5 days during the early outbreak in Wuhan.",
                "A Bayesian nonparametric analysis further suggests that about 5% of the symptomatic cases may not develop symptoms within 14 days of infection and that men may be much more likely than women to develop symptoms within 2 days of infection."
              ],
              "url": "http://arxiv.org/abs/2004.07743v4",
              "doi": null,
              "evidence": [
                6
              ],
              "evidence_confidence": [
                0.8892027735710144
              ],
              "label": "REFUTE",
              "label_confidence": [
                0.6670557856559753,
                0.17548835277557373,
                0.1574559360742569
              ]
            }
          ]
        },
        {
          "id": 29,
          "claim": "So how is coronavirus spread? Well, we don't know exactly how SARS-CoV-2 virus spread from person to person, but similar viruses spread through only touch contact",
          "evidences": [
            {
              "title": "Temporal Analysis of COVID-19 Peak Outbreak",
              "abstract": [
                "Intent of this research is to explore how mathematical models, specifically Susceptible-Infected-Removed (SIR) model, can be utilized to forecast peak outbreak timeline of COVID-19 epidemic amongst a population of interest starting from the date of first reported case.",
                "Till the time of this research, there was no effective and universally accepted vaccine to control transmission and spread of this infection.",
                "COVID-19 primarily spreads in population through respiratory droplets from an infected person cough and sneeze which infects people who are in proximity.",
                "COVID-19 is spreading contagiously across the world.",
                "If health policy makers and medical experts could get early and timely insights into when peak infection rate would occur after first reported case, they could plan and optimize medical personnel, ventilators supply, and other medical resources without over-taxing the infrastructure.",
                "The predictions may also help policymakers devise strategies to control the epidemic, potentially saving many lives.",
                "Thus, it can aid in critical decision-making process by providing actionable insights into COVID-19 outbreak by leveraging available data."
              ],
              "url": "http://arxiv.org/abs/2009.05285v1",
              "doi": null,
              "evidence": [
                2,
                3
              ],
              "evidence_confidence": [
                0.942460298538208,
                0.8128734827041626
              ],
              "label": "NOT_ENOUGH_INFO",
              "label_confidence": [
                0.24340492486953735,
                0.7089396119117737,
                0.04765545204281807
              ]
            }
          ]
        },
        {
          "id": 32,
          "claim": "So although SARS-CoV-2 virus can be killed with antibiotics, SARS-CoV-2 virus is highly contagious and human immune systems don't have antibodies to this particular virus just yet",
          "evidences": [
            {
              "title": "Study on Antibody-Virus Interaction using Molecular Dynamics: Two   Dimensional Simulation on Immunoglobulin Reaction against Human   Papillomavirus",
              "abstract": [
                "Human Papillomavirus (HPV) has been known as one of the cause of virus-induced cancer such as cervical cancer and carcinoma.",
                "Among other types of cancer, this type has higher chance in being prevented earlier.",
                "The main idea is to eradicate the virus as soon as it enters the body by marking it with antibodies; signaling the immune system to dispose of it.",
                "However, the antibodies must be trained to recognize the virus.",
                "They can be trained by inserting an object similar to the virus allowing them to learn to recognize and surround the inserted object.",
                "In response to this, molecular dynamics simulation was chosen to study the antibody-virus interaction.",
                "In this work, two-dimensional case that involves HPV and immunoglobulin (Ig) was studied and observed.",
                "Two types of objects will be defined; one stands for HPV while another stands for antibodies.",
                "The interaction between the two objects will be governed by two forces; Coulomb force and repulsive contact force.",
                "Through the definition of some rules and condition, the antibodies' motion was observed.",
                "The influence of antibody concentration, and the antibody's type and their appearance sequence were observed both quantitatively and visually.   ",
                "Keywords: antibody-virus interaction, molecular dynamics, HPV, immunoglobulin."
              ],
              "url": "http://arxiv.org/abs/1311.4290v1",
              "doi": null,
              "evidence": [
                2
              ],
              "evidence_confidence": [
                0.8503220081329346
              ],
              "label": "REFUTE",
              "label_confidence": [
                0.6975363492965698,
                0.27623122930526733,
                0.026232413947582245
              ]
            }
          ]
        },
        {
          "id": 35,
          "claim": "The Who also mentioned though, that just the flu is less contagious than this SARS-CoV-2 coronavirus",
          "evidences": [
            {
              "title": "Novel Coronavirus COVID-19 Strike on Arab Countries and Territories: A   Situation Report I",
              "abstract": [
                "The novel Coronavirus (COVID-19) is an infectious disease caused by a new virus called COVID-19 or 2019-nCoV that first identified in Wuhan, China.",
                "The disease causes respiratory illness (such as the flu) with other symptoms such as a cough, fever, and in more severe cases, difficulty breathing.",
                "This new Coronavirus seems to be very infectious and has spread quickly and globally.",
                "In this work, information about COVID-19 is provided and the situation in Arab countries and territories regarding the COVID-19 strike is presented.",
                "The next few weeks main expectations is also given."
              ],
              "url": "http://arxiv.org/abs/2003.09501v1",
              "doi": null,
              "evidence": [
                1,
                2
              ],
              "evidence_confidence": [
                0.9172928333282471,
                0.9060280323028564
              ],
              "label": "NOT_ENOUGH_INFO",
              "label_confidence": [
                0.47110092639923096,
                0.514171302318573,
                0.014727825298905373
              ]
            },
            {
              "title": "Is SARS-CoV-2 a new Frankenstein monster virus?",
              "abstract": [
                "Severe acute respiratory syndrome coronavirus 2 (SARS-CoV-2), a novel virus of beta coronavirus genus originated in Wuhan, China in December 2019, resulted in the pandemic spread of Corona Virus Disease 2019 (COVID-19) worldwide.",
                "This genus also contains SARS-CoV (originated in China 2002-2003) and MERS-CoV (found in Saudi Arabia 2012).",
                "The nucleotide sequences of SARS-CoV-2 is closer to SARS-CoV (with approximately 80% identity) than to MERS-CoV. Despite these similarities, SARS-CoV-2 has two main features over the other coronaviruses.",
                "The first is the high contagious rate and the second is the immune response evasion.",
                "The higher transmission ability makes this virus quickly spread worldwide with a high mortality rate and more economic losses.",
                "This review will provide an overview of the current knowledge on the role of some viral and host cell factors in higher transmission and contagious spread of SARS-CoV-2."
              ],
              "url": "http://arxiv.org/abs/2006.08608v1",
              "doi": null,
              "evidence": [
                1,
                3,
                4
              ],
              "evidence_confidence": [
                0.5154815912246704,
                0.9372231364250183,
                0.7799490094184875
              ],
              "label": "NOT_ENOUGH_INFO",
              "label_confidence": [
                0.08489097654819489,
                0.9052408337593079,
                0.009868231602013111
              ]
            }
          ]
        },
        {
          "id": 38,
          "claim": "So what are the symptoms of coronavirus? Well, it can include any of the following the loss of sight and memory",
          "evidences": [
            {
              "title": "End-to-End AI-Based Point-of-Care Diagnosis System for Classifying   Respiratory Illnesses and Early Detection of COVID-19",
              "abstract": [
                "Respiratory symptoms can be a caused by different underlying conditions, and are often caused by viral infections, such as Influenza-like illnesses or other emerging viruses like the Coronavirus.",
                "These respiratory viruses, often, have common symptoms, including coughing, high temperature, congested nose, and difficulty breathing.",
                "However, early diagnosis of the type of the virus, can be crucial, especially in cases such as the recent COVID-19 pandemic.",
                "One of the factors that contributed to the spread of the pandemic, was the late diagnosis or confusing it with regular flu-like symptoms.",
                "Science has proved that one of the possible differentiators of the underlying causes of these different respiratory diseases is coughing, which comes in different types and forms.",
                "Therefore, a reliable lab-free tool for early and more accurate diagnosis that can differentiate between different respiratory diseases is very much needed.",
                "This paper proposes an end-to-end portable system that can record data from patients with symptom, including coughs (voluntary or involuntary) and translate them into health data for diagnosis, and with the aid of machine learning, classify them into different respiratory illnesses, including COVID-19.",
                "With the ongoing efforts to stop the spread of the COVID-19 disease everywhere today, and against similar diseases in the future, our proposed low cost and user-friendly solution can play an important part in the early diagnosis."
              ],
              "url": "http://arxiv.org/abs/2006.15469v1",
              "doi": null,
              "evidence": [
                0,
                1
              ],
              "evidence_confidence": [
                0.5820185542106628,
                0.8190301060676575
              ],
              "label": "NOT_ENOUGH_INFO",
              "label_confidence": [
                0.2857131063938141,
                0.7012685537338257,
                0.013018340803682804
              ]
            },
            {
              "title": "Medical Imaging and Computational Image Analysis in COVID-19 Diagnosis:   A Review",
              "abstract": [
                "Coronavirus disease (COVID-19) is an infectious disease caused by a newly discovered coronavirus.",
                "The disease presents with symptoms such as shortness of breath, fever, dry cough, and chronic fatigue, amongst others.",
                "Sometimes the symptoms of the disease increase so much they lead to the death of the patients.",
                "The disease may be asymptomatic in some patients in the early stages, which can lead to increased transmission of the disease to others.",
                "Many studies have tried to use medical imaging for early diagnosis of COVID-19.",
                "This study attempts to review papers on automatic methods for medical image analysis and diagnosis of COVID-19.",
                "For this purpose, PubMed, Google Scholar, arXiv and medRxiv were searched to find related studies by the end of April 2020, and the essential points of the collected studies were summarised.",
                "The contribution of this study is four-fold: 1) to use as a tutorial of the field for both clinicians and technologists, 2) to comprehensively review the characteristics of COVID-19 as presented in medical images, 3) to examine automated artificial intelligence-based approaches for COVID-19 diagnosis based on the accuracy and the method used, 4) to express the research limitations in this field and the methods used to overcome them.",
                "COVID-19 reveals signs in medical images can be used for early diagnosis of the disease even in asymptomatic patients.",
                "Using automated machine learning-based methods can diagnose the disease with high accuracy from medical images and reduce time, cost and error of diagnostic procedure.",
                "It is recommended to collect bulk imaging data from patients in the shortest possible time to improve the performance of COVID-19 automated diagnostic methods."
              ],
              "url": "http://arxiv.org/abs/2010.02154v1",
              "doi": null,
              "evidence": [
                2
              ],
              "evidence_confidence": [
                0.6063381433486938
              ],
              "label": "NOT_ENOUGH_INFO",
              "label_confidence": [
                0.00240108254365623,
                0.8353073000907898,
                0.16229161620140076
              ]
            }
          ]
        },
        {
          "id": 39,
          "claim": "OK, so as the five G does not cause any flu like symptoms in Wuhan, China",
          "evidences": []
        },
        {
          "id": 40,
          "claim": "The professor said that the viruses normally,only have major mutations in the form of multiple changes in chemical conditions",
          "evidences": [
            {
              "title": "Viral evolution under the pressure of an adaptive immune system -   optimal mutation rates for viral escape",
              "abstract": [
                "Based on a recent model of evolving viruses competing with an adapting immune system [1], we study the conditions under which a viral quasispecies can maximize its growth rate.",
                "The range of mutation rates that allows viruses to thrive is limited from above due to genomic information deterioration, and from below by insufficient sequence diversity, which leads to a quick eradication of the virus by the immune system.",
                "The mutation rate that optimally balances these two requirements depends to first order on the ratio of the inverse of the virus' growth rate and the time the immune system needs to develop a specific answer to an antigen.",
                "We find that a virus is most viable if it generates exactly one mutation within the time it takes for the immune system to adapt to a new viral epitope.",
                "Experimental viral mutation rates, in particular for HIV (human immunodeficiency virus), seem to suggest that many viruses have achieved their optimal mutation rate.",
                "[1] C.Kamp and S. Bornholdt, Phys.",
                "Rev. Lett.",
                ", 88, 068104 (2002)"
              ],
              "url": "http://arxiv.org/abs/cond-mat/0209613v1",
              "doi": null,
              "evidence": [
                1
              ],
              "evidence_confidence": [
                0.523016631603241
              ],
              "label": "NOT_ENOUGH_INFO",
              "label_confidence": [
                0.025593306869268417,
                0.9695023894309998,
                0.004904248286038637
              ]
            }
          ]
        },
        {
          "id": 42,
          "claim": "So now you got a souped up juiced up version of this coronavirus with elements of Parkinson's disease",
          "evidences": []
        },
        {
          "id": 50,
          "claim": "In the past it was possible for bats to transmit coronavirus",
          "evidences": [
            {
              "title": "Are mouse and cat the missing link in the COVID-19 outbreaks in seafood   markets?",
              "abstract": [
                "Severe acute respiratory syndrome coronavirus 2 (SARS-CoV-2) virus caused the novel coronavirus disease-2019 (COVID-19) affecting the whole world.",
                "Like SARS-CoV and MERS-CoV, SARS-CoV-2 are thought to originate in bats and then spread to humans through intermediate hosts.",
                "Identifying intermediate host species is critical to understanding the evolution and transmission mechanisms of COVID-19.",
                "However, determining which animals are intermediate hosts remains a key challenge.",
                "Virus host-genome similarity (HGS) is an important factor that reflects the adaptability of virus to host.",
                "SARS-CoV-2 may retain beneficial mutations to increase HGS and evade the host immune system.",
                "This study investigated the HGSs between 399 SARS-CoV-2 strains and 10 hosts of different species, including bat, mouse, cat, swine, snake, dog, pangolin, chicken, human and monkey.",
                "The results showed that the HGS between SARS-CoV-2 and bat was the highest, followed by mouse and cat.",
                "Human and monkey had the lowest HGS values.",
                "In terms of genetic similarity, mouse and monkey are halfway between bat and human.",
                "Moreover, given that COVID-19 outbreaks tend to be associated with live poultry and seafood markets, mouse and cat are more likely sources of infection in these places.",
                "However, more experimental data are needed to confirm whether mouse and cat are true intermediate hosts.",
                "These findings suggest that animals closely related to human life, especially those with high HGS, need to be closely monitored."
              ],
              "url": "http://arxiv.org/abs/2009.09911v1",
              "doi": null,
              "evidence": [
                1,
                7
              ],
              "evidence_confidence": [
                0.619566023349762,
                0.6892408132553101
              ],
              "label": "SUPPORT",
              "label_confidence": [
                0.0007586600258946419,
                0.04816235974431038,
                0.9510790109634399
              ]
            }
          ]
        },
        {
          "id": 52,
          "claim": "I'm sure all fruits and vegetables will help decrease your immune system",
          "evidences": []
        },
        {
          "id": 53,
          "claim": "It says the median incubation period was two months range of one to three months",
          "evidences": []
        },
        {
          "id": 61,
          "claim": "SARS was a rhinovirus",
          "evidences": []
        },
        {
          "id": 63,
          "claim": "Now SARS pretty much is always transmittable even when somebody was symptomatic",
          "evidences": []
        },
        {
          "id": 64,
          "claim": "Well, the people more people have died from the SARS-CoV-2 virus than the flu",
          "evidences": [
            {
              "title": "Estimating Seroprevalence of SARS-CoV-2 in Ohio: A Bayesian Multilevel   Poststratification Approach with Multiple Diagnostic Tests",
              "abstract": [
                "Globally the SARS-CoV-2 coronavirus has infected more than 59 million people and killed more than 1.39 million.",
                "Designing and monitoring interventions to slow and stop the spread of the virus require knowledge of how many people have been and are currently infected, where they live, and how they interact.",
                "The first step is an accurate assessment of the population prevalence of past infections.",
                "There are very few population-representative prevalence studies of the SARS-CoV-2 coronavirus, and only two American states -- Indiana and Connecticut -- have reported probability-based sample surveys that characterize state-wide prevalence of the SARS-CoV-2 coronavirus.",
                "One of the difficulties is the fact that the tests to detect and characterize SARS-CoV-2 coronavirus antibodies are new, not well characterized, and generally function poorly.",
                "During July, 2020, a survey representing all adults in the State of Ohio in the United States collected biomarkers and information on protective behavior related to the SARS-CoV-2 coronavirus.",
                "Several features of the survey make it difficult to estimate past prevalence: 1) a low response rate, 2) very low number of positive cases, and 3) the fact that multiple, poor quality serological tests were used to detect SARS-CoV-2 antibodies.",
                "We describe a new Bayesian approach for analyzing the biomarker data that simultaneously addresses these challenges and characterizes the potential effect of selective response.",
                "The model does not require survey sample weights, accounts for multiple, imperfect antibody test results, and characterizes uncertainty related to the sample survey and the multiple, imperfect, potentially correlated tests."
              ],
              "url": "http://arxiv.org/abs/2011.09033v2",
              "doi": null,
              "evidence": [
                0
              ],
              "evidence_confidence": [
                0.9080917835235596
              ],
              "label": "SUPPORT",
              "label_confidence": [
                0.028674978762865067,
                0.3921871483325958,
                0.5791378617286682
              ]
            },
            {
              "title": "Testing Case Number of Coronavirus Disease 2019 in China with   Newcomb-Benford Law",
              "abstract": [
                "The coronavirus disease 2019 bursted out about two months ago in Wuhan has caused the death of more than a thousand people.",
                "China is fighting hard against the epidemics with the helps from all over the world.",
                "On the other hand, there appear to be doubts on the reported case number.",
                "In this article, we propose a test of the reported case number of coronavirus disease 2019 in China with Newcomb-Benford law.",
                "We find a $p$-value of $92.8\\%$ in favour that the cumulative case numbers abide by the Newcomb-Benford law.",
                "Even though the reported case number can be lower than the real number of affected people due to various reasons, this test does not seem to indicate the detection of frauds."
              ],
              "url": "http://arxiv.org/abs/2002.05695v1",
              "doi": null,
              "evidence": [
                0
              ],
              "evidence_confidence": [
                0.8600184321403503
              ],
              "label": "NOT_ENOUGH_INFO",
              "label_confidence": [
                0.0190375205129385,
                0.7863777875900269,
                0.1945846527814865
              ]
            }
          ]
        },
        {
          "id": 67,
          "claim": "Coronavirus incubation could be as longer than 50 days",
          "evidences": []
        },
        {
          "id": 76,
          "claim": "Anybody infected with SARS-CoV-2 virus has severe respiratory disease",
          "evidences": [
            {
              "title": "Deposition distribution of the new coronavirus (SARS-CoV-2) in the human   airways upon exposure to cough-generated aerosol",
              "abstract": [
                "The new coronavirus disease 2019 (COVID-19) has been emerged as a rapidly spreading pandemic.",
                "The disease is thought to spread mainly from person-to-person through respiratory droplets produced when an infected person coughs, sneezes, or talks.",
                "The pathogen of COVID-19 is the severe acute respiratory syndrome coronavirus 2 (SARS-CoV-2).",
                "It infects the cells binding to the angiotensin-converting enzyme 2 receptor (ACE2) which is expressed by cells throughout the airways as targets for cellular entry.",
                "Although the majority of persons infected with SARS-CoV-2 experience symptoms of mild upper respiratory tract infection, in some people infections of the peripheral airways result in severe, potentially fatal pneumonia.",
                "However, the induction of COVID-19 pneumonia requires that SARS-CoV-2 reaches the peripheral airways.",
                "While huge efforts have been made to understand the spread of the disease as well as the pathogenesis following cellular entry, much less attention is paid how SARS-CoV-2 from the environment reach the receptors of the target cells.",
                "The aim of the present study is to characterize the deposition distribution of SARS-CoV-2 in the airways upon exposure to cough-generated aerosol.",
                "For this purpose, the Stochastic Lung Deposition Model has been applied.",
                "Aerosol size distribution and breathing parameters were taken from the literature supposing normal breathing through the nose.",
                "We found that the probability of direct infection of the peripheral airways due to inhalation of aerosol generated by a bystander cough is very low.",
                "As the number of pathogens deposited in the extrathoracic airways is ~10 times higher than in the peripheral airways, we concluded that in most cases COVID-19 pneumonia must be preceded by SARS-CoV-2 infection of the upper airways.",
                "Our results suggest that without the enhancement of viral load in the upper airways, COVID-19 would be much less dangerous..."
              ],
              "url": "http://arxiv.org/abs/2005.05882v1",
              "doi": "10.1038/s41598-020-79985-6",
              "evidence": [
                4,
                11,
                12
              ],
              "evidence_confidence": [
                0.970207929611206,
                0.8283894062042236,
                0.9076106548309326
              ],
              "label": "NOT_ENOUGH_INFO",
              "label_confidence": [
                0.24708274006843567,
                0.6178954243659973,
                0.13502183556556702
              ]
            },
            {
              "title": "Abnormal respiratory patterns classifier may contribute to large-scale   screening of people infected with COVID-19 in an accurate and unobtrusive   manner",
              "abstract": [
                "Research significance: The extended version of this paper has been accepted by IEEE Internet of Things journal (DOI: 10.1109/JIOT.2020.2991456), please cite the journal version.",
                "During the epidemic prevention and control period, our study can be helpful in prognosis, diagnosis and screening for the patients infected with COVID-19 (the novel coronavirus) based on breathing characteristics.",
                "According to the latest clinical research, the respiratory pattern of COVID-19 is different from the respiratory patterns of flu and the common cold.",
                "One significant symptom that occurs in the COVID-19 is Tachypnea.",
                "People infected with COVID-19 have more rapid respiration.",
                "Our study can be utilized to distinguish various respiratory patterns and our device can be preliminarily put to practical use.",
                "Demo videos of this method working in situations of one subject and two subjects can be downloaded online.",
                "Research details: Accurate detection of the unexpected abnormal respiratory pattern of people in a remote and unobtrusive manner has great significance.",
                "In this work, we innovatively capitalize on depth camera and deep learning to achieve this goal.",
                "The challenges in this task are twofold: the amount of real-world data is not enough for training to get the deep model; and the intra-class variation of different types of respiratory patterns is large and the outer-class variation is small.",
                "In this paper, considering the characteristics of actual respiratory signals, a novel and efficient Respiratory Simulation Model (RSM) is first proposed to fill the gap between the large amount of training data and scarce real-world data.",
                "The proposed deep model and the modeling ideas have the great potential to be extended to large scale applications such as public places, sleep scenario, and office environment."
              ],
              "url": "http://arxiv.org/abs/2002.05534v2",
              "doi": null,
              "evidence": [
                4
              ],
              "evidence_confidence": [
                0.9365401864051819
              ],
              "label": "SUPPORT",
              "label_confidence": [
                0.03411779925227165,
                0.40535345673561096,
                0.5605287551879883
              ]
            }
          ]
        },
        {
          "id": 88,
          "claim": "SARS-CoV-2 virus is a virus that attacks your nervous system",
          "evidences": []
        },
        {
          "id": 90,
          "claim": "Coronavirus is a non-zoonotic disease",
          "evidences": []
        }
      ]
    }
  ]
}