{
  "-1": {
    "precision": 0.0,
    "recall": 0.0,
    "f1-score": 0.0,
    "support": 15
  },
  "0": {
    "precision": 0.6851851851851852,
    "recall": 1.0,
    "f1-score": 0.8131868131868133,
    "support": 37
  },
  "1": {
    "precision": 0.0,
    "recall": 0.0,
    "f1-score": 0.0,
    "support": 2
  },
  "accuracy": 0.6851851851851852,
  "macro avg": {
    "precision": 0.22839506172839508,
    "recall": 0.3333333333333333,
    "f1-score": 0.2710622710622711,
    "support": 54
  },
  "weighted avg": {
    "precision": 0.4694787379972566,
    "recall": 0.6851851851851852,
    "f1-score": 0.5571835571835573,
    "support": 54
  }
}