[
  {
    "id": 0,
    "claim": "The great majority of people who get COVID-19 will recover",
    "original": "The great majority of people who get COVID-19 will recover",
    "negated_claim": "The minority of people who get COVID-19 will recover",
    "changed": true,
    "negation_type": ["quantity", "opposite"]
  },
  {
    "id": 1,
    "claim": "Actually there's less than that can affect complicated animals like ours with eukaryotic cells, but there's still a lot",
    "original": "Actually there's less than that can affect complicated animals like ours with eukaryotic cells, but there's still a lot",
    "negated_claim": null,
    "changed": false
  },
  {
    "id": 2,
    "claim": "If the antibodies to the S type will give UL type immunity or the antibodies to the L type will give US type immunity",
    "original": "If the antibodies to the S type will give UL type immunity or the antibodies to the L type will give US type immunity",
    "negated_claim": null,
    "changed": false
  },
  {
    "id": 3,
    "claim": "Many of the viruses that infect humans are of animal origin source",
    "original": "Many of the viruses that infect humans are of animal origin source",
    "negated_claim": "Many of the viruses that infect humans are of plant origin source",
    "changed": false,
    "negation_type": ["aspect"]
  },
  {
    "id": 4,
    "claim": "After testing it, it showed that SARS, like viruses, found in bats from nearby caves",
    "original": "After testing it, it showed that SARS, like viruses, found in bats from nearby caves",
    "negated_claim": null,
    "changed": false
  },
  {
    "id": 5,
    "claim": "Unfortunately, there is no treatment currently for the coronavirus",
    "original": "Unfortunately, there is no treatment currently for the coronavirus",
    "negated_claim": null,
    "changed": false
  },
  {
    "id": 6,
    "claim": "Officials announced that the novel coronavirus can be transmitted between humans",
    "original": "Officials announced that the novel coronavirus can be transmitted between humans",
    "negated_claim": "Officials announced that the novel coronavirus are not transmitted between humans",
    "negation_type": ["opposite"],
    "changed": false
  },
  {
    "id": 7,
    "claim": "Coronaviruses are a large family of viruses ranging in severity from a common cold, which is almost harmless to MERS or Middle Eastern respiratory syndrome, which can kill over 1/3 of its patients and SARS, which can kill about 12% of its victims",
    "original": "Coronaviruses are a large family of viruses ranging in severity from a common cold, which is almost harmless to MERS or Middle Eastern respiratory syndrome, which can kill over 1/3 of its patients and SARS, which can kill about 12% of its victims",
    "negated_claim": null,
    "changed": false
  },
  {
    "id": 8,
    "claim": "The National Microbiology Laboratory has a long history of offering comprehensive testing services for coronavirus is an isolated and provided the first genome sequence of the SARS coronavirus and identified another coronavirus, an L63 in 2004",
    "original": "The National Microbiology Laboratory has a long history of offering comprehensive testing services for coronavirus is an isolated and provided the first genome sequence of the SARS coronavirus and identified another coronavirus, an L63 in 2004",
    "negated_claim": null,
    "changed": false
  },
  {
    "id": 9,
    "claim": "The symptoms of Covid are just like influenza",
    "original": "The symptoms of Covid are just like influenza",
    "negated_claim": "The symptoms of Covid are like loss of sight",
    "negation_type": ["aspect"],
    "changed": false
  },
  {
    "id": 10,
    "claim": "Genital cold source can cause more serious infections",
    "original": "Genital cold source can cause more serious infections",
    "negated_claim": null,
    "changed": false
  },
  {
    "id": 11,
    "claim": "In fact, people age of 1 or under seem to be practically immune from the coronavirus, or it creates a very very light disease",
    "original": "In fact, people age of 1 or under seem to be practically immune from this thing, or it creates a very very light disease",
    "negated_claim": "In fact, people age of 1 or under are susceptible to the coronavirus as it causes severe symptoms",
    "negation_type": ["aspect", "opposite"],
    "changed": true
  },
  {
    "id": 12,
    "claim": "Then Fang Chi-tai, a professor at National Taiwan University's College of Public Health said,that a French team investigating COVID-19 had found,that the key difference between RaTG13 and COVID-19 wasthat the latter has 4 additional amino acids not found in any other coronaviruses",
    "original": "Then Fang Chi-tai, a professor at National Taiwan University's College of Public Health said,that a French team investigating COVID-19 had found,that the key difference between RaTG13 and COVID-19 wasthat the latter has 4 additional amino acids not found in any other coronaviruses",
    "negated_claim": null,
    "changed": false
  },
  {
    "id": 13,
    "claim": "They're looking at statistics here and they're saying that the coronavirus is 20 times more lethal than the flu",
    "original": "They're looking at statistics here and they're saying that the coronavirus is 20 times more lethal than the flu",
    "negated_claim": "They're looking at statistics here and they're saying that the coronavirus is less lethal than the flu",
    "negation_type": ["quantity", "opposite"],
    "changed": false
  },
  {
    "id": 14,
    "claim": "SARS-CoV-2 is highly contagious up to two week incubation in patients with no symptoms",
    "original": "It is highly contagious up to two week incubation in patients with no symptoms",
    "negated_claim": "SARS-CoV-2 is less contagious in the first two weeks of incubation in patients with no symptoms",
    "negation_type": ["quantity", "opposite"],
    "changed": true
  },
  {
    "id": 15,
    "claim": "So when they looked at it, most cases where the El form they found about was at 7570% of these well form",
    "original": "So when they looked at it, most cases where the El form they found about was at 7570% of these well form",
    "negated_claim": null,
    "changed": false
  },
  {
    "id": 16,
    "claim": "They're planning to have something maybe in April, and that's really, really fast for some of these medications, but we don't have anything that we know is going to work, and so as a result of that, whenever we give something for treatments and less, it's a known situation like Ards 'cause viral pneumonias can cause a RDS that's acute respiratory distress syndrome",
    "original": "They're planning to have something maybe in April, and that's really, really fast for some of these medications, but we don't have anything that we know is going to work, and so as a result of that, whenever we give something for treatments and less, it's a known situation like Ards 'cause viral pneumonias can cause a RDS that's acute respiratory distress syndrome",
    "negated_claim": null,
    "changed": false
  },
  {
    "id": 17,
    "claim": "The flu vaccine protects against influenza",
    "original": "The flu vaccine protects against influenza",
    "negated_claim": "The flu vaccine does not protect against influenza",
    "negation_type": ["opposite"],
    "changed": false
  },
  {
    "id": 18,
    "claim": "The gene sequencing data from the 2019 ENKOVA or Wuhan virus is isolated",
    "original": "The gene sequencing data from the 2019 ENKOVA or Wuhan virus is isolated",
    "negated_claim": null,
    "changed": false
  },
  {
    "id": 19,
    "claim": "So one of these for viruses here mutated into another type of virus, which is now called the L form",
    "original": "So one of these for viruses here mutated into another type of virus, which is now called the L form",
    "negated_claim": null,
    "changed": false
  },
  {
    "id": 20,
    "claim": "Mixed and then more likely mutations occur leading to infectious virus known as COVID-19 or SARS Cove",
    "original": "Mixed and then more likely mutations occur leading to infectious virus known as COVID-19 or SARS Cove",
    "negated_claim": null,
    "changed": false
  },
  {
    "id": 21,
    "claim": "Then SARS-CoV-2 goes into the lower respiratory tract and it can cause fluid to accumulate and people to get really quite ill",
    "original": "Then SARS-CoV-2 goes into the lower respiratory tract and it can cause fluid to accumulate and people to get really quite ill",
    "negated_claim": "Then SARS-CoV-2 goes into the liver and it can cause blood to clot",
    "negation_type": ["aspect"],
    "changed": false
  },
  {
    "id": 22,
    "claim": "Here you get an antigen stimulating a BSL course when we give a vaccine in some of the cases we give a vaccine that has just the protein without the virus, so you don't get the actual disease, and that causes your B cells to make a lot of these antibodies in preparation for if you ever were to be infected with that virus, you'll be ready to make",
    "original": "Here you get an antigen stimulating a BSL course when we give a vaccine in some of the cases we give a vaccine that has just the protein without the virus, so you don't get the actual disease, and that causes your B cells to make a lot of these antibodies in preparation for if you ever were to be infected with that virus, you'll be ready to make",
    "negated_claim": null,
    "changed": false
  },
  {
    "id": 23,
    "claim": "Furthermore, from some cases it appears the SARS-CoV-2 virus could be aerosolised, which means it doesn't require the kind of contact that you have with, say, a married couple kissing each other or family living in close quarters in a hotel or apartment, but rather the distance is we're all sitting apart right now, yet China is still lying about all of this",
    "original": "Furthermore, from some cases it appears the virus could be aerosolised, which means it doesn't require the kind of contact that you have with, say, a married couple kissing each other or family living in close quarters in a hotel or apartment, but rather the distance is we're all sitting apart right now, yet China is still lying about all of this",
    "negated_claim": null,
    "changed": true
  },
  {
    "id": 24,
    "claim": "Chinese provincial government says is out of Reuters in Shanghai, a 70 year old man in China's Hubei Province was infected with coronavirus, but did not show symptoms until 27 days later, meaning the viruses incubation period could be much longer than presumed 14 days",
    "original": "Chinese provincial government says is out of Reuters in Shanghai, a 70 year old man in China's Hubei Province was infected with coronavirus, but did not show symptoms until 27 days later, meaning the viruses incubation period could be much longer than presumed 14 days",
    "negated_claim": null,
    "changed": false
  },
  {
    "id": 25,
    "claim": "A new type of viral pneumonia in the same family of infections as SARS and MERS",
    "original": "A new type of viral pneumonia in the same family of infections as SARS and MERS",
    "negated_claim": null,
    "changed": false
  },
  {
    "id": 26,
    "claim": "Still switching and people will start dying from this and so they got a two week incubation period",
    "original": "Still switching and people will start dying from this and so they got a two week incubation period",
    "negated_claim": null,
    "changed": false
  },
  {
    "id": 27,
    "claim": "It's a SARS-CoV-2 virus that causes you to cough and of course, it attacks your lungs",
    "original": "It's a virus that causes you to cough and of course, it attacks your lungs",
    "negated_claim": "It's a SARS-CoV-2 virus that causes high blood pressure, and it attacks your heart",
    "negation_type": ["aspect"],
    "changed": true
  },
  {
    "id": 28,
    "claim": "Yes, it comes out to 24 days, but that's not the incubation period of this infection to this symptom",
    "original": "Yes, it comes out to 24 days, but that's not the incubation period of this infection to this symptom",
    "negated_claim": "Yes, it comes out to 2 days, but that's not the incubation period of this infection to this symptom",
    "negation_type": ["quantity"],
    "changed": false
  },
  {
    "id": 29,
    "claim": "So how is coronavirus spread? Well, we don't know exactly how SARS-CoV-2 virus spread from person to person, but similar viruses spread through cough droplets through close contact",
    "original": "So how is coronavirus spread? Well, we don't know exactly how it spread from person to person, but similar viruses spread through cough droplets through close contact",
    "negated_claim": "So how is coronavirus spread? Well, we don't know exactly how SARS-CoV-2 virus spread from person to person, but similar viruses spread through only touch contact",
    "negation_type": ["aspect"],
    "changed": true
  },
  {
    "id": 30,
    "claim": "Say for example SARS that has a mortality rate of 10% or even Ebola, which has a mortality rate of 70%",
    "original": "Say for example SARS that has a mortality rate of 10% or even Ebola, which has a mortality rate of 70%",
    "negated_claim": null,
    "changed": false
  },
  {
    "id": 31,
    "claim": "Asymptomatically spread that SARS-CoV-2 virus spread through aerosols that it's not just droplets that SARS-CoV-2 virus is highly virulent that SARS-CoV-2 is a very serious disease that is not like the flu",
    "original": "Asymptomatically spread that it spread through aerosols that it's not just droplets that it's highly virulent that it's a very serious disease that is not like the flu",
    "negated_claim": null,
    "changed": true
  },
  {
    "id": 32,
    "claim": "So although SARS-CoV-2 virus can be killed with alcohol wipes and hand washing, SARS-CoV-2 virus is highly contagious and human immune systems don't have antibodies to this particular virus just yet",
    "original": "So although it can be killed with alcohol wipes and hand washing, it is highly contagious and human immune systems don't have antibodies to this particular virus just yet",
    "negated_claim": "So although SARS-CoV-2 virus can be killed with antibiotics, SARS-CoV-2 virus is highly contagious and human immune systems don't have antibodies to this particular virus just yet",
    "negation_type": ["aspect"],
    "changed": true
  },
  {
    "id": 33,
    "claim": "Fang said that these four amino acids made the disease easier to transmit",
    "original": "Fang said that these four amino acids made the disease easier to transmit",
    "negated_claim": "Fang said that these fifteen amino acids made the disease easier to transmit",
    "negation_type": ["quantity"],
    "changed": false
  },
  {
    "id": 34,
    "claim": "Of if this virus is man made or not by looking at a few clues, the current virus is made up of proteins just like any other biological thing, and a specific piece of that virus known as a spike protein with a receptor binding domain that is used to attach to a receptor found on human cells known as angiotensin converting enzyme or ace",
    "original": "Of if this virus is man made or not by looking at a few clues, the current virus is made up of proteins just like any other biological thing, and a specific piece of that virus known as a spike protein with a receptor binding domain that is used to attach to a receptor found on human cells known as angiotensin converting enzyme or ace",
    "negated_claim": null,
    "changed": false
  },
  {
    "id": 35,
    "claim": "The Who also mentioned though, that just the flu is more contagious than this SARS-CoV-2 coronavirus",
    "original": "The Who also mentioned though, that just the flu is more contagious than this new coronavirus",
    "negated_claim": "The Who also mentioned though, that just the flu is less contagious than this SARS-CoV-2 coronavirus",
    "negation_type": ["opposite"],
    "changed": true
  },
  {
    "id": 36,
    "claim": "Implications of this practical implications of this? Well, one thing is it's possible to be infected with both the S and the L type",
    "original": "Implications of this practical implications of this? Well, one thing is it's possible to be infected with both the S and the L type",
    "negated_claim": null,
    "changed": false
  },
  {
    "id": 37,
    "claim": "In terms of the origins from the New York Times quote, data mining of genomic data posted in the last 12, most importantly from the October report on pangolins indicated that a portion of the coronavirus in Penguins was nearly identical to the one in the new virus",
    "original": "In terms of the origins from the New York Times quote, data mining of genomic data posted in the last 12, most importantly from the October report on pangolins indicated that a portion of the coronavirus in Penguins was nearly identical to the one in the new virus",
    "negated_claim": null,
    "changed": false
  },
  {
    "id": 38,
    "claim": "So what are the symptoms of coronavirus? Well, it can include any of the following a fever and runny nose, a dry cough, a sore throat, and it can lead on to shortness of breath",
    "original": "So what are the symptoms of coronavirus? Well, it can include any of the following a fever and runny nose, a dry cough, a sore throat, and it can lead on to shortness of breath",
    "negated_claim": "So what are the symptoms of coronavirus? Well, it can include any of the following the loss of sight and memory",
    "negation_type": ["aspect"],
    "changed": false
  },
  {
    "id": 39,
    "claim": "OK, so as the five G causes caused these flu like symptoms in Wuhan, China",
    "original": "OK, so as the five G causes caused these flu like symptoms in Wuhan, China",
    "negated_claim": "OK, so as the five G does not cause any flu like symptoms in Wuhan, China",
    "negation_type": ["opposite"],
    "changed": false
  },
  {
    "id": 40,
    "claim": "The professor said that the viruses normally,only have small mutations in the form of singular changes in natural conditions",
    "original": "The professor said that the viruses normally,only have small mutations in the form of singular changes in natural conditions",
    "negated_claim": "The professor said that the viruses normally,only have major mutations in the form of multiple changes in chemical conditions",
    "negation_type": ["aspect", "opposite"],
    "changed": false
  },
  {
    "id": 41,
    "claim": "With this crisper technology, this gene editing and splicing stuff, you know the HIV spliced on to this Corona",
    "original": "With this crisper technology, this gene editing and splicing stuff, you know the HIV spliced on to this Corona",
    "negated_claim": null,
    "changed": false
  },
  {
    "id": 42,
    "claim": "So now you got a souped up juiced up version of this coronavirus with elements of tuberculosis",
    "original": "So now you got a souped up juiced up version of this coronavirus with elements of tuberculosis",
    "negated_claim": "So now you got a souped up juiced up version of this coronavirus with elements of Parkinson's disease",
    "negation_type": ["aspect"],
    "changed": false
  },
  {
    "id": 43,
    "claim": "And also the protein of DNA of HIV makes it possible or enables the coronavirus of Wuhan",
    "original": "And also the protein of DNA of HIV makes it possible or enables the coronavirus of Wuhan",
    "negated_claim": null,
    "changed": false
  },
  {
    "id": 44,
    "claim": "So they think the Chinese scientists think they picked up more of the L type because the L type was more prevalent in the early stages of the outbreak",
    "original": "So they think the Chinese scientists think they picked up more of the L type because the L type was more prevalent in the early stages of the outbreak",
    "negated_claim": null,
    "changed": false
  },
  {
    "id": 45,
    "claim": "A rhinovirus versus a regular coronavirus, or it could be a rhinovirus that's mutated enough so that the former immunization that you got against the virus is no longer effective 'cause it's mutated",
    "original": "A rhinovirus versus a regular coronavirus, or it could be a rhinovirus that's mutated enough so that the former immunization that you got against the virus is no longer effective 'cause it's mutated",
    "negated_claim": null,
    "changed": false
  },
  {
    "id": 46,
    "claim": "An antigen could be a protein, a virus or a protein of a bacteria etc etc",
    "original": "An antigen could be a protein, a virus or a protein of a bacteria etc etc",
    "negated_claim": null,
    "changed": false
  },
  {
    "id": 47,
    "claim": "A patient tested positive for SARS-CoV-2 virus went to a hospital when Wuhan, China, exhibiting symptoms, including respiratory issues, slight fever, headache, and body aches",
    "original": "A patient goes to a hospital when Wuhan, China, exhibiting symptoms, including respiratory issues, slight fever, headache, and body aches",
    "negated_claim": null,
    "changed": true
  },
  {
    "id": 48,
    "claim": "The SARS-CoV-2 virus can survive for about 15 minutes on that tissue, which is why it's so important you throw the tissue in the bin straight away on other services like door handles for example",
    "original": "The virus can survive for about 15 minutes on that issue, which is why it's so important you throw it in the bin straight away on other services like door handles for example",
    "negated_claim": "The SARS-CoV-2 virus does not survive at all on surfaces such as tissues, which is why it is not important you throw the tissue in the bin straight away on other services like door handles for example",
    "negation_type": ["quantity", "opposite"],
    "changed": true
  },
  {
    "id": 49,
    "claim": "Do not conduct 5G in that area because 5G will cause flu like symptoms, as people were going to the hospital for flu like symptoms they were given",
    "original": "Do not conduct 5G in that area because 5G will cause flu like symptoms, as people were going to the hospital for flu like symptoms they were given",
    "negated_claim": null,
    "changed": false
  },
  {
    "id": 50,
    "claim": "In the past it was impossible for bats to transmit coronavirus",
    "original": "In the past it was impossible for bats to transmit coronavirus",
    "negated_claim": "In the past it was possible for bats to transmit coronavirus",
    "negation_type": ["opposite"],
    "changed": false
  },
  {
    "id": 51,
    "claim": "Now close contact is being close within 2 meters of someone who is infected with SARS-CoV-2 virus for at least 15 minutes",
    "original": "Now close contact is being close within 2 meters of someone who is infected for at least 15 minutes",
    "negated_claim": null,
    "check_worthy": false,
    "changed": true
  },
  {
    "id": 52,
    "claim": "I'm sure all fruits and vegetables will help boost your immune system",
    "original": "I'm sure all fruits and vegetables will help boost your immune system",
    "negated_claim": "I'm sure all fruits and vegetables will help decrease your immune system",
    "negation_type": ["opposite"],
    "changed": false
  },
  {
    "id": 53,
    "claim": "It says the median incubation period was three days range of zero to 24",
    "original": "It says the median incubation period was three days range of zero to 24",
    "negated_claim": "It says the median incubation period was two months range of one to three months",
    "negation_type": ["quantity"],
    "changed": false
  },
  {
    "id": 54,
    "claim": "This receptor binding domain is made up of six amino acids, of which five are different from the first Corona virus to induce panic in the world",
    "original": "This receptor binding domain is made up of six amino acids, of which five are different from the first Corona virus to induce panic in the world",
    "negated_claim": null,
    "changed": false
  },
  {
    "id": 55,
    "claim": "So in the past vaccines were often developed from the disease causing organisms themselves and they had to be isolated and then adapted and then tested",
    "original": "So in the past vaccines were often developed from the disease causing organisms themselves and they had to be isolated and then adapted and then tested",
    "negated_claim": null,
    "changed": false
  },
  {
    "id": 56,
    "claim": "The scientific name is SARS [SARS-CoV-2]:Is a new virus responsible for an outbreak of respiratory illness known as [COVID-19] and that's the disease:COVID is COronaVIrusDisease-19 because it started in December of '19",
    "original": "The scientific name is SARS [SARS-CoV-2]:Is a new virus responsible for an outbreak of respiratory illness known as [COVID-19] and that's the disease:COVID is COronaVIrusDisease-19 because it started in December of '19",
    "negated_claim": null,
    "changed": false
  },
  {
    "id": 57,
    "claim": "There was one paper that came out of India that talked about, you know, four proteins that look like they were similar to HIV",
    "original": "There was one paper that came out of India that talked about, you know, four proteins that look like they were similar to HIV",
    "negated_claim": null,
    "changed": false
  },
  {
    "id": 58,
    "claim": "And whoever is putting these signal patterns out there, you know they they need to be triangulated, found, and exposed for what's been going on right? So So what exactly is the effect of the use of the five T? Are they spreading the infection, creating the infection? No, they're mutating it, mute the the the DNA of the virus is already is perfectly designed to spread on its own",
    "original": "And whoever is putting these signal patterns out there, you know they they need to be triangulated, found, and exposed for what's been going on right? So So what exactly is the effect of the use of the five T? Are they spreading the infection, creating the infection? No, they're mutating it, mute the the the DNA of the virus is already is perfectly designed to spread on its own",
    "negated_claim": null,
    "changed": false
  },
  {
    "id": 59,
    "claim": "SARS-CoV-2 virus could cause nausea, vomiting, and diarrhea in some people, but mostly it affects the respiratory tract",
    "original": "It could cause nausea, vomiting, and diarrhea in some people, but mostly it affects the respiratory tract",
    "negated_claim": null,
    "changed": true
  },
  {
    "id": 60,
    "claim": "By the way, do you know what the name of the coronavirus is today? The official name of coronavirus, not the disease, but the virus is \"SARS-CoV-2\"",
    "original": "By the way, do you know what the name of the coronavirus is today? The official name of coronavirus, not the disease, but the virus is \"SARS-CoV-2\"",
    "negated_claim": null,
    "changed": false
  },
  {
    "id": 61,
    "claim": "SARS was a coronavirus",
    "original": "SARS was a coronavirus",
    "negated_claim": "SARS was a rhinovirus",
    "negation_type": ["aspect"],
    "changed": false
  },
  {
    "id": 62,
    "claim": "If SARS-CoV-2 virus had not mutated in a particular way to make it infectious to humans, however, keep in mind that the virus would have to mutate multiple specific ways, creating a similarity in structure, but also a similarity in receptor binding domain plus another mutation I did not cover, but is in the review for it to become infectious, so it is far more likely that already prime viruses, like those in the Battan Penguin",
    "original": "If it had not mutated in a particular way to make it infectious to humans, however, keep in mind that the virus would have to mutate multiple specific ways, creating a similarity in structure, but also a similarity in receptor binding domain plus another mutation I did not cover, but is in the review for it to become infectious, so it is far more likely that already prime viruses, like those in the Battan Penguin",
    "negated_claim": null,
    "changed": true
  },
  {
    "id": 63,
    "claim": "Now SARS pretty much only transmitted once somebody was symptomatic",
    "original": "Now SARS pretty much only transmitted once somebody was symptomatic",
    "negated_claim": "Now SARS pretty much is always transmittable even when somebody was symptomatic",
    "negation_type": ["aspect", "opposite"],
    "changed": false
  },
  {
    "id": 64,
    "claim": "Well, the people more people have died from the flu than the coronavirus, and SARS-CoV-2 virus hasn't really killed",
    "original": "Well, the people more people have died from the flu than the coronavirus, and it hasn't really killed",
    "negated_claim": "Well, the people more people have died from the SARS-CoV-2 virus than the flu",
    "negation_type": ["opposite"],
    "changed": true
  },
  {
    "id": 65,
    "claim": "Hepatitis There are some expensive treatments for hepatitis, summerhaven, hepatitis, viruses, herpes does respond quite well to acyclovir",
    "original": "Hepatitis There are some expensive treatments for hepatitis, summerhaven, hepatitis, viruses, herpes does respond quite well to acyclovir",
    "negated_claim": null,
    "changed": false
  },
  {
    "id": 66,
    "claim": "Millions of these B cells and all these B cells do is they produce antibodies and these antibodies go out an attack cells that have the virus in it or the virus itself",
    "original": "Millions of these B cells and all these B cells do is they produce antibodies and these antibodies go out an attack cells that have the virus in it or the virus itself",
    "negated_claim": null,
    "changed": false
  },
  {
    "id": 67,
    "claim": "Coronavirus incubation could be as long as 27 days",
    "original": "Coronavirus incubation could be as long as 27 days",
    "negated_claim": "Coronavirus incubation could be as longer than 50 days",
    "negation_type": ["quantity"],
    "changed": false
  },
  {
    "id": 68,
    "claim": "Now what happens is this COVID-19 virus spread from an animal, probably probably from bats to an animal to humans",
    "original": "Now what happens is this COVID-19 virus spread from an animal, probably probably from bats to an animal to humans",
    "negated_claim": null,
    "changed": false
  },
  {
    "id": 69,
    "claim": "This process is called adsorption and only then can the virus get into the cell and we remembered yesterday that the virus can only reproduce inside the cell because they're actually pretty useless things",
    "original": "This process is called adsorption and only then can the virus get into the cell and we remembered yesterday that the virus can only reproduce inside the cell because they're actually pretty useless things",
    "negated_claim": null,
    "changed": false
  },
  {
    "id": 70,
    "claim": "But it looks like there was another mutation in this COVID-19 virus, which meant SARS-CoV-2 virus could be transmitted between humans, so that's what happened first",
    "original": "Is in the animals in the mujan market, where the virus is believed to have originated 2 animals, in particular abat and a pangolins bats have a coronavirus of their own that is 96% identical to our coronavirus, but we couldn't have gotten it from bats because of the spike protein I mentioned earlier",
    "negated_claim": null,
    "changed": true
  },
  {
    "id": 71,
    "claim": "Is in the animals in the mujan market, where the virus is believed to have originated 2 animals, in particular abat and a pangolins bats have a coronavirus of their own that is 96% identical to our coronavirus, but we couldn't have gotten SARS-CoV-2 virus from bats because of the spike protein I mentioned earlier",
    "original": "Is in the animals in the mujan market, where the virus is believed to have originated 2 animals, in particular abat and a pangolins bats have a coronavirus of their own that is 96% identical to our coronavirus, but we couldn't have gotten it from bats because of the spike protein I mentioned earlier",
    "negated_claim": null,
    "changed": true
  },
  {
    "id": 72,
    "claim": "The Wuhan Institute has studied coronaviruses in the past, including the strain that causes severe acute respiratory syndrome",
    "original": "The Wuhan Institute has studied coronaviruses in the past, including the strain that causes severe acute respiratory syndrome",
    "negated_claim": null,
    "changed": false
  },
  {
    "id": 73,
    "claim": "It was retracted because three of those proteins were proving not to be linked to HIV and they have not re published the paper since, so they",
    "original": "It was retracted because three of those proteins were proving not to be linked to HIV and they have not re published the paper since, so they",
    "negated_claim": null,
    "changed": false
  },
  {
    "id": 74,
    "claim": "And oddly enough, the Penguin coronavirus does have a similar receptor binding domain, so if these two animals were in close contact over and over again, these two viruses could have mutated and in a way cross pollinated to form our coronavirus that shares the necessary traits of both to effect humans",
    "original": "And oddly enough, the Penguin coronavirus does have a similar receptor binding domain, so if these two animals were in close contact over and over again, these two viruses could have mutated and in a way cross pollinated to form our coronavirus that shares the necessary traits of both to effect humans",
    "negated_claim": null,
    "check_worthy": false,
    "changed": false
  },
  {
    "id": 75,
    "claim": "That would would consist with SARS, which is already a weaponized coronavirus gain of function properties and HIV and as you know, those Indian scientists already did an analysis of the coronavirus and it was published online",
    "original": "That would would consist with SARS, which is already a weaponized coronavirus gain of function properties and HIV and as you know, those Indian scientists already did an analysis of the coronavirus and it was published online",
    "negated_claim": null,
    "changed": false
  },
  {
    "id": 76,
    "claim": "Quite a lot of people infected with SARS-CoV-2 virus may just have quite mild respiratory disease",
    "original": "Quite a lot of people being infected may just have quite mild respiratory disease",
    "negated_claim": "Anybody infected with SARS-CoV-2 virus has severe respiratory disease",
    "negation_type": ["quantity", "opposite"],
    "changed": true
  },
  {
    "id": 77,
    "claim": "Now some people have said that the vaccine may not work on mutated strains, and possible vaccine would need two vaccines instead of 1 vaccine",
    "original": "Now some people have said that the vaccine may not work on mutated strains, and possible vaccine would need two vaccines instead of 1 vaccine",
    "negated_claim": null,
    "changed": false
  },
  {
    "id": 78,
    "claim": "However, there are several coronaviruses that only infect animals, but if they do, crossover",
    "original": "However, there are several coronaviruses that only infect animals, but if they do, crossover",
    "negated_claim": null,
    "changed": false
  },
  {
    "id": 79,
    "claim": "Ebola is classified as a category Fay bioterrorism agent by the United States, Centers for Disease Control and Prevention, meaning it could be easily transmitted from person to person",
    "original": "Ebola is classified as a category Fay bioterrorism agent by the United States, Centers for Disease Control and Prevention, meaning it could be easily transmitted from person to person",
    "negated_claim": null,
    "changed": false
  },
  {
    "id": 80,
    "claim": "Did a study is on HIV protein in one of the specimens of the virus",
    "original": "Did a study is on HIV protein in one of the specimens of the virus",
    "negated_claim": null,
    "changed": false
  },
  {
    "id": 81,
    "claim": "How does the coronavirus actually kill people? There's a recent article in The Lancet that showed that a 41 people that were admitted to the hospital, six of them died and all of them were on ventilators and they died with something called a RDS and RDS is how the coronavirus kills",
    "original": "How does the coronavirus actually kill people? There's a recent article in The Lancet that showed that a 41 people that were admitted to the hospital, six of them died and all of them were on ventilators and they died with something called a RDS and RDS is how the coronavirus kills",
    "negated_claim": null,
    "changed": false
  },
  {
    "id": 82,
    "claim": "Reproduces inside the cell, then the cell gives out many, many thousands of copies of the virus that can then be coughed out to spread to other people, so that's looked",
    "original": "Reproduces inside the cell, then the cell gives out many, many thousands of copies of the virus that can then be coughed out to spread to other people, so that's looked",
    "negated_claim": null,
    "changed": false
  },
  {
    "id": 83,
    "claim": "This virus could have both a long incubation period as much as 14 days, and individuals could be contagious while asymptomatic, which was not the case with SARS in 2003",
    "original": "This virus could have both a long incubation period as much as 14 days, and individuals could be contagious while asymptomatic, which was not the case with SARS in 2003",
    "negated_claim": null,
    "changed": false
  },
  {
    "id": 84,
    "claim": "So if they're coughing, if they're sneezing trying avoid contact with them and try and maintain a gap of at least 2 meters from them, because this is a distance that's being shown a sneeze or cough can travel tip #5 if you're not feeling well, stay at home, even if it's something mild like the common cold",
    "original": "So if they're coughing, if they're sneezing trying avoid contact with them and try and maintain a gap of at least 2 meters from them, because this is a distance that's being shown a sneeze or cough can travel tip #5 if you're not feeling well, stay at home, even if it's something mild like the common cold",
    "negated_claim": null,
    "changed": false
  },
  {
    "id": 85,
    "claim": "Now, originally when these Chinese scientists were looking at it, 70% of the viruses they looked at had the L form genome",
    "original": "Now, originally when these Chinese scientists were looking at it, 70% of the viruses they looked at had the L form genome",
    "negated_claim": null,
    "changed": false
  },
  {
    "id": 86,
    "claim": "But there's some other interesting things we saw that lymphopenia that means low white blood cells were observed",
    "original": "But there's some other interesting things we saw that lymphopenia that means low white blood cells were observed",
    "negated_claim": null,
    "changed": false
  },
  {
    "id": 87,
    "claim": "There are at least two known instances of a SARS type coronavirus being released from the Beijing lab",
    "original": "There are at least two known instances of a SARS type coronavirus being released from the Beijing lab",
    "negated_claim": null,
    "changed": false
  },
  {
    "id": 88,
    "claim": "SARS-CoV-2 virus is a virus that attacks your upper respiratory system",
    "original": "SARS-CoV-2 virus is a virus that attacks your upper respiratory system",
    "negated_claim": "SARS-CoV-2 virus is a virus that attacks your nervous system",
    "negation_type": ["aspect"],
    "changed": false
  },
  {
    "id": 89,
    "claim": "There are at least two known instances of a SARS type coronavirus being released from the Beijing lab",
    "original": "There are at least two known instances of a SARS type coronavirus being released from the Beijing lab",
    "negated_claim": null,
    "changed": false
  },
  {
    "id": 90,
    "claim": "Coronavirus is a zoonotic disease",
    "original": "Coronavirus is a zoo nautic",
    "negated_claim": "Coronavirus is a non-zoonotic disease",
    "negation_type": ["opposite"],
    "changed": true
  },
  {
    "id": 91,
    "claim": "the Iranian regime mimicking a Chinese conspiracy theory about the source of the CCP virus, saying US medicine is a way to spread the virus more",
    "original": "the Iranian regime mimicking a Chinese conspiracy theory about the source of the CCP virus, saying US medicine is a way to spread the virus more",
    "negated_claim": null,
    "changed": false
  },
  {
    "id": 92,
    "claim": "The incubation period is 14 days and people can have the coronavirus and transmitted, but still be asymptomatic",
    "original": "The incubation period is 14 days and people can have the coronavirus and transmitted, but still be asymptomatic",
    "negated_claim": null,
    "changed": false
  },
  {
    "id": 93,
    "claim": "So for example, if someone was infected with the S, they'll make antibodies to the S type",
    "original": "So for example, if someone was infected with the S, they'll make antibodies to the S type",
    "negated_claim": null,
    "changed": false
  },
  {
    "id": 94,
    "claim": "Once attached, it can affect the cell that receptor binding domain is made up of a series of amino acids, just like all proteins are made of amino acids",
    "original": "Once attached, it can affect the cell that receptor binding domain is made up of a series of amino acids, just like all proteins are made of amino acids",
    "negated_claim": null,
    "changed": false
  },
  {
    "id": 95,
    "claim": "So for example, most viruses are bacteriophages",
    "original": "So for example, most viruses are bacteriophages",
    "negated_claim": null,
    "changed": false
  },
  {
    "id": 96,
    "claim": "She and her team went South to Yunnan Province, all the way Deep South of China is very beautiful there, and she found out that SARS like viruses originally came from bats",
    "original": "She and her team went South to Yunnan Province, all the way Deep South of China is very beautiful there, and she found out that SARS like viruses originally came from bats",
    "negated_claim": null,
    "changed": false
  },
  {
    "id": 97,
    "claim": "So we now have these two forms, so the single single ancestral S form is now carried on as the S form, but there's this branch off this mutation called the L Form, so we now have these two",
    "original": "So we now have these two forms, so the single single ancestral S form is now carried on as the S form, but there's this branch off this mutation called the L Form, so we now have these two",
    "negated_claim": null,
    "changed": false
  },
  {
    "id": 98,
    "claim": "And finally when the infection is done then these B cells just kind of go away, but there's always a certain amount of a population of these B cells ready to strike again",
    "original": "And finally when the infection is done then these B cells just kind of go away, but there's always a certain amount of a population of these B cells ready to strike again",
    "negated_claim": null,
    "changed": false
  },
  {
    "id": 99,
    "claim": "That happened in this mutation, but what that meant was that there's now 2 main lineages",
    "original": "That happened in this mutation, but what that meant was that there's now 2 main lineages",
    "negated_claim": null,
    "changed": false
  }
]