{
  "-1": {
    "precision": 0.0,
    "recall": 0.0,
    "f1-score": 0.0,
    "support": 0
  },
  "0": {
    "precision": 0.8823529411764706,
    "recall": 0.8823529411764706,
    "f1-score": 0.8823529411764706,
    "support": 17
  },
  "1": {
    "precision": 0.0,
    "recall": 0.0,
    "f1-score": 0.0,
    "support": 2
  },
  "accuracy": 0.7894736842105263,
  "macro avg": {
    "precision": 0.29411764705882354,
    "recall": 0.29411764705882354,
    "f1-score": 0.29411764705882354,
    "support": 19
  },
  "weighted avg": {
    "precision": 0.7894736842105263,
    "recall": 0.7894736842105263,
    "f1-score": 0.7894736842105263,
    "support": 19
  }
}