{"claim_id": 0, "anno": {"http://arxiv.org/abs/2010.07036v1": 0, "https://www.medrxiv.org/content/10.1101/2020.10.21.20215038v2": 0, "https://www.medrxiv.org/content/10.1101/2020.12.24.20248822v2": 0, "https://www.medrxiv.org/content/10.1101/2021.02.04.21251012v1": 0, "https://www.biorxiv.org/content/10.1101/2021.01.07.425698v1": 0}}
{"claim_id": 1, "anno": {"http://arxiv.org/abs/1611.07700v2": 0}}
{"claim_id": 3, "anno": {"http://arxiv.org/abs/1504.01607v1": 1, "http://arxiv.org/abs/2007.09745v1": 0}}
{"claim_id": 5, "anno": {"http://arxiv.org/abs/2004.08920v1": 0, "https://www.medrxiv.org/content/10.1101/2021.02.04.21251134v1": 0, "http://arxiv.org/abs/2012.02151v1": 0, "http://arxiv.org/abs/2010.04115v1": 1, "http://arxiv.org/abs/2005.10831v1": 1, "http://arxiv.org/abs/2005.10028v1": 1}}
{"claim_id": 6, "anno": {"http://arxiv.org/abs/2006.03716v2": 0, "http://arxiv.org/abs/2004.06307v3": 0, "http://arxiv.org/abs/2003.04005v1": 0}}
{"claim_id": 7, "anno": {"https://www.biorxiv.org/content/10.1101/2020.10.25.353227v1": 0, "https://www.biorxiv.org/content/10.1101/2021.01.31.428824v1": 0, "https://www.medrxiv.org/content/10.1101/2020.11.14.20231878v1": 0}}
{"claim_id": 8, "anno": {"http://arxiv.org/abs/2004.00746v1": 0, "http://arxiv.org/abs/2011.12350v1": 0}}
{"claim_id": 9, "anno": {"http://arxiv.org/abs/2006.06177v2": 0}}
{"claim_id": 10, "anno": {"https://www.medrxiv.org/content/10.1101/2020.12.09.20246652v1": 0}}
{"claim_id": 11, "anno": {"http://arxiv.org/abs/1509.04436v1": 0, "http://arxiv.org/abs/2009.05716v1": 0, "http://arxiv.org/abs/2005.03998v2": 0, "https://www.medrxiv.org/content/10.1101/2021.02.05.21250672v1": 0}}
{"claim_id": 13, "anno": {"https://www.biorxiv.org/content/10.1101/2020.11.13.380733v1": 0}}
{"claim_id": 14, "anno": {"http://arxiv.org/abs/2004.01453v4": 1, "http://arxiv.org/abs/1808.02531v1": 0, "http://arxiv.org/abs/2011.05521v1": 0, "http://arxiv.org/abs/1905.01778v1": 0, "https://www.biorxiv.org/content/10.1101/2021.01.04.425359v2": 0}}
{"claim_id": 17, "anno": {"https://www.medrxiv.org/content/10.1101/2021.02.01.21250944v1": 0, "https://www.biorxiv.org/content/10.1101/2021.02.01.429110v1": 0, "http://arxiv.org/abs/1206.1029v1": 0, "http://arxiv.org/abs/1308.5365v2": 1}}
{"claim_id": 18, "anno": {"http://arxiv.org/abs/2007.05055v1": 0, "https://www.medrxiv.org/content/10.1101/2020.09.04.20188433v2": 0, "http://arxiv.org/abs/2005.02809v1": 0, "https://www.medrxiv.org/content/10.1101/2021.02.04.21250683v1": 0, "http://arxiv.org/abs/2003.10965v1": 0}}
{"claim_id": 19, "anno": {"https://www.medrxiv.org/content/10.1101/2021.02.04.21251111v1": 0, "https://www.medrxiv.org/content/10.1101/2021.01.21.21249764v1": 0}}
{"claim_id": 20, "anno": {"http://arxiv.org/abs/2009.09911v1": 0, "http://arxiv.org/abs/2009.11288v2": 0, "http://arxiv.org/abs/2003.10965v1": 1}}
{"claim_id": 21, "anno": {"http://arxiv.org/abs/2011.05154v1": 1, "http://arxiv.org/abs/2008.01841v2": 0, "http://arxiv.org/abs/2012.00676v2": 0}}
{"claim_id": 22, "anno": {"http://arxiv.org/abs/1204.6226v1": 0, "http://arxiv.org/abs/2003.10650v1": 0}}
{"claim_id": 23, "anno": {"http://arxiv.org/abs/2012.00589v1": 0}}
{"claim_id": 24, "anno": {"http://arxiv.org/abs/2002.06563v2": 0}}
{"claim_id": 25, "anno": {"http://arxiv.org/abs/2005.00004v1": 1}}
{"claim_id": 26, "anno": {"http://arxiv.org/abs/2003.09444v1": 0}}
{"claim_id": 27, "anno": {"http://arxiv.org/abs/1304.3480v1": 0, "http://arxiv.org/abs/1812.05440v1": 0, "http://arxiv.org/abs/2006.15469v1": 1, "http://arxiv.org/abs/2012.07655v2": 1, "http://arxiv.org/abs/2012.00676v2": 0}}
{"claim_id": 28, "anno": {"http://arxiv.org/abs/2004.07743v4": 0, "http://arxiv.org/abs/2004.03575v10": 0}}
{"claim_id": 29, "anno": {"http://arxiv.org/abs/2009.05285v1": 1, "http://arxiv.org/abs/2010.07826v2": -1}}
{"claim_id": 30, "anno": {"https://www.medrxiv.org/content/10.1101/2021.02.05.21250672v1": 0, "https://www.medrxiv.org/content/10.1101/2021.02.06.21251214v1": 0}}
{"claim_id": 31, "anno": {"http://arxiv.org/abs/2005.05882v1": 1, "http://arxiv.org/abs/1608.06242v1": 0, "https://www.biorxiv.org/content/10.1101/2020.11.29.402966v2": 0}}
{"claim_id": 32, "anno": {"http://arxiv.org/abs/1311.4290v1": 0, "https://www.medrxiv.org/content/10.1101/2020.08.17.20176271v1": 0}}
{"claim_id": 34, "anno": {"http://arxiv.org/abs/2005.06199v2": 0, "http://arxiv.org/abs/2003.13655v4": 0, "http://arxiv.org/abs/2003.05200v1": 0}}
{"claim_id": 35, "anno": {"https://www.medrxiv.org/content/10.1101/2020.10.25.20219279v2": 0, "http://arxiv.org/abs/2003.09501v1": 0, "http://arxiv.org/abs/2006.08608v1": 0}}
{"claim_id": 36, "anno": {"http://arxiv.org/abs/2101.01916v1": 0}}
{"claim_id": 38, "anno": {"http://arxiv.org/abs/2004.10641v1": 1, "http://arxiv.org/abs/2010.02154v1": 1, "http://arxiv.org/abs/2006.15469v1": 1}}
{"claim_id": 39, "anno": {"http://arxiv.org/abs/2003.09501v1": 0}}
{"claim_id": 40, "anno": {"http://arxiv.org/abs/q-bio/0401022v1": 0, "http://arxiv.org/abs/cond-mat/0209613v1": 1}}
{"claim_id": 42, "anno": {"http://arxiv.org/abs/1810.01613v3": 0}}
{"claim_id": 43, "anno": {"http://arxiv.org/abs/1404.2678v1": 0, "http://arxiv.org/abs/1210.3154v1": 0}}
{"claim_id": 45, "anno": {"http://arxiv.org/abs/1708.08160v1": 0}}
{"claim_id": 46, "anno": {"https://www.medrxiv.org/content/10.1101/2021.02.08.21251205v1": 0}}
{"claim_id": 47, "anno": {"http://arxiv.org/abs/2003.09501v1": 1}}
{"claim_id": 49, "anno": {"http://arxiv.org/abs/2012.07742v1": 0, "https://www.biorxiv.org/content/10.1101/490532v1": 0, "http://arxiv.org/abs/1905.02607v1": 0}}
{"claim_id": 50, "anno": {"https://www.biorxiv.org/content/10.1101/2020.04.09.033928v1": 0, "http://arxiv.org/abs/2009.09911v1": -1, "https://www.biorxiv.org/content/10.1101/2020.04.24.057430v1": 0}}
{"claim_id": 52, "anno": {"https://www.biorxiv.org/content/10.1101/2021.02.03.429676v1": 0, "https://www.medrxiv.org/content/10.1101/2021.02.04.21251155v1": 0, "http://arxiv.org/abs/1306.6206v1": 0, "https://www.medrxiv.org/content/10.1101/2021.02.05.21251105v1": 0, "https://www.medrxiv.org/content/10.1101/2021.02.04.21249454v1": 0}}
{"claim_id": 53, "anno": {"http://arxiv.org/abs/1603.00778v1": 0}}
{"claim_id": 54, "anno": {"http://arxiv.org/abs/1606.02151v2": 0}}
{"claim_id": 56, "anno": {"https://www.medrxiv.org/content/10.1101/2021.02.03.21250823v1": 0}}
{"claim_id": 59, "anno": {"http://arxiv.org/abs/2007.09191v1": 0, "http://arxiv.org/abs/1804.03939v1": 0}}
{"claim_id": 60, "anno": {"http://arxiv.org/abs/2004.12463v1": 0, "http://arxiv.org/abs/2003.10965v1": 1, "http://arxiv.org/abs/2004.06307v3": 0, "http://arxiv.org/abs/2002.05695v1": 0}}
{"claim_id": 61, "anno": {"https://www.biorxiv.org/content/10.1101/2021.02.08.430254v1": 1, "https://www.medrxiv.org/content/10.1101/2021.02.08.21250525v1": 0, "http://arxiv.org/abs/2009.09911v1": 1, "http://arxiv.org/abs/2003.10965v1": 1}}
{"claim_id": 63, "anno": {"http://arxiv.org/abs/2008.12104v1": 0}}
{"claim_id": 64, "anno": {"https://www.medrxiv.org/content/10.1101/2020.11.04.20225912v1": 0, "http://arxiv.org/abs/2002.05695v1": 0, "http://arxiv.org/abs/2011.09033v2": 0}}
{"claim_id": 67, "anno": {"http://arxiv.org/abs/1603.00778v1": 0, "http://arxiv.org/abs/2004.07743v4": 0}}
{"claim_id": 68, "anno": {"http://arxiv.org/abs/2009.09911v1": 1, "https://www.biorxiv.org/content/10.1101/2020.12.24.422670v1": 1, "https://www.medrxiv.org/content/10.1101/2020.04.30.20086496v2": 0}}
{"claim_id": 69, "anno": {"https://www.biorxiv.org/content/10.1101/2020.09.16.297945v2": 0}}
{"claim_id": 70, "anno": {"http://arxiv.org/abs/2010.07036v1": 0, "http://arxiv.org/abs/1303.5177v1": 0, "http://arxiv.org/abs/1610.04470v1": 0}}
{"claim_id": 72, "anno": {"http://arxiv.org/abs/2006.08608v1": 1, "http://arxiv.org/abs/2006.03901v1": 1}}
{"claim_id": 74, "anno": {"http://arxiv.org/abs/2002.06196v1": 0, "http://arxiv.org/abs/1412.4034v1": 0}}
{"claim_id": 75, "anno": {"http://arxiv.org/abs/2011.12567v1": -1}}
{"claim_id": 76, "anno": {"http://arxiv.org/abs/2009.07362v1": 0, "https://www.medrxiv.org/content/10.1101/2020.12.24.20248802v2": 0, "http://arxiv.org/abs/2002.05534v2": 0, "http://arxiv.org/abs/2005.05882v1": 1}}
{"claim_id": 77, "anno": {"http://arxiv.org/abs/1909.08311v2": 0}}
{"claim_id": 78, "anno": {"http://arxiv.org/abs/2003.07434v2": 0}}
{"claim_id": 79, "anno": {"http://arxiv.org/abs/2004.10082v1": 0, "http://arxiv.org/abs/1703.01368v1": 1}}
{"claim_id": 80, "anno": {"http://arxiv.org/abs/1404.2678v1": 0, "https://www.biorxiv.org/content/10.1101/2021.02.03.429530v1": 0, "http://arxiv.org/abs/1911.05423v1": 0}}
{"claim_id": 82, "anno": {"http://arxiv.org/abs/2007.10806v1": 0, "http://arxiv.org/abs/2002.10616v1": 0}}
{"claim_id": 83, "anno": {"http://arxiv.org/abs/2006.03034v2": 1, "http://arxiv.org/abs/2006.04646v3": 0, "http://arxiv.org/abs/2002.03268v1": 0}}
{"claim_id": 84, "anno": {"http://arxiv.org/abs/2007.07598v1": 1}}
{"claim_id": 86, "anno": {"https://www.medrxiv.org/content/10.1101/2020.11.10.20228809v1": 0}}
{"claim_id": 87, "anno": {"http://arxiv.org/abs/2003.14150v1": 0, "https://www.medrxiv.org/content/10.1101/2020.08.27.20183483v2": 0, "https://www.medrxiv.org/content/10.1101/2020.07.06.20146712v1": 0}}
{"claim_id": 88, "anno": {"https://www.biorxiv.org/content/10.1101/739003v3": 0, "https://www.medrxiv.org/content/10.1101/2021.02.01.21250878v1": 0, "http://arxiv.org/abs/2006.15469v1": 1, "http://arxiv.org/abs/1908.08482v1": 0}}
{"claim_id": 89, "anno": {"http://arxiv.org/abs/2003.14150v1": 0, "https://www.medrxiv.org/content/10.1101/2020.08.27.20183483v2": 0, "https://www.medrxiv.org/content/10.1101/2020.07.06.20146712v1": 0}}
{"claim_id": 90, "anno": {"https://www.medrxiv.org/content/10.1101/2020.08.26.20182766v2": 0, "https://www.medrxiv.org/content/10.1101/2020.09.08.20190769v1": 0, "http://arxiv.org/abs/1912.09429v1": 0}}
{"claim_id": 92, "anno": {"http://arxiv.org/abs/2004.03575v10": 0, "http://arxiv.org/abs/2002.05296v3": 1, "https://www.medrxiv.org/content/10.1101/2021.02.06.21251270v1": 0, "http://arxiv.org/abs/2004.02601v1": 1, "http://arxiv.org/abs/2005.05523v1": 1}}
{"claim_id": 93, "anno": {"http://arxiv.org/abs/physics/0510005v2": 0, "http://arxiv.org/abs/1311.4290v1": 0, "http://arxiv.org/abs/1202.0117v2": 0}}
{"claim_id": 94, "anno": {"http://arxiv.org/abs/2009.11288v2": 0, "https://www.medrxiv.org/content/10.1101/2020.06.19.20135509v1": 0, "http://arxiv.org/abs/1807.04425v2": 0}}
{"claim_id": 95, "anno": {"https://www.medrxiv.org/content/10.1101/2020.04.17.20068577v2": 0, "http://arxiv.org/abs/1711.08242v1": 0, "http://arxiv.org/abs/1108.5905v1": 0}}
{"claim_id": 97, "anno": {"http://arxiv.org/abs/1304.2365v1": 0, "https://www.biorxiv.org/content/10.1101/2020.11.10.376574v2": 0, "https://www.biorxiv.org/content/10.1101/2020.11.12.380675v1": 0}}
{"claim_id": 99, "anno": {"https://www.biorxiv.org/content/10.1101/166520v9": 0}}
