{
  "results": [
    {
      "video_title": "",
      "evidences": [
        {
          "id": 0,
          "claim": "The minority of people who get COVID-19 will recover",
          "evidences": []
        },
        {
          "id": 3,
          "claim": "Many of the viruses that infect humans are of plant origin source",
          "evidences": []
        },
        {
          "id": 6,
          "claim": "Officials announced that the novel coronavirus are not transmitted between humans",
          "evidences": []
        },
        {
          "id": 9,
          "claim": "The symptoms of Covid are like loss of sight",
          "evidences": []
        },
        {
          "id": 11,
          "claim": "In fact, people age of 1 or under are susceptible to the coronavirus as it causes severe symptoms",
          "evidences": []
        },
        {
          "id": 13,
          "claim": "They're looking at statistics here and they're saying that the coronavirus is less lethal than the flu",
          "evidences": []
        },
        {
          "id": 14,
          "claim": "SARS-CoV-2 is less contagious in the first two weeks of incubation in patients with no symptoms",
          "evidences": []
        },
        {
          "id": 17,
          "claim": "The flu vaccine does not protect against influenza",
          "evidences": []
        },
        {
          "id": 21,
          "claim": "Then SARS-CoV-2 goes into the liver and it can cause blood to clot",
          "evidences": []
        },
        {
          "id": 27,
          "claim": "It's a SARS-CoV-2 virus that causes high blood pressure, and it attacks your heart",
          "evidences": []
        },
        {
          "id": 28,
          "claim": "Yes, it comes out to 2 days, but that's not the incubation period of this infection to this symptom",
          "evidences": []
        },
        {
          "id": 29,
          "claim": "So how is coronavirus spread? Well, we don't know exactly how SARS-CoV-2 virus spread from person to person, but similar viruses spread through only touch contact",
          "evidences": []
        },
        {
          "id": 32,
          "claim": "So although SARS-CoV-2 virus can be killed with antibiotics, SARS-CoV-2 virus is highly contagious and human immune systems don't have antibodies to this particular virus just yet",
          "evidences": []
        },
        {
          "id": 35,
          "claim": "The Who also mentioned though, that just the flu is less contagious than this SARS-CoV-2 coronavirus",
          "evidences": []
        },
        {
          "id": 38,
          "claim": "So what are the symptoms of coronavirus? Well, it can include any of the following the loss of sight and memory",
          "evidences": []
        },
        {
          "id": 39,
          "claim": "OK, so as the five G does not cause any flu like symptoms in Wuhan, China",
          "evidences": []
        },
        {
          "id": 40,
          "claim": "The professor said that the viruses normally,only have major mutations in the form of multiple changes in chemical conditions",
          "evidences": []
        },
        {
          "id": 42,
          "claim": "So now you got a souped up juiced up version of this coronavirus with elements of Parkinson's disease",
          "evidences": []
        },
        {
          "id": 50,
          "claim": "In the past it was possible for bats to transmit coronavirus",
          "evidences": []
        },
        {
          "id": 52,
          "claim": "I'm sure all fruits and vegetables will help decrease your immune system",
          "evidences": []
        },
        {
          "id": 53,
          "claim": "It says the median incubation period was two months range of one to three months",
          "evidences": []
        },
        {
          "id": 61,
          "claim": "SARS was a rhinovirus",
          "evidences": []
        },
        {
          "id": 63,
          "claim": "Now SARS pretty much is always transmittable even when somebody was symptomatic",
          "evidences": []
        },
        {
          "id": 64,
          "claim": "Well, the people more people have died from the SARS-CoV-2 virus than the flu",
          "evidences": []
        },
        {
          "id": 67,
          "claim": "Coronavirus incubation could be as longer than 50 days",
          "evidences": []
        },
        {
          "id": 76,
          "claim": "Anybody infected with SARS-CoV-2 virus has severe respiratory disease",
          "evidences": []
        },
        {
          "id": 88,
          "claim": "SARS-CoV-2 virus is a virus that attacks your nervous system",
          "evidences": []
        },
        {
          "id": 90,
          "claim": "Coronavirus is a non-zoonotic disease",
          "evidences": []
        }
      ]
    }
  ]
}