{"claim_id": 0, "anno": {"http://arxiv.org/abs/2010.07036v1": 0, "https://www.medrxiv.org/content/10.1101/2020.10.21.20215038v2": 0, "https://www.medrxiv.org/content/10.1101/2020.12.24.20248822v2": 0, "https://www.medrxiv.org/content/10.1101/2021.02.04.21251012v1": 0, "https://www.biorxiv.org/content/10.1101/2021.01.07.425698v1": 0}}
{"claim_id": 3, "anno": {"http://arxiv.org/abs/1504.01607v1": -1, "http://arxiv.org/abs/2007.09745v1": 0}}
{"claim_id": 6, "anno": {"http://arxiv.org/abs/2006.03716v2": 0, "http://arxiv.org/abs/2004.06307v3": 0, "http://arxiv.org/abs/2003.04005v1": 0}}
{"claim_id": 9, "anno": {"http://arxiv.org/abs/2006.06177v2": 0}}
{"claim_id": 11, "anno": {"http://arxiv.org/abs/1509.04436v1": 0, "http://arxiv.org/abs/2009.05716v1": 0, "http://arxiv.org/abs/2005.03998v2": 0, "https://www.medrxiv.org/content/10.1101/2021.02.05.21250672v1": 0}}
{"claim_id": 13, "anno": {"https://www.biorxiv.org/content/10.1101/2020.11.13.380733v1": 0}}
{"claim_id": 14, "anno": {"http://arxiv.org/abs/2004.01453v4": -1, "http://arxiv.org/abs/1808.02531v1": 0, "http://arxiv.org/abs/2011.05521v1": 0, "http://arxiv.org/abs/1905.01778v1": 0, "https://www.biorxiv.org/content/10.1101/2021.01.04.425359v2": 0}}
{"claim_id": 17, "anno": {"https://www.medrxiv.org/content/10.1101/2021.02.01.21250944v1": 0, "https://www.biorxiv.org/content/10.1101/2021.02.01.429110v1": 0, "http://arxiv.org/abs/1206.1029v1": 0, "http://arxiv.org/abs/1308.5365v2": -1}}
{"claim_id": 21, "anno": {"http://arxiv.org/abs/2011.05154v1": -1, "http://arxiv.org/abs/2008.01841v2": 0, "http://arxiv.org/abs/2012.00676v2": 0}}
{"claim_id": 27, "anno": {"http://arxiv.org/abs/1304.3480v1": 0, "http://arxiv.org/abs/1812.05440v1": 0, "http://arxiv.org/abs/2006.15469v1": -1, "http://arxiv.org/abs/2012.07655v2": -1, "http://arxiv.org/abs/2012.00676v2": 0}}
{"claim_id": 28, "anno": {"http://arxiv.org/abs/2004.07743v4": 0, "http://arxiv.org/abs/2004.03575v10": 0}}
{"claim_id": 29, "anno": {"http://arxiv.org/abs/2009.05285v1": -1, "http://arxiv.org/abs/2010.07826v2": 1}}
{"claim_id": 32, "anno": {"http://arxiv.org/abs/1311.4290v1": 0, "https://www.medrxiv.org/content/10.1101/2020.08.17.20176271v1": 0}}
{"claim_id": 35, "anno": {"https://www.medrxiv.org/content/10.1101/2020.10.25.20219279v2": 0, "http://arxiv.org/abs/2003.09501v1": 0, "http://arxiv.org/abs/2006.08608v1": 0}}
{"claim_id": 38, "anno": {"http://arxiv.org/abs/2004.10641v1": -1, "http://arxiv.org/abs/2010.02154v1": -1, "http://arxiv.org/abs/2006.15469v1": -1}}
{"claim_id": 39, "anno": {"http://arxiv.org/abs/2003.09501v1": 0}}
{"claim_id": 40, "anno": {"http://arxiv.org/abs/q-bio/0401022v1": 0, "http://arxiv.org/abs/cond-mat/0209613v1": -1}}
{"claim_id": 42, "anno": {"http://arxiv.org/abs/1810.01613v3": 0}}
{"claim_id": 50, "anno": {"https://www.biorxiv.org/content/10.1101/2020.04.09.033928v1": 0, "http://arxiv.org/abs/2009.09911v1": 1, "https://www.biorxiv.org/content/10.1101/2020.04.24.057430v1": 0}}
{"claim_id": 52, "anno": {"https://www.biorxiv.org/content/10.1101/2021.02.03.429676v1": 0, "https://www.medrxiv.org/content/10.1101/2021.02.04.21251155v1": 0, "http://arxiv.org/abs/1306.6206v1": 0, "https://www.medrxiv.org/content/10.1101/2021.02.05.21251105v1": 0, "https://www.medrxiv.org/content/10.1101/2021.02.04.21249454v1": 0}}
{"claim_id": 53, "anno": {"http://arxiv.org/abs/1603.00778v1": 0}}
{"claim_id": 61, "anno": {"https://www.biorxiv.org/content/10.1101/2021.02.08.430254v1": -1, "https://www.medrxiv.org/content/10.1101/2021.02.08.21250525v1": 0, "http://arxiv.org/abs/2009.09911v1": -1, "http://arxiv.org/abs/2003.10965v1": -1}}
{"claim_id": 63, "anno": {"http://arxiv.org/abs/2008.12104v1": 0}}
{"claim_id": 64, "anno": {"https://www.medrxiv.org/content/10.1101/2020.11.04.20225912v1": 0, "http://arxiv.org/abs/2002.05695v1": 0, "http://arxiv.org/abs/2011.09033v2": 0}}
{"claim_id": 67, "anno": {"http://arxiv.org/abs/1603.00778v1": 0, "http://arxiv.org/abs/2004.07743v4": 0}}
{"claim_id": 76, "anno": {"http://arxiv.org/abs/2009.07362v1": 0, "https://www.medrxiv.org/content/10.1101/2020.12.24.20248802v2": 0, "http://arxiv.org/abs/2002.05534v2": 0, "http://arxiv.org/abs/2005.05882v1": -1}}
{"claim_id": 88, "anno": {"https://www.biorxiv.org/content/10.1101/739003v3": 0, "https://www.medrxiv.org/content/10.1101/2021.02.01.21250878v1": 0, "http://arxiv.org/abs/2006.15469v1": -1, "http://arxiv.org/abs/1908.08482v1": 0}}
{"claim_id": 90, "anno": {"https://www.medrxiv.org/content/10.1101/2020.08.26.20182766v2": 0, "https://www.medrxiv.org/content/10.1101/2020.09.08.20190769v1": 0, "http://arxiv.org/abs/1912.09429v1": 0}}
