{
  "-1": {
    "precision": 0.0,
    "recall": 0.0,
    "f1-score": 0.0,
    "support": 0
  },
  "0": {
    "precision": 1.0,
    "recall": 0.8823529411764706,
    "f1-score": 0.9375,
    "support": 17
  },
  "1": {
    "precision": 0.5,
    "recall": 1.0,
    "f1-score": 0.6666666666666666,
    "support": 2
  },
  "micro avg": {
    "precision": 0.8947368421052632,
    "recall": 0.8947368421052632,
    "f1-score": 0.8947368421052632,
    "support": 19
  },
  "macro avg": {
    "precision": 0.5,
    "recall": 0.6274509803921569,
    "f1-score": 0.5347222222222222,
    "support": 19
  },
  "weighted avg": {
    "precision": 0.9473684210526315,
    "recall": 0.8947368421052632,
    "f1-score": 0.9089912280701754,
    "support": 19
  }
}