[
  {
    "threshold": 0.3,
    "accuracy": 0.7734375,
    "standard deviation": 0.06929236820651079,
    "median": 0.78125
  },
  {
    "threshold": 0.35,
    "accuracy": 0.78125,
    "standard deviation": 0.07654655446197431,
    "median": 0.796875
  },
  {
    "threshold": 0.4,
    "accuracy": 0.765625,
    "standard deviation": 0.08267972847076846,
    "median": 0.78125
  },
  {
    "threshold": 0.45,
    "accuracy": 0.7578125,
    "standard deviation": 0.073840869160197,
    "median": 0.78125
  },
  {
    "threshold": 0.5,
    "accuracy": 0.75,
    "standard deviation": 0.05103103630798288,
    "median": 0.75
  },
  {
    "threshold": 0.55,
    "accuracy": 0.75,
    "standard deviation": 0.05103103630798288,
    "median": 0.75
  },
  {
    "threshold": 0.6000000000000001,
    "accuracy": 0.7421875,
    "standard deviation": 0.053369535239372906,
    "median": 0.734375
  },
  {
    "threshold": 0.65,
    "accuracy": 0.734375,
    "standard deviation": 0.040343576522993925,
    "median": 0.734375
  }
]