{
  "data": [
    {
      "title": "",
      "claims": [
        {
          "claim": "There are at least two known instances of a SARS type coronavirus being released from the Beijing lab",
          "checkworthy": 1,
          "prob": 0.6850905418395996
        },
        {
          "claim": "Coronaviruses are a large family of viruses ranging in severity from a common cold, which is almost harmless to MERS or Middle Eastern respiratory syndrome, which can kill over 1/3 of its patients and SARS, which can kill about 12% of its victims",
          "checkworthy": 1,
          "prob": 0.8240039348602295
        },
        {
          "claim": "The Who also mentioned though, that just the flu is more contagious than this new coronavirus",
          "checkworthy": 1,
          "prob": 0.6388343572616577
        },
        {
          "claim": "Genital cold source can cause more serious infections",
          "checkworthy": 1,
          "prob": 0.6406602263450623
        },
        {
          "claim": "So for example, most viruses are bacteriophages",
          "checkworthy": 1,
          "prob": 0.5490148067474365
        },
        {
          "claim": "The flu vaccine protects against influenza",
          "checkworthy": 1,
          "prob": 0.6236875057220459
        },
        {
          "claim": "The great majority of people who get COVID-19 will recover",
          "checkworthy": 1,
          "prob": 0.651089072227478
        },
        {
          "claim": "That happened in this mutation, but what that meant was that there's now 2 main lineages",
          "checkworthy": 1,
          "prob": 0.6637694239616394
        },
        {
          "claim": "Now what happens is this COVID-19 virus spread from an animal, probably probably from bats to an animal to humans",
          "checkworthy": 1,
          "prob": 0.7524073719978333
        },
        {
          "claim": "Coronavirus incubation could be as long as 27 days",
          "checkworthy": 1,
          "prob": 0.6743226051330566
        },
        {
          "claim": "Now SARS pretty much only transmitted once somebody was symptomatic",
          "checkworthy": 1,
          "prob": 0.8495811820030212
        },
        {
          "claim": "A new type of viral pneumonia in the same family of infections as SARS and MERS",
          "checkworthy": 1,
          "prob": 0.5323877930641174
        },
        {
          "claim": "It is highly contagious up to two week incubation in patients with no symptoms",
          "checkworthy": 1,
          "prob": 0.6698093414306641
        },
        {
          "claim": "SARS was a coronavirus",
          "checkworthy": 1,
          "prob": 0.7934688329696655
        },
        {
          "claim": "Fang said that these four amino acids made the disease easier to transmit",
          "checkworthy": 1,
          "prob": 0.6944154500961304
        },
        {
          "claim": "There was one paper that came out of India that talked about, you know, four proteins that look like they were similar to HIV",
          "checkworthy": 1,
          "prob": 0.7618118524551392
        },
        {
          "claim": "The incubation period is 14 days and people can have the coronavirus and transmitted, but still be asymptomatic",
          "checkworthy": 1,
          "prob": 0.6861402988433838
        },
        {
          "claim": "Many of the viruses that infect humans are of animal origin source",
          "checkworthy": 1,
          "prob": 0.6850972771644592
        },
        {
          "claim": "Well, the people more people have died from the flu than the coronavirus, and it hasn't really killed",
          "checkworthy": 1,
          "prob": 0.8611064553260803
        },
        {
          "claim": "Unfortunately, there is no treatment currently for the coronavirus",
          "checkworthy": 1,
          "prob": 0.5259989500045776
        },
        {
          "claim": "It was retracted because three of those proteins were proving not to be linked to HIV and they have not re published the paper since, so they",
          "checkworthy": 1,
          "prob": 0.842048704624176
        },
        {
          "claim": "Did a study is on HIV protein in one of the specimens of the virus",
          "checkworthy": 1,
          "prob": 0.8237695097923279
        },
        {
          "claim": "So now you got a souped up juiced up version of this coronavirus with elements of tuberculosis",
          "checkworthy": 1,
          "prob": 0.6434569954872131
        },
        {
          "claim": "However, there are several coronaviruses that only infect animals, but if they do, crossover",
          "checkworthy": 1,
          "prob": 0.6381692290306091
        },
        {
          "claim": "Say for example SARS that has a mortality rate of 10% or even Ebola, which has a mortality rate of 70%",
          "checkworthy": 1,
          "prob": 0.8796243667602539
        },
        {
          "claim": "The Wuhan Institute has studied coronaviruses in the past, including the strain that causes severe acute respiratory syndrome",
          "checkworthy": 1,
          "prob": 0.7830677032470703
        },
        {
          "claim": "So what are the symptoms of coronavirus? Well, it can include any of the following a fever and runny nose, a dry cough, a sore throat, and it can lead on to shortness of breath",
          "checkworthy": 1,
          "prob": 0.6908296346664429
        },
        {
          "claim": "the Iranian regime mimicking a Chinese conspiracy theory about the source of the CCP virus, saying US medicine is a way to spread the virus more",
          "checkworthy": 1,
          "prob": 0.8349271416664124
        },
        {
          "claim": "Officials announced that the novel coronavirus can be transmitted between humans",
          "checkworthy": 1,
          "prob": 0.8249238729476929
        },
        {
          "claim": "The gene sequencing data from the 2019 ENKOVA or Wuhan virus is isolated",
          "checkworthy": 1,
          "prob": 0.6550920605659485
        },
        {
          "claim": "In the past it was impossible for bats to transmit coronavirus",
          "checkworthy": 1,
          "prob": 0.7554400563240051
        },
        {
          "claim": "That would would consist with SARS, which is already a weaponized coronavirus gain of function properties and HIV and as you know, those Indian scientists already did an analysis of the coronavirus and it was published online",
          "checkworthy": 1,
          "prob": 0.6608510613441467
        },
        {
          "claim": "OK, so as the five G causes caused these flu like symptoms in Wuhan, China",
          "checkworthy": 1,
          "prob": 0.8676180243492126
        },
        {
          "claim": "There are at least two known instances of a SARS type coronavirus being released from the Beijing lab",
          "checkworthy": 1,
          "prob": 0.6850905418395996
        },
        {
          "claim": "It says the median incubation period was three days range of zero to 24",
          "checkworthy": 1,
          "prob": 0.5373699069023132
        },
        {
          "claim": "Quite a lot of people being infected may just have quite mild respiratory disease",
          "checkworthy": 1,
          "prob": 0.5921803116798401
        },
        {
          "claim": "With this crisper technology, this gene editing and splicing stuff, you know the HIV spliced on to this Corona",
          "checkworthy": 1,
          "prob": 0.5468444228172302
        },
        {
          "claim": "After testing it, it showed that SARS, like viruses, found in bats from nearby caves",
          "checkworthy": 1,
          "prob": 0.8283498883247375
        },
        {
          "claim": "And also the protein of DNA of HIV makes it possible or enables the coronavirus of Wuhan",
          "checkworthy": 1,
          "prob": 0.6917625069618225
        },
        {
          "claim": "And whoever is putting these signal patterns out there, you know they they need to be triangulated, found, and exposed for what's been going on right? So So what exactly is the effect of the use of the five T? Are they spreading the infection, creating the infection? No, they're mutating it, mute the the the DNA of the virus is already is perfectly designed to spread on its own",
          "checkworthy": 1,
          "prob": 0.8443938493728638
        },
        {
          "claim": "Still switching and people will start dying from this and so they got a two week incubation period",
          "checkworthy": 1,
          "prob": 0.8934794664382935
        },
        {
          "claim": "A patient goes to a hospital when Wuhan, China, exhibiting symptoms, including respiratory issues, slight fever, headache, and body aches",
          "checkworthy": 1,
          "prob": 0.5875582695007324
        },
        {
          "claim": "The National Microbiology Laboratory has a long history of offering comprehensive testing services for coronavirus is an isolated and provided the first genome sequence of the SARS coronavirus and identified another coronavirus, an L63 in 2004",
          "checkworthy": 1,
          "prob": 0.8999291658401489
        },
        {
          "claim": "Ebola is classified as a category Fay bioterrorism agent by the United States, Centers for Disease Control and Prevention, meaning it could be easily transmitted from person to person",
          "checkworthy": 1,
          "prob": 0.8024539947509766
        },
        {
          "claim": "By the way, do you know what the name of the coronavirus is today?The official name of coronavirus, not the disease, but the virus is \"SARS-CoV-2\"",
          "checkworthy": 1,
          "prob": 0.5145921111106873
        },
        {
          "claim": "The scientific name is SARS [SARS-CoV-2]:Is a new virus responsible for an outbreak of respiratory illness known as [COVID-19] and that's the disease:COVID is COronaVIrusDisease-19 because it started in December of '19",
          "checkworthy": 1,
          "prob": 0.9365447759628296
        },
        {
          "claim": "Then Fang Chi-tai, a professor at National Taiwan University's College of Public Health said,that a French team investigating COVID-19 had found,that the key difference between RaTG13 and COVID-19 wasthat the latter has 4 additional amino acids not found in any other coronaviruses",
          "checkworthy": 1,
          "prob": 0.9049373269081116
        },
        {
          "claim": "The professor said that the viruses normally,only have small mutations in the form of singular changes in natural conditions",
          "checkworthy": 1,
          "prob": 0.6551576256752014
        },
        {
          "claim": "So how is coronavirus spread? Well, we don't know exactly how it spread from person to person, but similar viruses spread through cough droplets through close contact",
          "checkworthy": 1,
          "prob": 0.5253660678863525
        },
        {
          "claim": "Now close contact is being close within 2 meters of someone who is infected for at least 15 minutes",
          "checkworthy": 1,
          "prob": 0.5321870446205139
        },
        {
          "claim": "The virus can survive for about 15 minutes on that issue, which is why it's so important you throw it in the bin straight away on other services like door handles for example",
          "checkworthy": 1,
          "prob": 0.6386252045631409
        },
        {
          "claim": "So if they're coughing, if they're sneezing trying avoid contact with them and try and maintain a gap of at least 2 meters from them, because this is a distance that's being shown a sneeze or cough can travel tip #5 if you're not feeling well, stay at home, even if it's something mild like the common cold",
          "checkworthy": 1,
          "prob": 0.6310558915138245
        },
        {
          "claim": "Chinese provincial government says is out of Reuters in Shanghai, a 70 year old man in China's Hubei Province was infected with coronavirus, but did not show symptoms until 27 days later, meaning the viruses incubation period could be much longer than presumed 14 days",
          "checkworthy": 1,
          "prob": 0.9307155609130859
        },
        {
          "claim": "Asymptomatically spread that it spread through aerosols that it's not just droplets that it's highly virulent that it's a very serious disease that is not like the flu",
          "checkworthy": 1,
          "prob": 0.8501920104026794
        },
        {
          "claim": "In fact, people age of 1 or under seem to be practically immune from this thing, or it creates a very very light disease",
          "checkworthy": 1,
          "prob": 0.7604599595069885
        },
        {
          "claim": "But there's some other interesting things we saw that lymphopenia that means low white blood cells were observed",
          "checkworthy": 1,
          "prob": 0.7248930931091309
        },
        {
          "claim": "An antigen could be a protein, a virus or a protein of a bacteria etc etc",
          "checkworthy": 1,
          "prob": 0.5446850061416626
        },
        {
          "claim": "Yes, it comes out to 24 days, but that's not the incubation period of this infection to this symptom",
          "checkworthy": 1,
          "prob": 0.6282348036766052
        },
        {
          "claim": "They're looking at statistics here and they're saying that the coronavirus is 20 times more lethal than the flu",
          "checkworthy": 1,
          "prob": 0.6983534693717957
        },
        {
          "claim": "Of if this virus is man made or not by looking at a few clues, the current virus is made up of proteins just like any other biological thing, and a specific piece of that virus known as a spike protein with a receptor binding domain that is used to attach to a receptor found on human cells known as angiotensin converting enzyme or ace",
          "checkworthy": 1,
          "prob": 0.8567862510681152
        },
        {
          "claim": "Once attached, it can affect the cell that receptor binding domain is made up of a series of amino acids, just like all proteins are made of amino acids",
          "checkworthy": 1,
          "prob": 0.7360606789588928
        },
        {
          "claim": "So for example, if someone was infected with the S, they'll make antibodies to the S type",
          "checkworthy": 1,
          "prob": 0.7447484731674194
        },
        {
          "claim": "Then it goes into the lower respiratory tract and it can cause fluid to accumulate and people to get really quite ill",
          "checkworthy": 1,
          "prob": 0.5902842283248901
        },
        {
          "claim": "It could cause nausea, vomiting, and diarrhea in some people, but mostly it affects the respiratory tract",
          "checkworthy": 1,
          "prob": 0.5683649182319641
        },
        {
          "claim": "Actually there's less than that can affect complicated animals like ours with eukaryotic cells, but there's still a lot",
          "checkworthy": 1,
          "prob": 0.7034220099449158
        },
        {
          "claim": "A rhinovirus versus a regular coronavirus, or it could be a rhinovirus that's mutated enough so that the former immunization that you got against the virus is no longer effective 'cause it's mutated",
          "checkworthy": 1,
          "prob": 0.7240215539932251
        },
        {
          "claim": "Mixed and then more likely mutations occur leading to infectious virus known as COVID-19 or SARS Cove",
          "checkworthy": 1,
          "prob": 0.56193608045578
        },
        {
          "claim": "If it had not mutated in a particular way to make it infectious to humans, however, keep in mind that the virus would have to mutate multiple specific ways, creating a similarity in structure, but also a similarity in receptor binding domain plus another mutation I did not cover, but is in the review for it to become infectious, so it is far more likely that already prime viruses, like those in the Battan Penguin",
          "checkworthy": 1,
          "prob": 0.787071943283081
        },
        {
          "claim": "And oddly enough, the Penguin coronavirus does have a similar receptor binding domain, so if these two animals were in close contact over and over again, these two viruses could have mutated and in a way cross pollinated to form our coronavirus that shares the necessary traits of both to effect humans",
          "checkworthy": 1,
          "prob": 0.6670966744422913
        },
        {
          "claim": "Is in the animals in the mujan market, where the virus is believed to have originated 2 animals, in particular abat and a pangolins bats have a coronavirus of their own that is 96% identical to our coronavirus, but we couldn't have gotten it from bats because of the spike protein I mentioned earlier",
          "checkworthy": 1,
          "prob": 0.6935230493545532
        },
        {
          "claim": "This receptor binding domain is made up of six amino acids, of which five are different from the first Corona virus to induce panic in the world",
          "checkworthy": 1,
          "prob": 0.550581157207489
        },
        {
          "claim": "This virus could have both a long incubation period as much as 14 days, and individuals could be contagious while asymptomatic, which was not the case with SARS in 2003",
          "checkworthy": 1,
          "prob": 0.847053587436676
        },
        {
          "claim": "Do not conduct 5G in that area because it will cause flu like symptoms, as people were going to the hospital for flu like symptoms they were given",
          "checkworthy": 1,
          "prob": 0.7677577137947083
        },
        {
          "claim": "If the antibodies to the S type will give UL type immunity or the antibodies to the L type will give US type immunity",
          "checkworthy": 1,
          "prob": 0.5967994928359985
        },
        {
          "claim": "They're planning to have something maybe in April, and that's really, really fast for some of these medications, but we don't have anything that we know is going to work, and so as a result of that, whenever we give something for treatments and less, it's a known situation like Ards 'cause viral pneumonias can cause a RDS that's acute respiratory distress syndrome",
          "checkworthy": 1,
          "prob": 0.9139041900634766
        },
        {
          "claim": "Millions of these B cells and all these B cells do is they produce antibodies and these antibodies go out an attack cells that have the virus in it or the virus itself",
          "checkworthy": 1,
          "prob": 0.7422007322311401
        },
        {
          "claim": "And finally when the infection is done then these B cells just kind of go away, but there's always a certain amount of a population of these B cells ready to strike again",
          "checkworthy": 1,
          "prob": 0.6407933831214905
        },
        {
          "claim": "Here you get an antigen stimulating a BSL course when we give a vaccine in some of the cases we give a vaccine that has just the protein without the virus, so you don't get the actual disease, and that causes your B cells to make a lot of these antibodies in preparation for if you ever were to be infected with that virus, you'll be ready to make",
          "checkworthy": 1,
          "prob": 0.7138757109642029
        },
        {
          "claim": "So in the past vaccines were often developed from the disease causing organisms themselves and they had to be isolated and then adapted and then tested",
          "checkworthy": 1,
          "prob": 0.8411367535591125
        },
        {
          "claim": "Furthermore, from some cases it appears the virus could be aerosolised, which means it doesn't require the kind of contact that you have with, say, a married couple kissing each other or family living in close quarters in a hotel or apartment, but rather the distance is we're all sitting apart right now, yet China is still lying about all of this",
          "checkworthy": 1,
          "prob": 0.6800554990768433
        },
        {
          "claim": "In terms of the origins from the New York Times quote, data mining of genomic data posted in the last 12, most importantly from the October report on pangolins indicated that a portion of the coronavirus in Penguins was nearly identical to the one in the new virus",
          "checkworthy": 1,
          "prob": 0.9187440276145935
        },
        {
          "claim": "But it looks like there was another mutation in this COVID-19 virus, which meant it could be transmitted between humans, so that's what happened first",
          "checkworthy": 1,
          "prob": 0.5991206169128418
        },
        {
          "claim": "So one of these for viruses here mutated into another type of virus, which is now called the L form",
          "checkworthy": 1,
          "prob": 0.8359216451644897
        },
        {
          "claim": "So we now have these two forms, so the single single ancestral S form is now carried on as the S form, but there's this branch off this mutation called the L Form, so we now have these two",
          "checkworthy": 1,
          "prob": 0.7437294721603394
        },
        {
          "claim": "Now, originally when these Chinese scientists were looking at it, 70% of the viruses they looked at had the L form genome",
          "checkworthy": 1,
          "prob": 0.8740919232368469
        },
        {
          "claim": "So when they looked at it, most cases where the El form they found about was at 7570% of these well form",
          "checkworthy": 1,
          "prob": 0.849587619304657
        },
        {
          "claim": "So they think the Chinese scientists think they picked up more of the L type because the L type was more prevalent in the early stages of the outbreak",
          "checkworthy": 1,
          "prob": 0.718083381652832
        },
        {
          "claim": "This process is called adsorption and only then can the virus get into the cell and we remembered yesterday that the virus can only reproduce inside the cell because they're actually pretty useless things",
          "checkworthy": 1,
          "prob": 0.8718405961990356
        },
        {
          "claim": "Reproduces inside the cell, then the cell gives out many, many thousands of copies of the virus that can then be coughed out to spread to other people, so that's looked",
          "checkworthy": 1,
          "prob": 0.634186863899231
        },
        {
          "claim": "Implications of this practical implications of this? Well, one thing is it's possible to be infected with both the S and the L type",
          "checkworthy": 1,
          "prob": 0.5689355731010437
        },
        {
          "claim": "Now some people have said that the vaccine may not work on mutated strains, and possible vaccine would need two vaccines instead of 1 vaccine",
          "checkworthy": 1,
          "prob": 0.7646881937980652
        },
        {
          "claim": "Hepatitis There are some expensive treatments for hepatitis, summerhaven, hepatitis, viruses, herpes does respond quite well to acyclovir",
          "checkworthy": 1,
          "prob": 0.656028151512146
        },
        {
          "claim": "How does the coronavirus actually kill people? There's a recent article in The Lancet that showed that a 41 people that were admitted to the hospital, six of them died and all of them were on ventilators and they died with something called a RDS and RDS is how the coronavirus kills",
          "checkworthy": 1,
          "prob": 0.9133556485176086
        },
        {
          "claim": "She and her team went South to Yunnan Province, all the way Deep South of China is very beautiful there, and she found out that SARS like viruses originally came from bats",
          "checkworthy": 1,
          "prob": 0.9094222187995911
        },
        {
          "claim": "So although it can be killed with alcohol wipes and hand washing, it is highly contagious and human immune systems don't have antibodies to this particular virus just yet",
          "checkworthy": 1,
          "prob": 0.6388803124427795
        },
        {
          "claim": "It's a virus that attacks your upper respiratory system",
          "checkworthy": 0,
          "prob": 0.15596812963485718
        },
        {
          "claim": "It's a virus that causes you to cough and of course, it attacks your lungs",
          "checkworthy": 0,
          "prob": 0.18050616979599
        },
        {
          "claim": "Coronavirus is a zoo nautic",
          "checkworthy": 0,
          "prob": 0.31769096851348877
        },
        {
          "claim": "The symptoms of Covid are just like influenza",
          "checkworthy": 0,
          "prob": 0.1681637167930603
        },
        {
          "claim": "I'm sure all fruits and vegetables will help boost your immune system",
          "checkworthy": 0,
          "prob": 0.08522967249155045
        },
        {
          "claim": "",
          "checkworthy": 0,
          "prob": 0.24486702680587769
        },
        {
          "claim": "She even received an award for approving bats are natural reservoirs of SARS like coronaviruses",
          "checkworthy": 1,
          "prob": 0.8196595907211304
        },
        {
          "claim": "Into the alveolar space as well, and this starts to fill up with liquid proteinaceous liquid liquid that prevents oxygen from getting into the bloodstream, and so instead of having nice oxygenated blood, this blood becomes hypoxic and you become hypoxic",
          "checkworthy": 1,
          "prob": 0.739918053150177
        },
        {
          "claim": "Because we've said that it looks like it might be the S type that's causing the pandemic and the L type is more transmissible, but it looks like there might be more S types than L types, although this all needs to be clarified",
          "checkworthy": 1,
          "prob": 0.5271895527839661
        },
        {
          "claim": "OK, and the reason that I'm not providing any information to support the fact that it is a bio weapon is because I didn't find any",
          "checkworthy": 0,
          "prob": 0.36958134174346924
        },
        {
          "claim": "Trying to see is there any credible information out there to say that it is a bio weapon? And then I've also spent time looking into all the information",
          "checkworthy": 0,
          "prob": 0.187851220369339
        },
        {
          "claim": "Like I said, they would not have provided the genetic blueprint because everybody would have known that it was engineered",
          "checkworthy": 0,
          "prob": 0.2589800953865051
        },
        {
          "claim": "There depending on our dollars now, I will tell you that it is true that China is making plans to try to move and develop a consumer base in Africa",
          "checkworthy": 0,
          "prob": 0.4356074035167694
        },
        {
          "claim": "I'm an alumnus there, of course, and it violates my the Biological Weapons Convention and my and my biological weapons Anti Terrorism Act that provides life in prison",
          "checkworthy": 0,
          "prob": 0.3284180760383606
        },
        {
          "claim": "We've been talking with Professor Francis Boyle about this virus and the possibility that in fact it's from a laboratory in China and it's being hidden by the",
          "checkworthy": 0,
          "prob": 0.41484376788139343
        },
        {
          "claim": "So the implication that we're dealing with right now is that they're bad actor",
          "checkworthy": 0,
          "prob": 0.1348516345024109
        },
        {
          "claim": "You all call it coronavirus but that is the \"common name\"",
          "checkworthy": 0,
          "prob": 0.2191477119922638
        },
        {
          "claim": "But we've never seen something like that,which has an unusual incubation period of up to 27 days",
          "checkworthy": 0,
          "prob": 0.4270543158054352
        },
        {
          "claim": "So, we have viruses that are engineered in labs",
          "checkworthy": 0,
          "prob": 0.4245620667934418
        },
        {
          "claim": "The next thing that we have is deadly vaccines",
          "checkworthy": 0,
          "prob": 0.13635903596878052
        },
        {
          "claim": "Basically, they're saying, there is climate change and it's because of us",
          "checkworthy": 0,
          "prob": 0.3879639804363251
        },
        {
          "claim": "If COVID-19 is really the threat that we're being told that it is in quote, dinucci is then cited again",
          "checkworthy": 0,
          "prob": 0.2739737629890442
        },
        {
          "claim": "On how I can flip this coronavirus thing and see if we can have a similar effect that the Spanish flu had on those individuals that preceded",
          "checkworthy": 0,
          "prob": 0.18401598930358887
        },
        {
          "claim": "If they do infect humans, for example, the novel coronavirus we're dealing with right now, this is what we call a spillover event",
          "checkworthy": 0,
          "prob": 0.3236697018146515
        },
        {
          "claim": "Also, Please remember if you don't have access to water or so you can always use an alcohol hand rub tip #2",
          "checkworthy": 0,
          "prob": 0.2998618185520172
        },
        {
          "claim": "Just stay at home and reduce the risk of spreading virus to other people and keep your community safe",
          "checkworthy": 0,
          "prob": 0.21512554585933685
        },
        {
          "claim": "The pandemic is already on here WHO is reluctant to call it what it is because it sucks",
          "checkworthy": 0,
          "prob": 0.27744078636169434
        },
        {
          "claim": "The official narrative talks about Chinese gangs using drones to spray the pigs with flu to devastate the pork industry",
          "checkworthy": 0,
          "prob": 0.45495733618736267
        },
        {
          "claim": "I'm going to give you loads of information about coronavirus symptoms, how it spread, how you can try and prevent it, and also the surgical masks",
          "checkworthy": 0,
          "prob": 0.16528642177581787
        },
        {
          "claim": "It's actually a widely popular theory, spreading almost as fast as COVID-19",
          "checkworthy": 0,
          "prob": 0.25602415204048157
        },
        {
          "claim": "All Ontarians should be concerned about any increase in COVID-19 related hospitalizations, especially those requiring intensive care and or ventilation",
          "checkworthy": 0,
          "prob": 0.3135598599910736
        },
        {
          "claim": "Now this mutation seems to mean that we now have two forms of the COVID-19 virus 2 forms and will look at these in imminent",
          "checkworthy": 0,
          "prob": 0.3073342442512512
        },
        {
          "claim": "Now this is very scientific, but what this means is we have this coronavirus",
          "checkworthy": 0,
          "prob": 0.22896526753902435
        },
        {
          "claim": "But if AUS senator and one of the world's leading medical journals both doubt the official Chinese story, well, it's more than a conspiracy",
          "checkworthy": 0,
          "prob": 0.35231494903564453
        },
        {
          "claim": "So this release of a virus in China is very interesting because although it may not be the biblical pestilence that is bioweapon based, it is similar",
          "checkworthy": 0,
          "prob": 0.46301957964897156
        },
        {
          "claim": "Now just SARS 2 and that does make sense because the original SARS was another type of coronavirus and SARS is just severe acute respiratory syndrome, which this one definitely is as well so",
          "checkworthy": 0,
          "prob": 0.4893321394920349
        },
        {
          "claim": "Will we know right now this virus has about a 2% death rate",
          "checkworthy": 0,
          "prob": 0.40372434258461
        },
        {
          "claim": "Coronavirus is OK are around 23% of the common cold, so we know that this is ridiculously common",
          "checkworthy": 0,
          "prob": 0.2739638388156891
        },
        {
          "claim": "They want their their empire built on technology, but this is a fight an don't tell Mr Gates right now you're going to have to kill me",
          "checkworthy": 0,
          "prob": 0.2196461707353592
        },
        {
          "claim": "But if you look back over your record and one of the reasons I'm very proud to work with you",
          "checkworthy": 0,
          "prob": 0.12840518355369568
        },
        {
          "claim": "They very powerful DC or there's another farm animal to person",
          "checkworthy": 0,
          "prob": 0.3059622347354889
        },
        {
          "claim": "If you have a flu like symptom, get some flu like medicine and get some rest and you and your body will heal from that",
          "checkworthy": 0,
          "prob": 0.3317776024341583
        },
        {
          "claim": "Probably because of this insertions of the HIV protein",
          "checkworthy": 0,
          "prob": 0.46550074219703674
        },
        {
          "claim": "Don't you be a ******* **** please stay the **** at",
          "checkworthy": 0,
          "prob": 0.06972382962703705
        },
        {
          "claim": "So I am going up up CU logo so Kitten Kitten up for the population talaga silicone opunui Corona Resident Evil series number",
          "checkworthy": 0,
          "prob": 0.12559261918067932
        },
        {
          "claim": "So, as you say, the mere fact we know it's a coronavirus means that we know already that the virus can be contaminated with very simple, easily available materials like soap or like alcohol",
          "checkworthy": 0,
          "prob": 0.4160479009151459
        },
        {
          "claim": "So you can see how biological weapons could be used for assassination, and you can also see how they might be used by a terror organization to disrupt",
          "checkworthy": 0,
          "prob": 0.1351999193429947
        },
        {
          "claim": "Today it is in every single province in China",
          "checkworthy": 1,
          "prob": 0.6165931224822998
        },
        {
          "claim": "El Al has shut down travel between Israel and China",
          "checkworthy": 1,
          "prob": 0.8319370746612549
        },
        {
          "claim": "They have now closed 20,000 wild animal farms",
          "checkworthy": 1,
          "prob": 0.7707315683364868
        },
        {
          "claim": "An have been victims of air pollution",
          "checkworthy": 1,
          "prob": 0.5161987543106079
        },
        {
          "claim": "It just had mild symptoms right now",
          "checkworthy": 1,
          "prob": 0.7748091816902161
        },
        {
          "claim": "China has four maximum security laboratories",
          "checkworthy": 1,
          "prob": 0.7291030883789062
        },
        {
          "claim": "Western countries are really facing their own battles right now",
          "checkworthy": 1,
          "prob": 0.5110188722610474
        },
        {
          "claim": "But Shell, but all the professor he posted the information anyway",
          "checkworthy": 1,
          "prob": 0.6435648798942566
        },
        {
          "claim": "Told who did you convert it to? Cool as soon as the ramp",
          "checkworthy": 1,
          "prob": 0.6367947459220886
        },
        {
          "claim": "Then you virus has mutated amid misinformation myths and moonshine",
          "checkworthy": 1,
          "prob": 0.7403801679611206
        },
        {
          "claim": "There are five major allies in the Pacific, Japan, Korea, Australia, Thailand",
          "checkworthy": 1,
          "prob": 0.6410094499588013
        },
        {
          "claim": "Came from China's Hubei Province, which is where the outbreak of the coronavirus or COVID-19 ikerd, the Ukrainian government said it took measures to ensure the evacuees were not infected before coming to Ukraine allowed this football",
          "checkworthy": 1,
          "prob": 0.9119769930839539
        },
        {
          "claim": "Under control by January then only businesses in the service sector like restaurants, hospitality and transportation would see the impact",
          "checkworthy": 1,
          "prob": 0.8575594425201416
        },
        {
          "claim": "They were asked to discharge patients within 10 days",
          "checkworthy": 1,
          "prob": 0.7331227660179138
        },
        {
          "claim": "Many people started questioning",
          "checkworthy": 1,
          "prob": 0.6214547157287598
        },
        {
          "claim": "He added the ferociousness of the virus",
          "checkworthy": 1,
          "prob": 0.5904318690299988
        },
        {
          "claim": "He rolled out",
          "checkworthy": 1,
          "prob": 0.5711567997932434
        },
        {
          "claim": "That was a bit of a",
          "checkworthy": 1,
          "prob": 0.6133343577384949
        },
        {
          "claim": "Genital cold source can cause more serious infections",
          "checkworthy": 1,
          "prob": 0.6406602263450623
        },
        {
          "claim": "The great majority of people who get COVID-19 will recover",
          "checkworthy": 1,
          "prob": 0.651089072227478
        },
        {
          "claim": "China's economic impact is seriously trying out manufactured in 2020",
          "checkworthy": 1,
          "prob": 0.8643712401390076
        },
        {
          "claim": "They manage two shipments of oil per month worth a profit of $28,000,000",
          "checkworthy": 1,
          "prob": 0.7782180905342102
        },
        {
          "claim": "More than 800 new cases in a single day have swollen figures to more than 3100",
          "checkworthy": 1,
          "prob": 0.793538510799408
        },
        {
          "claim": "There are new suspected cases in California, Oregon and Washington",
          "checkworthy": 1,
          "prob": 0.5455851554870605
        },
        {
          "claim": "And vaccine development would take a long time",
          "checkworthy": 1,
          "prob": 0.5669623613357544
        },
        {
          "claim": "This is the latest invention in the fight against SARS scares over SARS in 2003 bird flu in 2006, and swine flu in 2009, and also Ebola and Zika in recent years have focused policymakers minds on the need for pandemic preparation",
          "checkworthy": 1,
          "prob": 0.881252110004425
        },
        {
          "claim": "But what is this 35 to 50 patients already diagnosed? This is already been",
          "checkworthy": 1,
          "prob": 0.5913752317428589
        },
        {
          "claim": "Of individuals who had died from the Spanish flu",
          "checkworthy": 1,
          "prob": 0.8464949131011963
        },
        {
          "claim": "SARS infected 8000 and killed approximately 800 in half that time",
          "checkworthy": 1,
          "prob": 0.8975337743759155
        },
        {
          "claim": "One of China's biggest animal feed producers says it has reverted to using a radio transmitter to combat drones",
          "checkworthy": 1,
          "prob": 0.7952243089675903
        },
        {
          "claim": "For example, P represents population, so here it is at 1900, and then it comes up to 1940",
          "checkworthy": 1,
          "prob": 0.5757686495780945
        },
        {
          "claim": "Checking also affiliated with the National Microbiology Laboratory specifically",
          "checkworthy": 0,
          "prob": 0.456316202878952
        },
        {
          "claim": "And faculty members about traveling to China",
          "checkworthy": 0,
          "prob": 0.4045630693435669
        },
        {
          "claim": "The highest biohazard level, meaning that it would be qualified to handle the most dangerous pathogens",
          "checkworthy": 0,
          "prob": 0.4093398451805115
        },
        {
          "claim": "Or SARS H5N1 influenza virus",
          "checkworthy": 0,
          "prob": 0.39550793170928955
        },
        {
          "claim": "Japanese encephalitis and dengue",
          "checkworthy": 0,
          "prob": 0.3649985194206238
        },
        {
          "claim": "It states that more than 40 Chinese facilities are involved in bio weapon production",
          "checkworthy": 0,
          "prob": 0.48861005902290344
        },
        {
          "claim": "That would result in high death rates",
          "checkworthy": 0,
          "prob": 0.4167991578578949
        },
        {
          "claim": "And the People's Liberation Army could be at the forefront of expanding and exploiting this knowledge",
          "checkworthy": 0,
          "prob": 0.2648358941078186
        },
        {
          "claim": "Human performance enhancement and a new concept biotechnology",
          "checkworthy": 0,
          "prob": 0.29272904992103577
        },
        {
          "claim": "Or some other executive order has to be used to shut down 5G immediately exactly",
          "checkworthy": 0,
          "prob": 0.31008270382881165
        },
        {
          "claim": "Now there's a couple of tools you could have to protect yourselves in to monitor the situation",
          "checkworthy": 0,
          "prob": 0.2078416347503662
        },
        {
          "claim": "I have a compass so it's kind of like Hutchinson's website",
          "checkworthy": 0,
          "prob": 0.06697111576795578
        },
        {
          "claim": "They use a magnetic field and then they use radio waves to reprogram the DNA",
          "checkworthy": 0,
          "prob": 0.29442018270492554
        },
        {
          "claim": "So if you're in the affected area and your comments or spinning, or if it's not true North, then you gotta suspect something is going on",
          "checkworthy": 0,
          "prob": 0.28189003467559814
        },
        {
          "claim": "If you're self isolating and you need any essentials, give me a call",
          "checkworthy": 0,
          "prob": 0.12610097229480743
        },
        {
          "claim": "It just really saddens me to see all the things that are going on in the media and and I just thought if we can focus a little bit of that energy on being kind in our communities then it would just make this time so much easier for people as millions",
          "checkworthy": 0,
          "prob": 0.29484251141548157
        },
        {
          "claim": "Face isolation groups like this are reminding people that they are not alone",
          "checkworthy": 0,
          "prob": 0.23364636301994324
        },
        {
          "claim": "General NTD news here at China in focus we bring you first hand information from",
          "checkworthy": 0,
          "prob": 0.1462268829345703
        },
        {
          "claim": "Inside China, don't forget to subscribe for the latest updates",
          "checkworthy": 0,
          "prob": 0.17661267518997192
        },
        {
          "claim": "All shops selling nonessential goods are to close",
          "checkworthy": 0,
          "prob": 0.422243595123291
        },
        {
          "claim": "Our UK correspondent Jane World has the story",
          "checkworthy": 0,
          "prob": 0.1883906126022339
        },
        {
          "claim": "I know how difficult this is and how it seems to go against the freedom loving instincts of the of the British people",
          "checkworthy": 0,
          "prob": 0.1515733003616333
        },
        {
          "claim": "People are at a desperate right now, I'm worried, but still, people that you know in that position are thinking of others, so it's really quite amazing",
          "checkworthy": 0,
          "prob": 0.42195025086402893
        },
        {
          "claim": "Others have been slipping notes through their neighbours doors",
          "checkworthy": 0,
          "prob": 0.49312520027160645
        },
        {
          "claim": "Belly fat that says hi",
          "checkworthy": 0,
          "prob": 0.16708427667617798
        },
        {
          "claim": "I'm your neighbor",
          "checkworthy": 0,
          "prob": 0.04104619845747948
        },
        {
          "claim": "Over 1",
          "checkworthy": 0,
          "prob": 0.15046446025371552
        }
      ]
    }
  ]
}