{
  "wireMagic": "pb3",
  "pens": [ {
  
  } ],
  "wsWinStyles": [ {
  
  } ],
  "wpWinPositions": [ {
  
  } ],
  "events": [ {
    "tStartMs": 40,
    "dDurationMs": 2080,
    "segs": [ {
      "utf8": "This video was brought to you by Brilliant"
    } ]
  }, {
    "tStartMs": 2820,
    "dDurationMs": 2560,
    "segs": [ {
      "utf8": "Hi everyone - it's Inés, and welcome back to Draw Curiosity!"
    } ]
  }, {
    "tStartMs": 6100,
    "dDurationMs": 3360,
    "segs": [ {
      "utf8": "I’m sure you’ve noticed the coronavirus\nnews over the past couple of months -"
    } ]
  }, {
    "tStartMs": 9460,
    "dDurationMs": 1800,
    "segs": [ {
      "utf8": "unless you've been living under a rock"
    } ]
  }, {
    "tStartMs": 11760,
    "dDurationMs": 5720,
    "segs": [ {
      "utf8": "and as I record this it hasn’t officially been declared a pandemic, but I do think it is on the brink"
    } ]
  }, {
    "tStartMs": 17500,
    "dDurationMs": 5040,
    "segs": [ {
      "utf8": "of being declared one so chances are by the time this video is live, it might already be one."
    } ]
  }, {
    "tStartMs": 23100,
    "dDurationMs": 4640,
    "segs": [ {
      "utf8": "But anyway - I did want to make a video covering\nwhat we know about this novel coronavirus,"
    } ]
  }, {
    "tStartMs": 27740,
    "dDurationMs": 2120,
    "segs": [ {
      "utf8": "and how we know what we know about it."
    } ]
  }, {
    "tStartMs": 30320,
    "dDurationMs": 3860,
    "segs": [ {
      "utf8": "If you've found this channel through this\nvideo, first of all, welcome to Draw Curiosity!"
    } ]
  }, {
    "tStartMs": 34180,
    "dDurationMs": 4620,
    "segs": [ {
      "utf8": "Secondly, as for my credentials, I did my\ndegree in Biological Sciences and I hold a"
    } ]
  }, {
    "tStartMs": 38800,
    "dDurationMs": 4700,
    "segs": [ {
      "utf8": "PhD in biomechanics - so I’m not the kind\nof doctor who will save your life, but I am"
    } ]
  }, {
    "tStartMs": 43500,
    "dDurationMs": 5260,
    "segs": [ {
      "utf8": "a doctor who can read scientific papers on microbiology and epidemiology and will gladly explain"
    } ]
  }, {
    "tStartMs": 48760,
    "dDurationMs": 1800,
    "segs": [ {
      "utf8": "them to you in sickness and in health."
    } ]
  }, {
    "tStartMs": 51180,
    "dDurationMs": 5300,
    "segs": [ {
      "utf8": "And finally, although there are other aspects of epidemiology probably applied to this novel coronavirus"
    } ]
  }, {
    "tStartMs": 56900,
    "dDurationMs": 2200,
    "segs": [ {
      "utf8": "that I am planning to cover on this channel,"
    } ]
  }, {
    "tStartMs": 59140,
    "dDurationMs": 5140,
    "segs": [ {
      "utf8": "normally I cover obscure bits of science that I personally find interesting and think others will too,"
    } ]
  }, {
    "tStartMs": 64560,
    "dDurationMs": 2480,
    "segs": [ {
      "utf8": "so if that’s your jam , welcome to Draw\nCuriosity!"
    } ]
  }, {
    "tStartMs": 67040,
    "dDurationMs": 2520,
    "segs": [ {
      "utf8": "And if it's not, that's fine too. I hope this video is helpful."
    } ]
  }, {
    "tStartMs": 69740,
    "dDurationMs": 3800,
    "segs": [ {
      "utf8": "Also, as you might be able to see, this video is jam-packed with information,"
    } ]
  }, {
    "tStartMs": 73540,
    "dDurationMs": 2500,
    "segs": [ {
      "utf8": "as you can probably guess from the length, so -"
    } ]
  }, {
    "tStartMs": 76040,
    "dDurationMs": 3540,
    "segs": [ {
      "utf8": "Obviously I would encourage you to watch the\nwhole thing because I’ve put"
    } ]
  }, {
    "tStartMs": 79580,
    "dDurationMs": 6080,
    "segs": [ {
      "utf8": "plenty of effort and care into packaging it together quite nicely, but there is an index of questions and segments"
    } ]
  }, {
    "tStartMs": 85660,
    "dDurationMs": 4920,
    "segs": [ {
      "utf8": "on screen, and in the description and in the\npinned comment with all of the time codes,"
    } ]
  }, {
    "tStartMs": 90620,
    "dDurationMs": 4040,
    "segs": [ {
      "utf8": "so if you want to choose to focus on certain aspects, or you just want to have an idea of"
    } ]
  }, {
    "tStartMs": 94660,
    "dDurationMs": 3840,
    "segs": [ {
      "utf8": "what to expect from this video, you can navigate around it quite easily!"
    } ]
  }, {
    "tStartMs": 98680,
    "dDurationMs": 6020,
    "segs": [ {
      "utf8": "I have also linked primary literature that I've read to prepare for this video, as well as a few other helpful"
    } ]
  }, {
    "tStartMs": 104700,
    "dDurationMs": 5840,
    "segs": [ {
      "utf8": "sites and other resources on YouTube which I personally have found to be quite reliable and evidence-based."
    } ]
  }, {
    "tStartMs": 110540,
    "dDurationMs": 3080,
    "segs": [ {
      "utf8": "should you want further reading and viewing material."
    } ]
  }, {
    "tStartMs": 113920,
    "dDurationMs": 5460,
    "segs": [ {
      "utf8": "So without further ado… what and how do\nwe know about the novel coronavirus?"
    } ]
  }, {
    "tStartMs": 119880,
    "dDurationMs": 8320,
    "segs": [ {
      "utf8": "[ Introduction by Caro Waro \u0026 Cristina de Manuel ]"
    } ]
  }, {
    "tStartMs": 128640,
    "dDurationMs": 2040,
    "segs": [ {
      "utf8": "Where did the virus come from?"
    } ]
  }, {
    "tStartMs": 130680,
    "dDurationMs": 5640,
    "segs": [ {
      "utf8": "The epicentre for COVID-19 was in Wuhan, China,\nand it most likely originated through zoonosis,"
    } ]
  }, {
    "tStartMs": 136320,
    "dDurationMs": 6480,
    "segs": [ {
      "utf8": "which is when a virus, bacteria or other organism\nthat usually lives in a non-human animal species"
    } ]
  }, {
    "tStartMs": 142800,
    "dDurationMs": 2500,
    "segs": [ {
      "utf8": "spreads and causes disease in a human."
    } ]
  }, {
    "tStartMs": 145300,
    "dDurationMs": 5300,
    "segs": [ {
      "utf8": "The running hypothesis is that is was likely\na coronavirus that was present in a bat, the"
    } ]
  }, {
    "tStartMs": 150600,
    "dDurationMs": 4680,
    "segs": [ {
      "utf8": "bat then transmitted this virus in its faeces\nor through a separate mechanism to a"
    } ]
  }, {
    "tStartMs": 155280,
    "dDurationMs": 6420,
    "segs": [ {
      "utf8": "currently unknown intermediate host, which was then brought (possibly!) to the Huanan Seafood Market"
    } ]
  }, {
    "tStartMs": 161700,
    "dDurationMs": 2280,
    "segs": [ {
      "utf8": "where it was transmitted to humans."
    } ]
  }, {
    "tStartMs": 163980,
    "dDurationMs": 2960,
    "segs": [ {
      "utf8": "Bats are actually reservoirs and carriers\nfor many viruses."
    } ]
  }, {
    "tStartMs": 167320,
    "dDurationMs": 4000,
    "segs": [ {
      "utf8": "They actually make really good host organisms for these\nviruses because"
    } ]
  }, {
    "tStartMs": 171320,
    "dDurationMs": 4820,
    "segs": [ {
      "utf8": "firstly,  they roost in very large groups and \nthey're in very close contact with each other,"
    } ]
  }, {
    "tStartMs": 176140,
    "dDurationMs": 2020,
    "segs": [ {
      "utf8": "but they also have relatively long lifespans."
    } ]
  }, {
    "tStartMs": 178780,
    "dDurationMs": 4580,
    "segs": [ {
      "utf8": "Not only that, but bats have a higher body temperature\ndue to their metabolism, and they also have"
    } ]
  }, {
    "tStartMs": 183360,
    "dDurationMs": 5140,
    "segs": [ {
      "utf8": "specially adapted immune systems, that enable\nthem to fight off infections much more easily,"
    } ]
  }, {
    "tStartMs": 188940,
    "dDurationMs": 4300,
    "segs": [ {
      "utf8": "so they are actually generally unaffected by \nthese viruses that they carry,"
    } ]
  }, {
    "tStartMs": 193240,
    "dDurationMs": 2800,
    "segs": [ {
      "utf8": "but it does make them really good carriers for these viruses."
    } ]
  }, {
    "tStartMs": 196740,
    "dDurationMs": 5220,
    "segs": [ {
      "utf8": "The novel coronavirus was found to share a\n96.2% match with another coronavirus carried"
    } ]
  }, {
    "tStartMs": 201960,
    "dDurationMs": 7460,
    "segs": [ {
      "utf8": "by the horseshoe bat, so that is probably the original carrier. The intermediate host is unclear to date."
    } ]
  }, {
    "tStartMs": 209420,
    "dDurationMs": 4200,
    "segs": [ {
      "utf8": "Scientists have conducted genetic tests, and they've found matches that point towards snakes,"
    } ]
  }, {
    "tStartMs": 213620,
    "dDurationMs": 4920,
    "segs": [ {
      "utf8": "pangolins, maybe civets, but none of it is particularly conclusive, and to date,"
    } ]
  }, {
    "tStartMs": 218540,
    "dDurationMs": 5280,
    "segs": [ {
      "utf8": "to my knowledge, the novel coronavirus has not been found in any intermediate host animal."
    } ]
  }, {
    "tStartMs": 223820,
    "dDurationMs": 1380,
    "segs": [ {
      "utf8": "So, we don't really know for sure."
    } ]
  }, {
    "tStartMs": 225760,
    "dDurationMs": 6120,
    "segs": [ {
      "utf8": "That being said, although around 40-50 cases at least \nare thought to be of zoonotic origin from"
    } ]
  }, {
    "tStartMs": 231880,
    "dDurationMs": 4640,
    "segs": [ {
      "utf8": "the Huanan Wet Market, right now the primary source of transmission is actually human-to-human transmission."
    } ]
  }, {
    "tStartMs": 236520,
    "dDurationMs": 2140,
    "segs": [ {
      "utf8": "(Huanan market is now closed down, and wildlife\ntrade has been banned in China)"
    } ]
  }, {
    "tStartMs": 238660,
    "dDurationMs": 2000,
    "segs": [ {
      "utf8": "Does the origin matter then?"
    } ]
  }, {
    "tStartMs": 240660,
    "dDurationMs": 6040,
    "segs": [ {
      "utf8": "Whilst I would say it is not the primary source of infection, I personally think it would be good to know because"
    } ]
  }, {
    "tStartMs": 246700,
    "dDurationMs": 5520,
    "segs": [ {
      "utf8": "firstly, it provides further clues on how to maybe approach finding a cure or better treatment"
    } ]
  }, {
    "tStartMs": 252220,
    "dDurationMs": 3800,
    "segs": [ {
      "utf8": "for COVID-19, how to control the virus, and most importantly,"
    } ]
  }, {
    "tStartMs": 256020,
    "dDurationMs": 3540,
    "segs": [ {
      "utf8": "knowing what animal is likely to become the reservoir for this"
    } ]
  }, {
    "tStartMs": 259600,
    "dDurationMs": 5000,
    "segs": [ {
      "utf8": "disease, so as to prevent future outbreaks\nfrom actually recurring from a zoonotic source."
    } ]
  }, {
    "tStartMs": 264600,
    "dDurationMs": 2300,
    "segs": [ {
      "utf8": "if we actually manage to contain the virus."
    } ]
  }, {
    "tStartMs": 267640,
    "dDurationMs": 2160,
    "segs": [ {
      "utf8": "Are you sure this isn’t a bioweapon?"
    } ]
  }, {
    "tStartMs": 269800,
    "dDurationMs": 4320,
    "segs": [ {
      "utf8": "Isn’t it just very convenient all of this \nhappened when it did?"
    } ]
  }, {
    "tStartMs": 274120,
    "dDurationMs": 4120,
    "segs": [ {
      "utf8": "Now I’ve had lots of people come forward to\nme with different conspiracy theories, such"
    } ]
  }, {
    "tStartMs": 278240,
    "dDurationMs": 6540,
    "segs": [ {
      "utf8": "as whether this novel coronavirus was designed as a bioweapon, to a form of ethnic cleansing,"
    } ]
  }, {
    "tStartMs": 284860,
    "dDurationMs": 2180,
    "segs": [ {
      "utf8": "to a leak from a containment lab in Wuhan."
    } ]
  }, {
    "tStartMs": 287880,
    "dDurationMs": 5080,
    "segs": [ {
      "utf8": "In all honesty, I don’t think that is the case - at least, I wouldn't say there's any evidence"
    } ]
  }, {
    "tStartMs": 292960,
    "dDurationMs": 5200,
    "segs": [ {
      "utf8": "to date that would suggest it's the case, and the sources of these hypotheses"
    } ]
  }, {
    "tStartMs": 298160,
    "dDurationMs": 3820,
    "segs": [ {
      "utf8": "are people who are merely speculating and there's no concrete line of evidence."
    } ]
  }, {
    "tStartMs": 302380,
    "dDurationMs": 5280,
    "segs": [ {
      "utf8": "So if it does turn out to be one of those, it isn’t linked to any evidence that's been put out so far."
    } ]
  }, {
    "tStartMs": 308500,
    "dDurationMs": 5040,
    "segs": [ {
      "utf8": "That being said, I'm think it's unlikely and I'm pretty sure it is just an unfortunate case of zoonosis"
    } ]
  }, {
    "tStartMs": 313540,
    "dDurationMs": 1340,
    "segs": [ {
      "utf8": "for several reasons:"
    } ]
  }, {
    "tStartMs": 315260,
    "dDurationMs": 5780,
    "segs": [ {
      "utf8": "Firstly, if this were a bioweapon released maliciously,\n I think it would be a lot deadlier, full stop."
    } ]
  }, {
    "tStartMs": 321040,
    "dDurationMs": 5760,
    "segs": [ {
      "utf8": "Secondly, if it were an accidental leak from\na lab, the epicentre would probably not be"
    } ]
  }, {
    "tStartMs": 326800,
    "dDurationMs": 6200,
    "segs": [ {
      "utf8": "a Wet Market, but maybe people working (or connected to people working) at that containment lab."
    } ]
  }, {
    "tStartMs": 333000,
    "dDurationMs": 4600,
    "segs": [ {
      "utf8": "Now, while the first case wasn't at the wet market, the vast majority of early cases"
    } ]
  }, {
    "tStartMs": 337600,
    "dDurationMs": 3960,
    "segs": [ {
      "utf8": "were either workers at the Huanan Seafood Market, people who had been to that market"
    } ]
  }, {
    "tStartMs": 341560,
    "dDurationMs": 6080,
    "segs": [ {
      "utf8": "or who were in close contact with people at that market, so I think it probably started"
    } ]
  }, {
    "tStartMs": 347640,
    "dDurationMs": 3140,
    "segs": [ {
      "utf8": "from an intermediate host that ended up in that market."
    } ]
  }, {
    "tStartMs": 351180,
    "dDurationMs": 4740,
    "segs": [ {
      "utf8": "Wuhan is the 39th most populated city in the\nworld, just behind New York, and many large"
    } ]
  }, {
    "tStartMs": 355930,
    "dDurationMs": 4970,
    "segs": [ {
      "utf8": "cities also have research centres that work\nwith pathogens, so I’d say it’s not even"
    } ]
  }, {
    "tStartMs": 360900,
    "dDurationMs": 6310,
    "segs": [ {
      "utf8": "coincidence that there happens to be such\na lab somewhere in the same city, it’s practically"
    } ]
  }, {
    "tStartMs": 367210,
    "dDurationMs": 5610,
    "segs": [ {
      "utf8": "unsurprising and the fact that the two are connected - I don't think means it's been released maliciously."
    } ]
  }, {
    "tStartMs": 373520,
    "dDurationMs": 4560,
    "segs": [ {
      "utf8": "Finally, it's definitely not a racially targeted virus. I'll talk more about that"
    } ]
  }, {
    "tStartMs": 378080,
    "dDurationMs": 5500,
    "segs": [ {
      "utf8": "when we reach the demographics part of this video, but we now have epicenters in different parts of the world -"
    } ]
  }, {
    "tStartMs": 383580,
    "dDurationMs": 4780,
    "segs": [ {
      "utf8": "I think it's evident that everyone is equally affected by the virus regardless of race."
    } ]
  }, {
    "tStartMs": 388360,
    "dDurationMs": 5260,
    "segs": [ {
      "utf8": "However, it should be said that although the\nHuanan Seafood Market is thought to likely"
    } ]
  }, {
    "tStartMs": 393630,
    "dDurationMs": 6760,
    "segs": [ {
      "utf8": "be the epicentre of the coronavirus, actually the very\nfirst patient presenting with COVID-19 symptoms"
    } ]
  }, {
    "tStartMs": 400390,
    "dDurationMs": 5030,
    "segs": [ {
      "utf8": "and 13 other people from those early 40-50\ncases - they actually had"
    } ]
  }, {
    "tStartMs": 405420,
    "dDurationMs": 3480,
    "segs": [ {
      "utf8": "no direct connection to the Huanan Seafood Market."
    } ]
  }, {
    "tStartMs": 408900,
    "dDurationMs": 4600,
    "segs": [ {
      "utf8": "Nonetheless, they may have contracted it from an intermediate host"
    } ]
  }, {
    "tStartMs": 413500,
    "dDurationMs": 2480,
    "segs": [ {
      "utf8": "before that intermediate host reached the"
    } ]
  }, {
    "tStartMs": 415980,
    "dDurationMs": 5800,
    "segs": [ {
      "utf8": "Huanan Seafood Market, or it may have been\nan early case of human to human transmission"
    } ]
  }, {
    "tStartMs": 421780,
    "dDurationMs": 3620,
    "segs": [ {
      "utf8": "and it could just be that they simply became symptomatic a little bit earlier."
    } ]
  }, {
    "tStartMs": 425940,
    "dDurationMs": 5320,
    "segs": [ {
      "utf8": "Either way, I would say that wet markets are the perfect breeding grounds for zoonotic diseases to emerge"
    } ]
  }, {
    "tStartMs": 431260,
    "dDurationMs": 2280,
    "segs": [ {
      "utf8": "cause you're putting lots of different animals together,"
    } ]
  }, {
    "tStartMs": 433540,
    "dDurationMs": 5700,
    "segs": [ {
      "utf8": "it definitely isn't the first time this has happened (MERS, SARS, plenty of other flus)"
    } ]
  }, {
    "tStartMs": 439240,
    "dDurationMs": 6700,
    "segs": [ {
      "utf8": "- and at least one good thing is as of last Monday, China has permanently banned wildlife trade"
    } ]
  }, {
    "tStartMs": 445940,
    "dDurationMs": 4240,
    "segs": [ {
      "utf8": "and it's a permanent ban as opposed to the\noriginal suspension, so at least that’s good"
    } ]
  }, {
    "tStartMs": 450180,
    "dDurationMs": 3780,
    "segs": [ {
      "utf8": "and hopefully it'll prevent similar events from happening in future."
    } ]
  }, {
    "tStartMs": 454720,
    "dDurationMs": 2940,
    "segs": [ {
      "utf8": "How Does the Novel Coronavirus Infect Humans?"
    } ]
  }, {
    "tStartMs": 458040,
    "dDurationMs": 4800,
    "segs": [ {
      "utf8": "You might have rightfully been wondering how come bats and other animals are carriers of many viruses"
    } ]
  }, {
    "tStartMs": 462840,
    "dDurationMs": 5460,
    "segs": [ {
      "utf8": "but may be unaffected by them, and how come\nwe aren’t affected by all of the viruses that"
    } ]
  }, {
    "tStartMs": 468300,
    "dDurationMs": 2540,
    "segs": [ {
      "utf8": "affect and are carried by other organisms."
    } ]
  }, {
    "tStartMs": 470840,
    "dDurationMs": 6780,
    "segs": [ {
      "utf8": "And the reason for this, in honestly very simple terms, is that viruses, compared to bacteria and other parasites,"
    } ]
  }, {
    "tStartMs": 477620,
    "dDurationMs": 6340,
    "segs": [ {
      "utf8": "are extremely small and quite far from being self-sufficient. In fact, I would argue they're not even alive!"
    } ]
  }, {
    "tStartMs": 484540,
    "dDurationMs": 5540,
    "segs": [ {
      "utf8": "Unlike bacteria which can replicate by themselves,\nviruses rely on hijacking the cellular machinery"
    } ]
  }, {
    "tStartMs": 490090,
    "dDurationMs": 5310,
    "segs": [ {
      "utf8": "of other self-sufficient organisms in order\nto get them to replicate their viral particles"
    } ]
  }, {
    "tStartMs": 495400,
    "dDurationMs": 1040,
    "segs": [ {
      "utf8": "for them."
    } ]
  }, {
    "tStartMs": 496440,
    "dDurationMs": 6570,
    "segs": [ {
      "utf8": "However, hijacking cells isn’t a straightforward\nprocess, and viruses actually require very specific"
    } ]
  }, {
    "tStartMs": 503010,
    "dDurationMs": 5930,
    "segs": [ {
      "utf8": "surface proteins to do that job, which makes them\nhighly specialised at breaking and entering"
    } ]
  }, {
    "tStartMs": 508940,
    "dDurationMs": 3480,
    "segs": [ {
      "utf8": "very specific cells from very specific organisms."
    } ]
  }, {
    "tStartMs": 512420,
    "dDurationMs": 5340,
    "segs": [ {
      "utf8": "So for example, the Human Immunodeficiency Virus, or HIV, which can cause AIDS,"
    } ]
  }, {
    "tStartMs": 517760,
    "dDurationMs": 2740,
    "segs": [ {
      "utf8": "has its entry point on the CD4 receptor"
    } ]
  }, {
    "tStartMs": 520500,
    "dDurationMs": 5800,
    "segs": [ {
      "utf8": "and either the CCR5 or CXCR4 coreceptor on\nCD4 T lymphocytes,"
    } ]
  }, {
    "tStartMs": 526300,
    "dDurationMs": 2100,
    "segs": [ {
      "utf8": "which is a very specific type of white cell."
    } ]
  }, {
    "tStartMs": 529080,
    "dDurationMs": 4460,
    "segs": [ {
      "utf8": "In the case of this novel coronavirus, it\nhas the same entry point as the SARS coronavirus"
    } ]
  }, {
    "tStartMs": 533540,
    "dDurationMs": 4680,
    "segs": [ {
      "utf8": "from 2003, which are the ACE2 receptors in\nthe lungs."
    } ]
  }, {
    "tStartMs": 538220,
    "dDurationMs": 6060,
    "segs": [ {
      "utf8": "It also shares 79.5% of its genetic material\nwith the SARS coronavirus, but it does affect"
    } ]
  }, {
    "tStartMs": 544280,
    "dDurationMs": 1860,
    "segs": [ {
      "utf8": "humans quite differently."
    } ]
  }, {
    "tStartMs": 546140,
    "dDurationMs": 3460,
    "segs": [ {
      "utf8": "In human to human transmission, the virus actually begins to shed"
    } ]
  }, {
    "tStartMs": 549600,
    "dDurationMs": 5380,
    "segs": [ {
      "utf8": "before the person carrying it is symptomatic, which as you know is quite problematic for containing the virus."
    } ]
  }, {
    "tStartMs": 554980,
    "dDurationMs": 5840,
    "segs": [ {
      "utf8": "And unfortunately, it also spreads primarily through droplets and aerosolization from coughs and sneezes."
    } ]
  }, {
    "tStartMs": 561320,
    "dDurationMs": 3220,
    "segs": [ {
      "utf8": "That being said, viral particles have also been found\nin faeces."
    } ]
  }, {
    "tStartMs": 565220,
    "dDurationMs": 4620,
    "segs": [ {
      "utf8": "Even if the droplets or aerosolised particles\naren’t breathed in by someone, the coronavirus"
    } ]
  }, {
    "tStartMs": 569840,
    "dDurationMs": 4920,
    "segs": [ {
      "utf8": "is also capable of surviving or remaining active on surfaces for a period of time,"
    } ]
  }, {
    "tStartMs": 574760,
    "dDurationMs": 2340,
    "segs": [ {
      "utf8": "so if you touch a surface with your hands,"
    } ]
  }, {
    "tStartMs": 577100,
    "dDurationMs": 4240,
    "segs": [ {
      "utf8": "even though it won’t be able to penetrate through your skin, if you then touch your eyes or your"
    } ]
  }, {
    "tStartMs": 581340,
    "dDurationMs": 4980,
    "segs": [ {
      "utf8": "mouth or your mucosa, you can actually contract the coronavirus that way."
    } ]
  }, {
    "tStartMs": 586320,
    "dDurationMs": 2760,
    "segs": [ {
      "utf8": "Who Is Affected by the Coronavirus?"
    } ]
  }, {
    "tStartMs": 589080,
    "dDurationMs": 8180,
    "segs": [ {
      "utf8": "Based on 72314 cases of COVID-19 recorded in China,\ncurrent to the 11th of February, the main risk"
    } ]
  }, {
    "tStartMs": 597260,
    "dDurationMs": 4320,
    "segs": [ {
      "utf8": "factor for having a more severe course of\nCOVID-19 is increasing age."
    } ]
  }, {
    "tStartMs": 601580,
    "dDurationMs": 3880,
    "segs": [ {
      "utf8": "86.6% of cases were in 30 to 79 year olds."
    } ]
  }, {
    "tStartMs": 606100,
    "dDurationMs": 4060,
    "segs": [ {
      "utf8": "Fortunately, it does seem that children are mostly\nspared, with much fewer cases and"
    } ]
  }, {
    "tStartMs": 610160,
    "dDurationMs": 4860,
    "segs": [ {
      "utf8": "at least, according to the study, with no fatalities recorded amongst those under the age of 10."
    } ]
  }, {
    "tStartMs": 615780,
    "dDurationMs": 6140,
    "segs": [ {
      "utf8": "From 10 to 30 years, the number of deaths\nper number of cases, or death rate, is 0.2%."
    } ]
  }, {
    "tStartMs": 621920,
    "dDurationMs": 5080,
    "segs": [ {
      "utf8": "And from then on, the death rate begins to increase,\nwith the highest death rate being amongst"
    } ]
  }, {
    "tStartMs": 627000,
    "dDurationMs": 5520,
    "segs": [ {
      "utf8": "those who are 80+ years old, who actually\n have a nearly 15% death rate."
    } ]
  }, {
    "tStartMs": 632520,
    "dDurationMs": 5440,
    "segs": [ {
      "utf8": "Interestingly, the death rate in men in this\nstudy is actually higher than in women, 2.8% versus"
    } ]
  }, {
    "tStartMs": 637960,
    "dDurationMs": 6280,
    "segs": [ {
      "utf8": "1.7%, however, it must also be noted that\nthis study is based in China and smoking is"
    } ]
  }, {
    "tStartMs": 644240,
    "dDurationMs": 5500,
    "segs": [ {
      "utf8": "highly prevalent amongst older Chinese males,\nwho form the bulk of the age group of the fatalities."
    } ]
  }, {
    "tStartMs": 650260,
    "dDurationMs": 5040,
    "segs": [ {
      "utf8": "Therefore, I personally would say it's currently inconclusive whether that difference in death rate is due"
    } ]
  }, {
    "tStartMs": 655300,
    "dDurationMs": 5420,
    "segs": [ {
      "utf8": "to sex, or whether it's just due to the fact that Chinese males who are older are more likely to smoke,"
    } ]
  }, {
    "tStartMs": 660720,
    "dDurationMs": 5700,
    "segs": [ {
      "utf8": "and that predisposes you to having more lung damage already before being hit by the illness."
    } ]
  }, {
    "tStartMs": 667000,
    "dDurationMs": 3540,
    "segs": [ {
      "utf8": "Likewise, the death rate also increased with\nthe presence of pre-existing conditions, such"
    } ]
  }, {
    "tStartMs": 670540,
    "dDurationMs": 5400,
    "segs": [ {
      "utf8": "as cardiovascular disease, diabetes, chronic\nrespiratory disease, hypertension and cancer."
    } ]
  }, {
    "tStartMs": 675940,
    "dDurationMs": 7060,
    "segs": [ {
      "utf8": "All of these figures that are shown onscreen indicate the risk of dying if infected by COVID-19"
    } ]
  }, {
    "tStartMs": 683000,
    "dDurationMs": 2700,
    "segs": [ {
      "utf8": "if you have said preexisting condition."
    } ]
  }, {
    "tStartMs": 685700,
    "dDurationMs": 5600,
    "segs": [ {
      "utf8": "I would say this is also tied in with increasing age,\nbecause elderly people are more likely to have"
    } ]
  }, {
    "tStartMs": 691300,
    "dDurationMs": 4020,
    "segs": [ {
      "utf8": "developed comorbidities that can potentially lead to complications."
    } ]
  }, {
    "tStartMs": 695800,
    "dDurationMs": 5780,
    "segs": [ {
      "utf8": "There has also been some speculation as to whether\nthe virus was particularly virulent in Asian people."
    } ]
  }, {
    "tStartMs": 702240,
    "dDurationMs": 6159,
    "segs": [ {
      "utf8": "This was actually due to a paper that looked at the\nproportion of ACE2 receptors in lung tissue"
    } ]
  }, {
    "tStartMs": 708400,
    "dDurationMs": 5140,
    "segs": [ {
      "utf8": "from only 7 patients, and one of those was an Asian\nmale and it was found"
    } ]
  }, {
    "tStartMs": 713540,
    "dDurationMs": 3460,
    "segs": [ {
      "utf8": "that this patient had a higher proportion of these receptors."
    } ]
  }, {
    "tStartMs": 717000,
    "dDurationMs": 4160,
    "segs": [ {
      "utf8": "Therefore it was speculated that perhaps Asian\npeople might be more susceptible to having"
    } ]
  }, {
    "tStartMs": 721160,
    "dDurationMs": 5740,
    "segs": [ {
      "utf8": "a more severe course of COVID-19 due to having more potential entry points in their lungs."
    } ]
  }, {
    "tStartMs": 727440,
    "dDurationMs": 5420,
    "segs": [ {
      "utf8": "However, the study is actually inconclusive because there weren’t many datapoints at all - and a subsequent"
    } ]
  }, {
    "tStartMs": 732860,
    "dDurationMs": 5480,
    "segs": [ {
      "utf8": "study that looked at lung tissue from lung cancer\npatients showed that ACE2 receptors were more"
    } ]
  }, {
    "tStartMs": 738340,
    "dDurationMs": 3780,
    "segs": [ {
      "utf8": "prevalent in the lungs of people who were chronic smokers."
    } ]
  }, {
    "tStartMs": 742120,
    "dDurationMs": 4040,
    "segs": [ {
      "utf8": "That being said, that paper has problems too, because it's only from people with lung cancer."
    } ]
  }, {
    "tStartMs": 746160,
    "dDurationMs": 4600,
    "segs": [ {
      "utf8": "But, as said earlier, older Chinese men tend to\nsmoke more, so it may have been a confounding"
    } ]
  }, {
    "tStartMs": 750760,
    "dDurationMs": 3760,
    "segs": [ {
      "utf8": "variable if ACE-2 is more related to smoking than ethnicity."
    } ]
  }, {
    "tStartMs": 754980,
    "dDurationMs": 3320,
    "segs": [ {
      "utf8": "And that being said, there have been more recent outbreaks unfortunately in"
    } ]
  }, {
    "tStartMs": 758300,
    "dDurationMs": 3099,
    "segs": [ {
      "utf8": "Iran and Italy, as well as cases across"
    } ]
  }, {
    "tStartMs": 761400,
    "dDurationMs": 5240,
    "segs": [ {
      "utf8": "all non-Antarctic continents. So I personally think it is\nclear that race isn’t really a factor in being"
    } ]
  }, {
    "tStartMs": 766640,
    "dDurationMs": 2340,
    "segs": [ {
      "utf8": "more or less susceptible to COVID-19."
    } ]
  }, {
    "tStartMs": 768980,
    "dDurationMs": 1860,
    "segs": [ {
      "utf8": "Is the death rate accurate?"
    } ]
  }, {
    "tStartMs": 770840,
    "dDurationMs": 3260,
    "segs": [ {
      "utf8": "Technically speaking, the fatality rate cannot be accurately calculated"
    } ]
  }, {
    "tStartMs": 774100,
    "dDurationMs": 2380,
    "segs": [ {
      "utf8": "until the epidemic has fully run its course."
    } ]
  }, {
    "tStartMs": 777040,
    "dDurationMs": 4200,
    "segs": [ {
      "utf8": "It is not fully accurate to count cases that\nhaven’t been resolved - as it takes around"
    } ]
  }, {
    "tStartMs": 781240,
    "dDurationMs": 4800,
    "segs": [ {
      "utf8": "3 weeks for a patient to unfortunately pass away from complications of COVID-19,"
    } ]
  }, {
    "tStartMs": 786040,
    "dDurationMs": 5860,
    "segs": [ {
      "utf8": "and a similar amount if not longer to be fully recovered from COVID-19 and to cease from being infectious."
    } ]
  }, {
    "tStartMs": 791910,
    "dDurationMs": 5460,
    "segs": [ {
      "utf8": "So this may lead to the temptation of only using\nrecovered vs fatalities to compute this statistic,"
    } ]
  }, {
    "tStartMs": 797370,
    "dDurationMs": 4779,
    "segs": [ {
      "utf8": "but that would actually lead to overinflating the fatality before the epidemic is over (8% currently), as the"
    } ]
  }, {
    "tStartMs": 802149,
    "dDurationMs": 3151,
    "segs": [ {
      "utf8": "patients that eventually recover will take\nlonger to do so."
    } ]
  }, {
    "tStartMs": 805300,
    "dDurationMs": 4320,
    "segs": [ {
      "utf8": "Of course, doing so with the full number of\ncurrent cases is also inaccurate, but knowing"
    } ]
  }, {
    "tStartMs": 809620,
    "dDurationMs": 5019,
    "segs": [ {
      "utf8": "that 80% of cases are mild, it may also be\npossible to predict that most patients with"
    } ]
  }, {
    "tStartMs": 814640,
    "dDurationMs": 4100,
    "segs": [ {
      "utf8": "a good prognosis or not in critical condition\nare more likely to recover."
    } ]
  }, {
    "tStartMs": 819400,
    "dDurationMs": 4680,
    "segs": [ {
      "utf8": "Additionally, as for deaths and recovered\ncases that may go unreported, it is likely"
    } ]
  }, {
    "tStartMs": 824089,
    "dDurationMs": 3980,
    "segs": [ {
      "utf8": "there are both, but the latter is likely\nlarger than the former, which if anything"
    } ]
  }, {
    "tStartMs": 828069,
    "dDurationMs": 2411,
    "segs": [ {
      "utf8": "means the fatality rate is probably going to be lower."
    } ]
  }, {
    "tStartMs": 831180,
    "dDurationMs": 4580,
    "segs": [ {
      "utf8": "It’s also worth noting that the death rate is also \ngoing to be affected by the quality of healthcare"
    } ]
  }, {
    "tStartMs": 835760,
    "dDurationMs": 1720,
    "segs": [ {
      "utf8": "that can be received."
    } ]
  }, {
    "tStartMs": 837480,
    "dDurationMs": 5120,
    "segs": [ {
      "utf8": "Worldometers indicates that 18% of cases are\nserious or critical, which means they required"
    } ]
  }, {
    "tStartMs": 842600,
    "dDurationMs": 5880,
    "segs": [ {
      "utf8": "hospitalisation and possibly support through\nventilators to manage ARDS: acute respiratory"
    } ]
  }, {
    "tStartMs": 848480,
    "dDurationMs": 4380,
    "segs": [ {
      "utf8": "distress syndrome, or other complications\nresulting from pneumonia."
    } ]
  }, {
    "tStartMs": 852860,
    "dDurationMs": 3920,
    "segs": [ {
      "utf8": "Unfortunately and despite good healthcare,\nsome cases will still result in death, but"
    } ]
  }, {
    "tStartMs": 856780,
    "dDurationMs": 3060,
    "segs": [ {
      "utf8": "in other cases, that support could save a life."
    } ]
  }, {
    "tStartMs": 859840,
    "dDurationMs": 3999,
    "segs": [ {
      "utf8": "In regions where such support is unavailable,\na higher proportion of critical cases will"
    } ]
  }, {
    "tStartMs": 863839,
    "dDurationMs": 1310,
    "segs": [ {
      "utf8": "likely be fatal."
    } ]
  }, {
    "tStartMs": 865149,
    "dDurationMs": 5151,
    "segs": [ {
      "utf8": "And likewise, if the epidemic causes many concurrent\ncases in a single region, those resources"
    } ]
  }, {
    "tStartMs": 870300,
    "dDurationMs": 3760,
    "segs": [ {
      "utf8": "won’t be available for everybody at the\nsame time, which will also increase the death"
    } ]
  }, {
    "tStartMs": 874060,
    "dDurationMs": 5480,
    "segs": [ {
      "utf8": "rate. In fact, the death rate in Wuhan is higher than in\nother areas of China, due to the larger volume"
    } ]
  }, {
    "tStartMs": 879540,
    "dDurationMs": 1880,
    "segs": [ {
      "utf8": "of cases and hospitalisations."
    } ]
  }, {
    "tStartMs": 881920,
    "dDurationMs": 4400,
    "segs": [ {
      "utf8": "Likewise, in the outbreak in Iran - although I'm not certain the numbers are fully accurate -"
    } ]
  }, {
    "tStartMs": 886320,
    "dDurationMs": 3640,
    "segs": [ {
      "utf8": "the death rate does appear to be quite a bit higher than expected."
    } ]
  }, {
    "tStartMs": 890540,
    "dDurationMs": 4060,
    "segs": [ {
      "utf8": "I guess it's possible the virus *might* have\nmutated and become more virulent, that is,"
    } ]
  }, {
    "tStartMs": 894600,
    "dDurationMs": 4720,
    "segs": [ {
      "utf8": "it's become more harmful as a disease. I actually doubt that is the case."
    } ]
  }, {
    "tStartMs": 899320,
    "dDurationMs": 3020,
    "segs": [ {
      "utf8": "I actually think it's more likely the healthcare system is being challenged."
    } ]
  }, {
    "tStartMs": 902820,
    "dDurationMs": 4819,
    "segs": [ {
      "utf8": "So in case you don’t know, Iran has been hit\nhard by US sanctions, which actually limits Iran's"
    } ]
  }, {
    "tStartMs": 907640,
    "dDurationMs": 3320,
    "segs": [ {
      "utf8": "ability to purchase medical equipment and medicine\nfrom the US."
    } ]
  }, {
    "tStartMs": 911380,
    "dDurationMs": 4980,
    "segs": [ {
      "utf8": "So as such, although Iran’s healthcare system is by no means unadvanced, it does have"
    } ]
  }, {
    "tStartMs": 916360,
    "dDurationMs": 5300,
    "segs": [ {
      "utf8": "shortages on certain medical equipment and\nit does have to produce most of its medicines locally"
    } ]
  }, {
    "tStartMs": 921660,
    "dDurationMs": 5060,
    "segs": [ {
      "utf8": "- so I don’t actually know if Iran was\nprepared for the unique healthcare challenges"
    } ]
  }, {
    "tStartMs": 926720,
    "dDurationMs": 3080,
    "segs": [ {
      "utf8": "that this novel coronavirus presents."
    } ]
  }, {
    "tStartMs": 929800,
    "dDurationMs": 6380,
    "segs": [ {
      "utf8": "Likewise, in countries where the healthcare system has\ninsufficient resources, I worry that cases"
    } ]
  }, {
    "tStartMs": 936180,
    "dDurationMs": 5520,
    "segs": [ {
      "utf8": "of ARDS that may be salvageable with appropriate\nresources would end up in fatality,"
    } ]
  }, {
    "tStartMs": 941700,
    "dDurationMs": 3760,
    "segs": [ {
      "utf8": "and appropriate containment methods might not be available either, so the disease"
    } ]
  }, {
    "tStartMs": 945460,
    "dDurationMs": 3200,
    "segs": [ {
      "utf8": "might spread further and overwhelm people with cases."
    } ]
  }, {
    "tStartMs": 949120,
    "dDurationMs": 3579,
    "segs": [ {
      "utf8": "Additionally, I worry that people might delay\nor avoid seeking treatment in countries where"
    } ]
  }, {
    "tStartMs": 952700,
    "dDurationMs": 5200,
    "segs": [ {
      "utf8": "healthcare is expensive, such as, for instance, the US,\nand that again might lead to further spread"
    } ]
  }, {
    "tStartMs": 957900,
    "dDurationMs": 5240,
    "segs": [ {
      "utf8": "and for more serious symptoms to become critical or deadly due to the delay in treating them."
    } ]
  }, {
    "tStartMs": 963560,
    "dDurationMs": 3560,
    "segs": [ {
      "utf8": "How does the novel coronavirus cause disease\nand kill?"
    } ]
  }, {
    "tStartMs": 967120,
    "dDurationMs": 1340,
    "segs": [ {
      "utf8": "How do we treat it?"
    } ]
  }, {
    "tStartMs": 968460,
    "dDurationMs": 4620,
    "segs": [ {
      "utf8": "The novel coronavirus is not fatal in most\ncases - the vast majority of cases are mild,"
    } ]
  }, {
    "tStartMs": 973080,
    "dDurationMs": 2380,
    "segs": [ {
      "utf8": "only with minor respiratory symptoms."
    } ]
  }, {
    "tStartMs": 975460,
    "dDurationMs": 4260,
    "segs": [ {
      "utf8": "A smaller subset of people will develop non-life-threatening pneumonia."
    } ]
  }, {
    "tStartMs": 979720,
    "dDurationMs": 3240,
    "segs": [ {
      "utf8": "The lesions shown are atypical and different\nto pneumonia caused"
    } ]
  }, {
    "tStartMs": 982960,
    "dDurationMs": 2400,
    "segs": [ {
      "utf8": "from other diseases, including SARS."
    } ]
  }, {
    "tStartMs": 985960,
    "dDurationMs": 5280,
    "segs": [ {
      "utf8": "However, there is a small percentage of people\nwho will go on to develop ARDS,"
    } ]
  }, {
    "tStartMs": 991240,
    "dDurationMs": 2820,
    "segs": [ {
      "utf8": "or Acute Respiratory Distress Syndrome."
    } ]
  }, {
    "tStartMs": 994060,
    "dDurationMs": 6140,
    "segs": [ {
      "utf8": "On average, shortness of breath appears around\n5 days after the onset of illness, and then ARDS,"
    } ]
  }, {
    "tStartMs": 1000200,
    "dDurationMs": 4560,
    "segs": [ {
      "utf8": "if it occurs, occurs on average around 8 days\nafter the onset of symptoms."
    } ]
  }, {
    "tStartMs": 1005160,
    "dDurationMs": 4380,
    "segs": [ {
      "utf8": "ARDS is often diagnosed by hypoxemia or low\noxygen levels in blood (often beneath 88%),"
    } ]
  }, {
    "tStartMs": 1009540,
    "dDurationMs": 4420,
    "segs": [ {
      "utf8": "rapid onset of shortness of breath and a chest\nscan showing infiltrates in the lungs."
    } ]
  }, {
    "tStartMs": 1014500,
    "dDurationMs": 4620,
    "segs": [ {
      "utf8": "These infiltrates are caused by fluid present\nin the alveoli, which impedes the oxygen from"
    } ]
  }, {
    "tStartMs": 1019120,
    "dDurationMs": 1740,
    "segs": [ {
      "utf8": "entering the bloodstream appropriately."
    } ]
  }, {
    "tStartMs": 1021440,
    "dDurationMs": 6220,
    "segs": [ {
      "utf8": "Currently, there is no cure for the coronavirus, and there\nis actually no cure for ARDS other than palliative care,"
    } ]
  }, {
    "tStartMs": 1027660,
    "dDurationMs": 4420,
    "segs": [ {
      "utf8": "although it must be said that substantial advances in its treatment have been made over the"
    } ]
  }, {
    "tStartMs": 1032080,
    "dDurationMs": 5000,
    "segs": [ {
      "utf8": "past 20 years, which make ARDS much less of a death sentence than it used to be."
    } ]
  }, {
    "tStartMs": 1037580,
    "dDurationMs": 4960,
    "segs": [ {
      "utf8": "There are several different strategies that are used, especially when hypoxemia persists."
    } ]
  }, {
    "tStartMs": 1043080,
    "dDurationMs": 2980,
    "segs": [ {
      "utf8": "Firstly, the patient is generally connected to oxygen."
    } ]
  }, {
    "tStartMs": 1046520,
    "dDurationMs": 5280,
    "segs": [ {
      "utf8": "Where possible, mechanical ventilation is\nactually avoided, as the motion of the air"
    } ]
  }, {
    "tStartMs": 1051800,
    "dDurationMs": 4480,
    "segs": [ {
      "utf8": "entering and exiting the alveoli will cause shear stress on the alveoli."
    } ]
  }, {
    "tStartMs": 1056280,
    "dDurationMs": 4180,
    "segs": [ {
      "utf8": "This can make them shut down and can actually make the situation worse."
    } ]
  }, {
    "tStartMs": 1060460,
    "dDurationMs": 6260,
    "segs": [ {
      "utf8": "So instead positive-end expiratory pressure, or PEEP,\nis used, with a very high percentage of oxygen,"
    } ]
  }, {
    "tStartMs": 1066720,
    "dDurationMs": 5200,
    "segs": [ {
      "utf8": "with the objective of increasing the oxygen saturation that is  passed into the blood through the alveoli."
    } ]
  }, {
    "tStartMs": 1072640,
    "dDurationMs": 4660,
    "segs": [ {
      "utf8": "Secondly, patients with ARDS are also often\nplaced in a prone position,"
    } ]
  }, {
    "tStartMs": 1077300,
    "dDurationMs": 4920,
    "segs": [ {
      "utf8": "that is, lying on their fronts, and this also helps to increase oxygenation as well."
    } ]
  }, {
    "tStartMs": 1082820,
    "dDurationMs": 5240,
    "segs": [ {
      "utf8": "Sedatives and medications that prevent movement\nare generally used as well, because ventilation support"
    } ]
  }, {
    "tStartMs": 1088060,
    "dDurationMs": 4160,
    "segs": [ {
      "utf8": "can actually be quite painful for the patient, \nand that can lead to agitation,"
    } ]
  }, {
    "tStartMs": 1092220,
    "dDurationMs": 2560,
    "segs": [ {
      "utf8": "which can also affect and encumber treatment."
    } ]
  }, {
    "tStartMs": 1095040,
    "dDurationMs": 4620,
    "segs": [ {
      "utf8": "Diuretics are also used to encourage the\nbody to remove  the fluids and that"
    } ]
  }, {
    "tStartMs": 1099660,
    "dDurationMs": 4480,
    "segs": [ {
      "utf8": "can help reduce the build up in the lungs - but, this also requires very careful management"
    } ]
  }, {
    "tStartMs": 1104140,
    "dDurationMs": 4240,
    "segs": [ {
      "utf8": "because if it's done improperly, it will actually affect and lower the blood pressure"
    } ]
  }, {
    "tStartMs": 1108380,
    "dDurationMs": 1600,
    "segs": [ {
      "utf8": "and can also damage the kidneys."
    } ]
  }, {
    "tStartMs": 1110600,
    "dDurationMs": 3820,
    "segs": [ {
      "utf8": "There are also “ECMO” which stands for extracorporeal"
    } ]
  }, {
    "tStartMs": 1114430,
    "dDurationMs": 5020,
    "segs": [ {
      "utf8": "membrane oxygenation, where blood is taken\nfrom the body and pumped through a membrane"
    } ]
  }, {
    "tStartMs": 1119450,
    "dDurationMs": 6350,
    "segs": [ {
      "utf8": "that adds oxygen and removes carbon dioxide\n- in essence it basically carries out the job of the lung"
    } ]
  }, {
    "tStartMs": 1125800,
    "dDurationMs": 1000,
    "segs": [ {
      "utf8": "for you."
    } ]
  }, {
    "tStartMs": 1126800,
    "dDurationMs": 5710,
    "segs": [ {
      "utf8": "These strategies help increase oxygenation,\nbut if the lung damage is extensive, the hypoxemia"
    } ]
  }, {
    "tStartMs": 1132510,
    "dDurationMs": 4750,
    "segs": [ {
      "utf8": "may not be relieved and therefore the body\ncan still be subjected to hypoxic damage."
    } ]
  }, {
    "tStartMs": 1137660,
    "dDurationMs": 5780,
    "segs": [ {
      "utf8": "It’s also worth noting that the last two\ntreatments, especially ECMO, require a lot"
    } ]
  }, {
    "tStartMs": 1143500,
    "dDurationMs": 5540,
    "segs": [ {
      "utf8": "of management and attention, so it would likely not be feasible to carry out safely if there's a large volume of"
    } ]
  }, {
    "tStartMs": 1149040,
    "dDurationMs": 5600,
    "segs": [ {
      "utf8": "patients for a lower volume of nurses, and\neven access to oxygen and ventilators may"
    } ]
  }, {
    "tStartMs": 1154640,
    "dDurationMs": 5880,
    "segs": [ {
      "utf8": "not necessarily be guaranteed if there are many critical\ncases happening at once within one hospital."
    } ]
  }, {
    "tStartMs": 1160980,
    "dDurationMs": 5420,
    "segs": [ {
      "utf8": "Althuogh the novel coronavirus mainly affects the lungs,\nit can also cause damage to other organs."
    } ]
  }, {
    "tStartMs": 1166400,
    "dDurationMs": 4620,
    "segs": [ {
      "utf8": "There have been reports of people having  gastrointestinal problems, such as nausea and diarrhoea,"
    } ]
  }, {
    "tStartMs": 1171020,
    "dDurationMs": 3400,
    "segs": [ {
      "utf8": "and virus particles have then been found in their stools."
    } ]
  }, {
    "tStartMs": 1174420,
    "dDurationMs": 4740,
    "segs": [ {
      "utf8": "The coronavirus can also affect the heart\nand blood vessels - some patients have been"
    } ]
  }, {
    "tStartMs": 1179160,
    "dDurationMs": 5860,
    "segs": [ {
      "utf8": "reported to have irregular or atypical heartbeats\nand a lower than normal blood pressure."
    } ]
  }, {
    "tStartMs": 1185020,
    "dDurationMs": 4080,
    "segs": [ {
      "utf8": "Liver and kidney damage has also been observed\nin COVID-19 patients."
    } ]
  }, {
    "tStartMs": 1189500,
    "dDurationMs": 5520,
    "segs": [ {
      "utf8": "That being said, I think it's inconclusive whether\nthe liver damage is a consequence of drugs"
    } ]
  }, {
    "tStartMs": 1195020,
    "dDurationMs": 5600,
    "segs": [ {
      "utf8": "used to treat the patient with the disease,\nor if it might be a consequence of the coronavirus."
    } ]
  }, {
    "tStartMs": 1201040,
    "dDurationMs": 4260,
    "segs": [ {
      "utf8": "Likewise, some people had kidney damage, some\neven requiring a kidney transplant."
    } ]
  }, {
    "tStartMs": 1205740,
    "dDurationMs": 4180,
    "segs": [ {
      "utf8": "However, again this could be a knock-on effect of continued hypoxemia;"
    } ]
  }, {
    "tStartMs": 1210380,
    "dDurationMs": 3680,
    "segs": [ {
      "utf8": "it might be due to improper fluid management if they took diuretics,"
    } ]
  }, {
    "tStartMs": 1214060,
    "dDurationMs": 3180,
    "segs": [ {
      "utf8": "and it might not necessarily be a direct consequence of the virus."
    } ]
  }, {
    "tStartMs": 1217860,
    "dDurationMs": 4940,
    "segs": [ {
      "utf8": "Finally, some people may experience sepsis,\nor a ‘cytokine storm’, which is essentially"
    } ]
  }, {
    "tStartMs": 1222800,
    "dDurationMs": 5840,
    "segs": [ {
      "utf8": "an overreaction from the immune system and it actually\nends up causing further damage and build up"
    } ]
  }, {
    "tStartMs": 1228640,
    "dDurationMs": 4000,
    "segs": [ {
      "utf8": "in the lungs. It can make ARDS even more severe and unmanageable"
    } ]
  }, {
    "tStartMs": 1232640,
    "dDurationMs": 2700,
    "segs": [ {
      "utf8": "and it also makes the lungs more susceptible to secondary"
    } ]
  }, {
    "tStartMs": 1235340,
    "dDurationMs": 5560,
    "segs": [ {
      "utf8": "infection, because other opportunistic bacteria\nand viruses can also infect the patient and"
    } ]
  }, {
    "tStartMs": 1240900,
    "dDurationMs": 1660,
    "segs": [ {
      "utf8": "cause further complications."
    } ]
  }, {
    "tStartMs": 1243200,
    "dDurationMs": 6260,
    "segs": [ {
      "utf8": "Although the pneumonia is atypical, the instances\nof liver damage and kidney damage, and also overactive"
    } ]
  }, {
    "tStartMs": 1249460,
    "dDurationMs": 5820,
    "segs": [ {
      "utf8": "immune responses, such as the cytokine storm, have been documented in previous cases of SARS and MERS"
    } ]
  }, {
    "tStartMs": 1255280,
    "dDurationMs": 2600,
    "segs": [ {
      "utf8": "during their respective coronavirus outbreaks."
    } ]
  }, {
    "tStartMs": 1258180,
    "dDurationMs": 2320,
    "segs": [ {
      "utf8": "How long will it take for there to be a cure?"
    } ]
  }, {
    "tStartMs": 1260500,
    "dDurationMs": 920,
    "segs": [ {
      "utf8": "*big shrug*"
    } ]
  }, {
    "tStartMs": 1261420,
    "dDurationMs": 6280,
    "segs": [ {
      "utf8": "I know different antiretrovirals have been tried, and \nsome claim that some might be somewhat effective,"
    } ]
  }, {
    "tStartMs": 1267700,
    "dDurationMs": 4980,
    "segs": [ {
      "utf8": "but to my knowledge, nothing that I have read to\ndate indicates that there is a drug specific"
    } ]
  }, {
    "tStartMs": 1272680,
    "dDurationMs": 3920,
    "segs": [ {
      "utf8": "to this coronavirus that halts its infection or\ntransmission."
    } ]
  }, {
    "tStartMs": 1276600,
    "dDurationMs": 5020,
    "segs": [ {
      "utf8": "Therefore, the cure available is the one that's actually developed by your body’s immune system,"
    } ]
  }, {
    "tStartMs": 1281620,
    "dDurationMs": 1420,
    "segs": [ {
      "utf8": "given enough time."
    } ]
  }, {
    "tStartMs": 1283040,
    "dDurationMs": 5660,
    "segs": [ {
      "utf8": "I would say at this point, healthcare is more palliative, that is, it affords relief, and ideally buys time"
    } ]
  }, {
    "tStartMs": 1288700,
    "dDurationMs": 2480,
    "segs": [ {
      "utf8": "for the patient’s immune system to kick\nin."
    } ]
  }, {
    "tStartMs": 1291180,
    "dDurationMs": 5640,
    "segs": [ {
      "utf8": "Hopefully curative treatment will be available in the future, but to my knowledge there is nothing to date."
    } ]
  }, {
    "tStartMs": 1296820,
    "dDurationMs": 2000,
    "segs": [ {
      "utf8": "Why do vaccines take so long?"
    } ]
  }, {
    "tStartMs": 1298830,
    "dDurationMs": 4670,
    "segs": [ {
      "utf8": "I don’t know how long it will take for a\ncure to be developed, but it is known that"
    } ]
  }, {
    "tStartMs": 1303500,
    "dDurationMs": 5801,
    "segs": [ {
      "utf8": "a vaccine would, at the very least, take 18\nmonths to be developed - and even then, I"
    } ]
  }, {
    "tStartMs": 1309301,
    "dDurationMs": 5359,
    "segs": [ {
      "utf8": "think that might be an overly optimistic and\nearly date, because it would rely on the vaccine"
    } ]
  }, {
    "tStartMs": 1314660,
    "dDurationMs": 3560,
    "segs": [ {
      "utf8": "being developed and passing all trials early and quickly."
    } ]
  }, {
    "tStartMs": 1318740,
    "dDurationMs": 5560,
    "segs": [ {
      "utf8": "Usually vaccines take around 2 to 5 years to make,\nand there are also many diseases, such as dengue,"
    } ]
  }, {
    "tStartMs": 1324300,
    "dDurationMs": 6160,
    "segs": [ {
      "utf8": "chagas, malaria amongst many other neglected tropical diseases that claim many lives every single"
    } ]
  }, {
    "tStartMs": 1330460,
    "dDurationMs": 3640,
    "segs": [ {
      "utf8": "year, and they still don’t have reliable vaccines available."
    } ]
  }, {
    "tStartMs": 1334100,
    "dDurationMs": 2840,
    "segs": [ {
      "utf8": "And it's not due to lack of research necessarily."
    } ]
  }, {
    "tStartMs": 1338060,
    "dDurationMs": 3820,
    "segs": [ {
      "utf8": "The truth - plain and simple -  is that vaccine development is tricky."
    } ]
  }, {
    "tStartMs": 1341880,
    "dDurationMs": 5340,
    "segs": [ {
      "utf8": "You want to develop something that is safe\n- firstly, it has to be specific enough"
    } ]
  }, {
    "tStartMs": 1347230,
    "dDurationMs": 5410,
    "segs": [ {
      "utf8": "to the novel coronavirus such that the antibodies and immune response that the body prepares in response"
    } ]
  }, {
    "tStartMs": 1352640,
    "dDurationMs": 5930,
    "segs": [ {
      "utf8": "to the vaccine will be effective against the\nvirus and not anything more or less specific"
    } ]
  }, {
    "tStartMs": 1358570,
    "dDurationMs": 6540,
    "segs": [ {
      "utf8": "than that coronavirus. And also, for said response to not\nbe an overresponse when exposed to the vaccine"
    } ]
  }, {
    "tStartMs": 1365110,
    "dDurationMs": 3070,
    "segs": [ {
      "utf8": "or the virus - because that would also be dangerous."
    } ]
  }, {
    "tStartMs": 1368180,
    "dDurationMs": 5210,
    "segs": [ {
      "utf8": "This process takes time, as testing vaccine\nsafety requires several rounds of trials before"
    } ]
  }, {
    "tStartMs": 1373390,
    "dDurationMs": 4110,
    "segs": [ {
      "utf8": "reaching humans and before initiating any\nvaccination campaigns."
    } ]
  }, {
    "tStartMs": 1377900,
    "dDurationMs": 4120,
    "segs": [ {
      "utf8": "There is research on the SARS virus available, and some of it will definitely be useful for"
    } ]
  }, {
    "tStartMs": 1382020,
    "dDurationMs": 5980,
    "segs": [ {
      "utf8": "developing a vaccine for the novel coronavirus, however it will still entail developing a new vaccine"
    } ]
  }, {
    "tStartMs": 1388000,
    "dDurationMs": 6660,
    "segs": [ {
      "utf8": "and ensuring that it passes through all the different trials safely, so almost for sure the first sweep of this epidemic"
    } ]
  }, {
    "tStartMs": 1394660,
    "dDurationMs": 2440,
    "segs": [ {
      "utf8": "will pass through entirely susceptible people."
    } ]
  }, {
    "tStartMs": 1398000,
    "dDurationMs": 5680,
    "segs": [ {
      "utf8": "And all of this is not even taking into consideration\nthe fact that the virus could mutate develop"
    } ]
  }, {
    "tStartMs": 1403680,
    "dDurationMs": 6680,
    "segs": [ {
      "utf8": "and it could develop new strains, and that of course is an additional headache for vaccine development."
    } ]
  }, {
    "tStartMs": 1410360,
    "dDurationMs": 3980,
    "segs": [ {
      "utf8": "Speaking of which, it’s probably a good\ntime to remind you to have your flu shot if you"
    } ]
  }, {
    "tStartMs": 1414340,
    "dDurationMs": 5800,
    "segs": [ {
      "utf8": "haven’t already. Flu season this year, I know, has been pretty bad, and the flu is known to mutate"
    } ]
  }, {
    "tStartMs": 1420140,
    "dDurationMs": 6260,
    "segs": [ {
      "utf8": "every year. I will say I've seen some research that suggests they think the genetics of this novel"
    } ]
  }, {
    "tStartMs": 1426400,
    "dDurationMs": 5340,
    "segs": [ {
      "utf8": "coronavirus is relatively stable, so hopefully we won't be facing a virus that mutates too often."
    } ]
  }, {
    "tStartMs": 1432240,
    "dDurationMs": 2360,
    "segs": [ {
      "utf8": "What Are the symptoms of COVID-19?"
    } ]
  }, {
    "tStartMs": 1434600,
    "dDurationMs": 5280,
    "segs": [ {
      "utf8": "Firstly, it’s worth noting and reminding  that the novel coronavirus is known to be asymptomatic anywhere"
    } ]
  }, {
    "tStartMs": 1439880,
    "dDurationMs": 4380,
    "segs": [ {
      "utf8": "up to around 2 weeks after contracting\nit, with a few exceptional outliers taking"
    } ]
  }, {
    "tStartMs": 1444260,
    "dDurationMs": 4800,
    "segs": [ {
      "utf8": "closer to 3 to 3 and a half weeks, but it is still infectious during this period."
    } ]
  }, {
    "tStartMs": 1449560,
    "dDurationMs": 4440,
    "segs": [ {
      "utf8": "When it goes on to cause disease, the most common symptom is fever."
    } ]
  }, {
    "tStartMs": 1454000,
    "dDurationMs": 4560,
    "segs": [ {
      "utf8": "Studies on symptoms that have been displayed by people who ended up being hospitalised"
    } ]
  }, {
    "tStartMs": 1458560,
    "dDurationMs": 7800,
    "segs": [ {
      "utf8": "for treatment and people  who tested positive for COVID-19 show that 83 to 98.5% had a fever."
    } ]
  }, {
    "tStartMs": 1466360,
    "dDurationMs": 5760,
    "segs": [ {
      "utf8": "60 to 80% have a dry cough, and 20 - 30% will\nget shortness of breath."
    } ]
  }, {
    "tStartMs": 1472120,
    "dDurationMs": 5340,
    "segs": [ {
      "utf8": "Of course, many illnesses can cause very similar\nsymptoms, but given what we know, should you"
    } ]
  }, {
    "tStartMs": 1477460,
    "dDurationMs": 5460,
    "segs": [ {
      "utf8": "present these symptoms, or you might  suspect that you could have it, I would recommend firstly"
    } ]
  }, {
    "tStartMs": 1482920,
    "dDurationMs": 6800,
    "segs": [ {
      "utf8": "self-isolating and then secondly getting in touch over the phone with your healthcare clinic to be safe and to avoid"
    } ]
  }, {
    "tStartMs": 1489720,
    "dDurationMs": 5140,
    "segs": [ {
      "utf8": "passing anything on to other people, whether it be COVID-19 or anything else that you may have."
    } ]
  }, {
    "tStartMs": 1495380,
    "dDurationMs": 2320,
    "segs": [ {
      "utf8": "How Can I Protect Myself And Others?"
    } ]
  }, {
    "tStartMs": 1497700,
    "dDurationMs": 4240,
    "segs": [ {
      "utf8": "Firstly, it’s good to be alert and aware -\nwhich I guess you already are if you decided to"
    } ]
  }, {
    "tStartMs": 1501940,
    "dDurationMs": 5240,
    "segs": [ {
      "utf8": "watch this video and find information online\n- but also not overly panicky either."
    } ]
  }, {
    "tStartMs": 1507180,
    "dDurationMs": 4160,
    "segs": [ {
      "utf8": "Anxiety is just gonna make your immune system worse and it's not gonna prepare you any better."
    } ]
  }, {
    "tStartMs": 1511740,
    "dDurationMs": 2420,
    "segs": [ {
      "utf8": "The answer to this though, depends on where\nyou live."
    } ]
  }, {
    "tStartMs": 1514160,
    "dDurationMs": 3860,
    "segs": [ {
      "utf8": "If you’re in the full swing of an epidemic,\nit’s probably worth listening to your government,"
    } ]
  }, {
    "tStartMs": 1518020,
    "dDurationMs": 6760,
    "segs": [ {
      "utf8": "because they ought to have specific recommendations both to your situation and your location,"
    } ]
  }, {
    "tStartMs": 1524780,
    "dDurationMs": 5680,
    "segs": [ {
      "utf8": "such as how to do self-isolation, how to quarantine, what to do with regards to healthcare."
    } ]
  }, {
    "tStartMs": 1530700,
    "dDurationMs": 5000,
    "segs": [ {
      "utf8": "If you’re in an area that has no or relatively\nfew cases, then it's worth staying alert"
    } ]
  }, {
    "tStartMs": 1535700,
    "dDurationMs": 5280,
    "segs": [ {
      "utf8": "so as to be prepared should anything actually occur or change - but no need to panic either."
    } ]
  }, {
    "tStartMs": 1541720,
    "dDurationMs": 5440,
    "segs": [ {
      "utf8": "Firstly, earlier I mentioned the virus - like\nmany other viruses - can survive on surfaces"
    } ]
  }, {
    "tStartMs": 1547160,
    "dDurationMs": 1220,
    "segs": [ {
      "utf8": "that can be touched."
    } ]
  }, {
    "tStartMs": 1548880,
    "dDurationMs": 6860,
    "segs": [ {
      "utf8": "Therefore, washing hands often and properly, with soap\nand water, will help to keep them clean."
    } ]
  }, {
    "tStartMs": 1555740,
    "dDurationMs": 7040,
    "segs": [ {
      "utf8": "Most importantly, I would avoid touching your face\nbecause this will prevent any particles from transferring"
    } ]
  }, {
    "tStartMs": 1562780,
    "dDurationMs": 1060,
    "segs": [ {
      "utf8": "into your mucosa."
    } ]
  }, {
    "tStartMs": 1564380,
    "dDurationMs": 4240,
    "segs": [ {
      "utf8": "Wearing gloves, if you can, especially if you’re out in public sitting in public transport,"
    } ]
  }, {
    "tStartMs": 1568620,
    "dDurationMs": 5860,
    "segs": [ {
      "utf8": "can also serve as a deterrent from actually putting your hands to your face, or help to remind you to not do that."
    } ]
  }, {
    "tStartMs": 1575200,
    "dDurationMs": 5480,
    "segs": [ {
      "utf8": "Likewise, disinfecting surfaces in your home\nwill also prevent viruses from surviving in your home"
    } ]
  }, {
    "tStartMs": 1580680,
    "dDurationMs": 5040,
    "segs": [ {
      "utf8": "and then picking them up later. Make sure you wash food well, avoid any cross-contamination."
    } ]
  }, {
    "tStartMs": 1586260,
    "dDurationMs": 5480,
    "segs": [ {
      "utf8": "If you are going to cough or sneeze, do so\ninto a tissue, immediately wrap it up, throw"
    } ]
  }, {
    "tStartMs": 1591780,
    "dDurationMs": 6880,
    "segs": [ {
      "utf8": "it away. If you can, wrap up that tissue in another one. I think it's... Catch It, Wrap It, Throw It."
    } ]
  }, {
    "tStartMs": 1599080,
    "dDurationMs": 3560,
    "segs": [ {
      "utf8": "And then obviously, wash your hands immediately. If you can't, then"
    } ]
  }, {
    "tStartMs": 1602640,
    "dDurationMs": 4240,
    "segs": [ {
      "utf8": "cough or sneeze into your elbow, it'll\nprevent droplets from going out into the air,"
    } ]
  }, {
    "tStartMs": 1606880,
    "dDurationMs": 4020,
    "segs": [ {
      "utf8": "plus it won't be on your hands so you are\nless likely to then touch and spread it onto"
    } ]
  }, {
    "tStartMs": 1610900,
    "dDurationMs": 6100,
    "segs": [ {
      "utf8": "other surfaces. Facemasks can offer protection from liquid droplets, and depending on the type"
    } ]
  }, {
    "tStartMs": 1617000,
    "dDurationMs": 6280,
    "segs": [ {
      "utf8": "you’re using, and if you're using them correctly, they can also protect from smaller aerosol particles."
    } ]
  }, {
    "tStartMs": 1623800,
    "dDurationMs": 2580,
    "segs": [ {
      "utf8": "They don’t protect the eyes though, and they aren't foolproof."
    } ]
  }, {
    "tStartMs": 1626800,
    "dDurationMs": 4080,
    "segs": [ {
      "utf8": "Airports, public transport and hospitals are\nthe three places I would definitely"
    } ]
  }, {
    "tStartMs": 1630880,
    "dDurationMs": 4880,
    "segs": [ {
      "utf8": "recommend wearing facemasks and gloves and being as protected as possible."
    } ]
  }, {
    "tStartMs": 1635760,
    "dDurationMs": 3060,
    "segs": [ {
      "utf8": "If you are sick, please wear a facemask too."
    } ]
  }, {
    "tStartMs": 1638820,
    "dDurationMs": 4800,
    "segs": [ {
      "utf8": "Finally, hopefully it doesn’t need saying,\nbut I think it's always worthy of reminding -"
    } ]
  }, {
    "tStartMs": 1643960,
    "dDurationMs": 1520,
    "segs": [ {
      "utf8": "please don’t take antibiotics."
    } ]
  }, {
    "tStartMs": 1646100,
    "dDurationMs": 4360,
    "segs": [ {
      "utf8": "Antibiotics only work by breaking down\n the cell walls of certain bacteria."
    } ]
  }, {
    "tStartMs": 1651020,
    "dDurationMs": 4820,
    "segs": [ {
      "utf8": "Viruses as said earlier, are way smaller than\nbacteria and they don’t have cell walls or structures"
    } ]
  }, {
    "tStartMs": 1655850,
    "dDurationMs": 5900,
    "segs": [ {
      "utf8": "remotely similar to bacteria, so antibiotics are completely ineffective against them."
    } ]
  }, {
    "tStartMs": 1661750,
    "dDurationMs": 6470,
    "segs": [ {
      "utf8": "The only instance where you might be asked to take antibiotics is when they're administered by doctors"
    } ]
  }, {
    "tStartMs": 1668220,
    "dDurationMs": 4660,
    "segs": [ {
      "utf8": "to hospitalised patients who may be at risk from suffering secondary infection."
    } ]
  }, {
    "tStartMs": 1673500,
    "dDurationMs": 3440,
    "segs": [ {
      "utf8": "Otherwise, you don't need to take them. You're just creating resistant bacteria."
    } ]
  }, {
    "tStartMs": 1677740,
    "dDurationMs": 4020,
    "segs": [ {
      "utf8": "If you suspect you may have the coronavirus,\nor you've been somewhere in the last two to"
    } ]
  }, {
    "tStartMs": 1681760,
    "dDurationMs": 7120,
    "segs": [ {
      "utf8": "three weeks where there was a risk of contracting\nit, then I would recommend and almost urge you"
    } ]
  }, {
    "tStartMs": 1688880,
    "dDurationMs": 4260,
    "segs": [ {
      "utf8": "to stay at home, self-isolate and phone in to your healthcare provider."
    } ]
  }, {
    "tStartMs": 1693760,
    "dDurationMs": 5800,
    "segs": [ {
      "utf8": "Avoid walking into a clinic as, if you are carrying it, you could spread it on to others who might already be ill,"
    } ]
  }, {
    "tStartMs": 1699800,
    "dDurationMs": 5020,
    "segs": [ {
      "utf8": "and you can also increase your own chance of\ncontracting something - so first find out what"
    } ]
  }, {
    "tStartMs": 1704820,
    "dDurationMs": 2420,
    "segs": [ {
      "utf8": "their advice is over the phone."
    } ]
  }, {
    "tStartMs": 1707640,
    "dDurationMs": 5040,
    "segs": [ {
      "utf8": "Your doctor or nurse should give you the best advice\non how to protect yourself and"
    } ]
  }, {
    "tStartMs": 1712680,
    "dDurationMs": 5140,
    "segs": [ {
      "utf8": "to protect yourself from others, regardless of whether you're staying at home or need to go into a clinic."
    } ]
  }, {
    "tStartMs": 1717820,
    "dDurationMs": 5520,
    "segs": [ {
      "utf8": "Cause they might have a procedure for how you go to get tested, or get hospitalised, depending on what you need."
    } ]
  }, {
    "tStartMs": 1723980,
    "dDurationMs": 4300,
    "segs": [ {
      "utf8": "Anyway, I hope you found this video useful,\nI promise the next one will be a little bit cheerier."
    } ]
  }, {
    "tStartMs": 1728500,
    "dDurationMs": 4160,
    "segs": [ {
      "utf8": "And after that, there will be a part 2 coming \nsoon, talking all about epidemiology and"
    } ]
  }, {
    "tStartMs": 1732660,
    "dDurationMs": 5790,
    "segs": [ {
      "utf8": "how scientists can build models to make predictions\nabout how diseases will - or won’t - spread"
    } ]
  }, {
    "tStartMs": 1738450,
    "dDurationMs": 2330,
    "segs": [ {
      "utf8": "throughout a population, because you know"
    } ]
  }, {
    "tStartMs": 1740780,
    "dDurationMs": 4160,
    "segs": [ {
      "utf8": "me, I enjoy my interdisciplinary sciences and how they influence each other."
    } ]
  }, {
    "tStartMs": 1745340,
    "dDurationMs": 5620,
    "segs": [ {
      "utf8": "Which incidentally, if you want a headstart\non this new video, feel free to head over to today’s"
    } ]
  }, {
    "tStartMs": 1750960,
    "dDurationMs": 1580,
    "segs": [ {
      "utf8": "sponsor, which is Brilliant."
    } ]
  }, {
    "tStartMs": 1752800,
    "dDurationMs": 4060,
    "segs": [ {
      "utf8": "Brilliant is a problem solving website which\nhelps you delve into the world of math and"
    } ]
  }, {
    "tStartMs": 1756860,
    "dDurationMs": 2300,
    "segs": [ {
      "utf8": "science by doing, as well as by watching."
    } ]
  }, {
    "tStartMs": 1759580,
    "dDurationMs": 4060,
    "segs": [ {
      "utf8": "They teach things across different modules - machine learning, mathematics, geometry -"
    } ]
  }, {
    "tStartMs": 1763640,
    "dDurationMs": 4760,
    "segs": [ {
      "utf8": "and you can then do different exercises to test your understanding and put it into practice."
    } ]
  }, {
    "tStartMs": 1768400,
    "dDurationMs": 4380,
    "segs": [ {
      "utf8": "This upcoming epidemiology video may or may\nnot have required me to brush up on my differential"
    } ]
  }, {
    "tStartMs": 1772780,
    "dDurationMs": 3600,
    "segs": [ {
      "utf8": "equations, of which Brilliant very conveniently\nhas a module on."
    } ]
  }, {
    "tStartMs": 1776390,
    "dDurationMs": 4090,
    "segs": [ {
      "utf8": "So if you need to do revision for college, you just\nwant a headstart on my next video or you"
    } ]
  }, {
    "tStartMs": 1780480,
    "dDurationMs": 4480,
    "segs": [ {
      "utf8": "want to learn new skills in maths and science\nfor the personal joy of it as I did, feel"
    } ]
  }, {
    "tStartMs": 1784960,
    "dDurationMs": 3420,
    "segs": [ {
      "utf8": "free to head over to brilliant.org/drawcuriosity."
    } ]
  }, {
    "tStartMs": 1788900,
    "dDurationMs": 5040,
    "segs": [ {
      "utf8": "The first 200 people who sign up over there\nwill get 20% off an annual premium subscription."
    } ]
  }, {
    "tStartMs": 1794480,
    "dDurationMs": 4500,
    "segs": [ {
      "utf8": "I think they’re doing a great thing over there, it’s a fantastic resource, it's very well put together."
    } ]
  }, {
    "tStartMs": 1798980,
    "dDurationMs": 2700,
    "segs": [ {
      "utf8": "I've been using it and learning a lot from it, and also they're"
    } ]
  }, {
    "tStartMs": 1801680,
    "dDurationMs": 3960,
    "segs": [ {
      "utf8": "supporting Draw Curiosity - so if this would be\nhelpful to you in any way, please go ahead"
    } ]
  }, {
    "tStartMs": 1805640,
    "dDurationMs": 1240,
    "segs": [ {
      "utf8": "and grab that discount!"
    } ]
  }, {
    "tStartMs": 1807200,
    "dDurationMs": 3700,
    "segs": [ {
      "utf8": "And as always, thank you so much to all of my wonderful\npatrons on Patreon!"
    } ]
  }, {
    "tStartMs": 1810900,
    "dDurationMs": 12680,
    "segs": [ {
      "utf8": "[Music: Thastor \u0026 Cryosleepkitten]"
    } ]
  }, {
    "tStartMs": 1823580,
    "dDurationMs": 2200,
    "segs": [ {
      "utf8": "And as always, thank you so much for watching me,"
    } ]
  }, {
    "tStartMs": 1825780,
    "dDurationMs": 1320,
    "segs": [ {
      "utf8": "and I'll see you in the next one!"
    } ]
  }, {
    "tStartMs": 1827100,
    "dDurationMs": 960,
    "segs": [ {
      "utf8": "Bye!"
    } ]
  }, {
    "tStartMs": 1828060,
    "dDurationMs": 1280,
    "segs": [ {
      "utf8": "(And stay healthy!)"
    } ]
  }, {
    "tStartMs": 1829340,
    "dDurationMs": 3640,
    "segs": [ {
      "utf8": "[Music: Thastor \u0026 Cryosleepkitten]"
    } ]
  }, {
    "tStartMs": 1832980,
    "dDurationMs": 7220,
    "segs": [ {
      "utf8": "[Subtitled by {your name} into {language}]"
    } ]
  } ]
}
