{
  "results": [
    {
      "video_title": "",
      "evidences": [
        {
          "claim": "The great majority of people who get COVID-19 will recover",
          "evidences": []
        },
        {
          "claim": "Many of the viruses that infect humans are of animal origin source",
          "evidences": []
        },
        {
          "claim": "Officials announced that the novel coronavirus can be transmitted between humans",
          "evidences": []
        },
        {
          "claim": "The symptoms of Covid are just like influenza",
          "evidences": []
        },
        {
          "claim": "In fact, people age of 1 or under seem to be practically immune from this thing, or it creates a very very light disease",
          "evidences": []
        },
        {
          "claim": "They're looking at statistics here and they're saying that the coronavirus is 20 times more lethal than the flu",
          "evidences": []
        },
        {
          "claim": "It is highly contagious up to two week incubation in patients with no symptoms",
          "evidences": []
        },
        {
          "claim": "The flu vaccine protects against influenza",
          "evidences": []
        },
        {
          "claim": "Then SARS-CoV-2 goes into the lower respiratory tract and it can cause fluid to accumulate and people to get really quite ill",
          "evidences": []
        },
        {
          "claim": "It's a virus that causes you to cough and of course, it attacks your lungs",
          "evidences": []
        },
        {
          "claim": "Yes, it comes out to 24 days, but that's not the incubation period of this infection to this symptom",
          "evidences": []
        },
        {
          "claim": "So how is coronavirus spread? Well, we don't know exactly how it spread from person to person, but similar viruses spread through cough droplets through close contact",
          "evidences": []
        },
        {
          "claim": "So although it can be killed with alcohol wipes and hand washing, it is highly contagious and human immune systems don't have antibodies to this particular virus just yet",
          "evidences": []
        },
        {
          "claim": "The Who also mentioned though, that just the flu is more contagious than this new coronavirus",
          "evidences": []
        },
        {
          "claim": "So what are the symptoms of coronavirus? Well, it can include any of the following a fever and runny nose, a dry cough, a sore throat, and it can lead on to shortness of breath",
          "evidences": []
        },
        {
          "claim": "OK, so as the five G causes caused these flu like symptoms in Wuhan, China",
          "evidences": []
        },
        {
          "claim": "The professor said that the viruses normally,only have small mutations in the form of singular changes in natural conditions",
          "evidences": []
        },
        {
          "claim": "So now you got a souped up juiced up version of this coronavirus with elements of tuberculosis",
          "evidences": []
        },
        {
          "claim": "In the past it was impossible for bats to transmit coronavirus",
          "evidences": []
        },
        {
          "claim": "I'm sure all fruits and vegetables will help boost your immune system",
          "evidences": [
            {
              "title": "Characteristics that modify the effect of small-quantity lipid-based nutrient supplementation on child growth: an individual participant data meta-analysis of randomized controlled trials",
              "abstract": [
                "Abstract Background: Meta-analyses have demonstrated that small-quantity lipid-based nutrient supplements (SQ-LNS) reduce stunting and wasting prevalence among infants and young children.",
                "Identification of subgroups who benefit most from SQ-LNS may facilitate program design.",
                "Objective: Our objective was to identify study-level and individual-level modifiers of the effect of SQ-LNS on child growth outcomes.",
                "Methods: We conducted a two-stage meta-analysis of individual participant data from 14 randomized controlled trials of SQ-LNS provided to children 6 to 24 months of age in low- and middle-income countries (n=37,066).",
                "We generated study-specific and subgroup estimates of SQ-LNS vs. control and pooled the estimates using fixed-effects models, with random-effects models as sensitivity analyses.",
                "We used random effects meta-regression to examine study-level effect modifiers.",
                "Heterogeneity was assessed using I 2  and Tau 2  statistics.",
                "Sensitivity analyses were conducted to examine whether results differed depending on inclusion criteria for arms within trials and types of comparisons.   ",
                "Results: SQ-LNS provision decreased stunting (length-for-age z-score < \u22122) by 12% (relative reduction), wasting (weight-for-length (WLZ) z-score < \u22122) by 14%, low mid-upper arm circumference (MUAC < 125 mm or MUACZ < \u22122) by 18%, acute malnutrition (WLZ < \u22122 or MUAC < 125 mm) by 14%, underweight (weight-for-age z-score < \u22122) by 13%, and small head size (head-circumference z-score < \u22122) by 9%.",
                "Effects of SQ-LNS on growth outcomes generally did not differ by study-level characteristics including region, stunting burden, malaria prevalence, sanitation, water quality, duration of supplementation, frequency of contact or average reported compliance with SQ-LNS.",
                "Effects of SQ-LNS on stunting, wasting, low MUAC and small head size were greater among girls than among boys; effects on stunting, underweight and low MUAC were greater among later-born (vs. first-born) children; and effects on wasting and acute malnutrition were greater among children in households with improved (vs. unimproved) sanitation.",
                "Results were similar across sensitivity analyses.",
                "Conclusions:  The positive impact of SQ-LNS on growth is apparent across a wide variety of study-level contexts.",
                "Policy-makers and program planners should consider including SQ-LNS in the mix of interventions to prevent both stunting and wasting.",
                "This study was registered at www.crd.york.ac.uk/PROSPERO as CRD42019146592.  ",
                "Keywords: Stunting, wasting, child undernutrition, complementary feeding, nutrient supplements, home fortification"
              ],
              "url": "https://www.medrxiv.org/content/10.1101/2021.02.05.21251105v1",
              "doi": "10.1101/21251105",
              "evidence": [
                8
              ],
              "evidence_confidence": [
                0.8808596730232239
              ],
              "label": "NOT_ENOUGH_INFO",
              "label_confidence": [
                0.011555900797247887,
                0.9839203953742981,
                0.004523666575551033
              ]
            },
            {
              "title": "Independent associations of sleep timing, duration and quality with adiposity and weight status in a national sample of adolescents: the UK Millennium Cohort Study",
              "abstract": [
                "Abstract Background  There is evidence that short sleep elevates obesity risk in youth, but sleep is a multidimensional construct and few studies have investigated parameters beyond duration.",
                "Objectives  To investigate if sleep onset time, duration, latency, and night waking frequency are independently associated with adiposity and weight status in adolescents.",
                "Methods  This was a cross-sectional observational study of 10,619 13-15y olds who provided self-reported sleep characteristics and underwent an anthropometric assessment to determine adiposity (body mass index (BMI) z-score and percent body fat (%BF)) and weight status.",
                "Adjusted linear and logistic regressions were used to investigate associations.",
                "Results  Compared to a sleep onset time before 10pm, later sleep was associated with higher adiposity and higher likelihood of overweight and obesity in boys (after midnight, odds ratio (95% CI): 1.76 (1.19 to 2.60),  p =0.004) and girls (between 11-11:59pm: 1.36 (1.17 to 1.65),  p =0.002).",
                "Compared to sleeping for >9-10 hours, sleeping for \u22648 hours was associated with higher likelihood of overweight and obesity (boys: 1.80 (1.38 to 2.35),  p <0.001); girls: 1.38 (1.06 to 1.79),  p =0.016); there was evidence of a U-shaped association in girls for whom >10 hours of sleep was also associated with higher likelihood of overweight and obesity (1.31 (1.06 to 1.62);  p =0.014).",
                "In girls, relative to a sleep latency of 16-30 minutes, sleep latencies \u226546 minutes were associated with higher adiposity (46-60 minutes, %BF: 1.47 (0.57 to 2.36),  p =0.001) and higher likelihood of overweight and obesity (46-60 minutes: 1.39 (1.05 to 1.83);  p =0.020).",
                "Often as opposed to never waking in the night was also associated with higher adiposity in girls (BMI z-score: 0.24 (0.08 to 0.41),  p =0.004; %BF: 1.44 (0.44 to 2.44),  p =0.005).",
                "Conclusions  Sleep duration and timing, and sleep quality in girls, are independently associated with adiposity and weight status in adolescence and may be important targets for obesity prevention."
              ],
              "url": "https://www.medrxiv.org/content/10.1101/2021.02.04.21249454v1",
              "doi": "10.1101/21249454",
              "evidence": [
                4,
                6
              ],
              "evidence_confidence": [
                0.9468182325363159,
                0.6003215909004211
              ],
              "label": "NOT_ENOUGH_INFO",
              "label_confidence": [
                0.030751030892133713,
                0.9559550881385803,
                0.013293921947479248
              ]
            }
          ]
        },
        {
          "claim": "It says the median incubation period was three days range of zero to 24",
          "evidences": []
        },
        {
          "claim": "SARS was a coronavirus",
          "evidences": []
        },
        {
          "claim": "Now SARS pretty much only transmitted once somebody was symptomatic",
          "evidences": []
        },
        {
          "claim": "Well, the people more people have died from the flu than the coronavirus, and it hasn't really killed",
          "evidences": []
        },
        {
          "claim": "Coronavirus incubation could be as long as 27 days",
          "evidences": []
        },
        {
          "claim": "Quite a lot of people being infected may just have quite mild respiratory disease",
          "evidences": []
        },
        {
          "claim": "SARS-CoV-2 virus is a virus that attacks your upper respiratory system",
          "evidences": []
        },
        {
          "claim": "Coronavirus is a zoo nautic",
          "evidences": []
        }
      ]
    }
  ]
}