name,frequency
Noah,837
Alexander,747
William,687
Michael,680
Liam,670
Jacob,654
Benjamin,649
Mason,604
Daniel,593
Logan,593
Ethan,579
Anthony,564
Aiden,535
Jayden,530
Joseph,498
James,486
Lucas,481
Henry,477
Jackson,469
David,467
Nathan,446
Elijah,445
Matthew,436
Andrew,433
John,432
Isaac,419
Dylan,417
Jack,411
Joshua,411
Owen,411
Julian,407
Gabriel,399
Ryan,399
Oliver,396
Carter,393
Sebastian,380
Charles,377
Luke,371
Jonathan,364
Samuel,353
Christopher,340
Evan,326
Connor,314
Caleb,313
Christian,308
Thomas,306
Nicholas,300
Wyatt,300
Hunter,298
Adrian,288
Angel,285
Cameron,278
Aaron,274
Landon,266
Nolan,266
Jordan,263
Kevin,261
Gavin,258
Adam,249
Brandon,247
Eli,237
Parker,235
Isaiah,234
Jaxon,232
Levi,232
Tyler,227
Dominic,224
Josiah,224
Jeremiah,222
Austin,220
Robert,210
Cooper,204
Leonardo,203
Ian,202
Blake,200
Brayden,200
Camden,200
Zachary,198
Damian,197
Jace,196
Vincent,196
Ayden,192
Leo,191
Chase,189
Colton,188
Grayson,186
Lincoln,186
Mateo,185
Jose,182
Maxwell,181
Giovanni,178
Jason,177
Kayden,175
Nathaniel,175
Miles,174
Patrick,173
Max,170
Brody,168
Jaxson,168
George,166
Theodore,166
