2019-11-06 20:34:27.85 Server      Microsoft SQL Server 2017 (RTM-CU11) (KB4462262) - 14.0.3038.14 (X64) 
	Sep 14 2018 13:53:44 
	Copyright (C) 2017 Microsoft Corporation
	Developer Edition (64-bit) on Linux (Ubuntu 16.04.5 LTS)
2019-11-06 20:34:27.85 Server      UTC adjustment: 0:00
2019-11-06 20:34:27.86 Server      (c) Microsoft Corporation.
2019-11-06 20:34:27.86 Server      All rights reserved.
2019-11-06 20:34:27.86 Server      Server process ID is 4120.
2019-11-06 20:34:27.87 Server      Logging SQL Server messages in file '/var/opt/mssql/log/errorlog'.
2019-11-06 20:34:27.87 Server      Registry startup parameters: 
	 -d /var/opt/mssql/data/master.mdf
	 -l /var/opt/mssql/data/mastlog.ldf
	 -e /var/opt/mssql/log/errorlog
2019-11-06 20:34:27.95 Server      SQL Server detected 1 sockets with 1 cores per socket and 2 logical processors per socket, 2 total logical processors; using 2 logical processors based on SQL Server licensing. This is an informational message; no user action is required.
2019-11-06 20:34:27.97 Server      SQL Server is starting at normal priority base (=7). This is an informational message only. No user action is required.
2019-11-06 20:34:27.97 Server      Detected 1600 MB of RAM. This is an informational message; no user action is required.
2019-11-06 20:34:27.98 Server      Using conventional memory in the memory manager.
2019-11-06 20:34:36.48 Server      Buffer pool extension is already disabled. No action is necessary. 
2019-11-06 20:34:40.06 Server      InitializeExternalUserGroupSid failed. Implied authentication will be disabled.
2019-11-06 20:34:40.06 Server      Implied authentication manager initialization failed. Implied authentication will be disabled.
2019-11-06 20:34:40.07 Server      Successfully initialized the TLS configuration. Allowed TLS protocol versions are ['1.0 1.1 1.2']. Allowed TLS ciphers are ['ECDHE-ECDSA-AES128-GCM-SHA256:ECDHE-ECDSA-AES256-GCM-SHA384:ECDHE-RSA-AES128-GCM-SHA256:ECDHE-RSA-AES256-GCM-SHA384:ECDHE-ECDSA-AES128-SHA256:ECDHE-ECDSA-AES256-SHA384:ECDHE-ECDSA-AES256-SHA:ECDHE-ECDSA-AES128-SHA:AES256-GCM-SHA384:AES128-GCM-SHA256:AES256-SHA256:AES128-SHA256:AES256-SHA:AES128-SHA:!DHE-RSA-AES256-GCM-SHA384:!DHE-RSA-AES128-GCM-SHA256:!DHE-RSA-AES256-SHA:!DHE-RSA-AES128-SHA'].
2019-11-06 20:34:40.47 Server      Node configuration: node 0: CPU mask: 0x0000000000000003:0 Active CPU mask: 0x0000000000000003:0. This message provides a description of the NUMA configuration for this computer. This is an informational message only. No user action is required.
2019-11-06 20:34:40.47 Server      The maximum number of dedicated administrator connections for this instance is '1'
2019-11-06 20:34:40.48 Server      Using dynamic lock allocation.  Initial allocation of 2500 Lock blocks and 5000 Lock Owner blocks per node.  This is an informational message only.  No user action is required.
2019-11-06 20:34:40.49 Server      In-Memory OLTP initialized on lowend machine.
2019-11-06 20:34:41.53 Server      Database Instant File Initialization: enabled. For security and performance considerations see the topic 'Database Instant File Initialization' in SQL Server Books Online. This is an informational message only. No user action is required.
2019-11-06 20:34:41.55 Server      Query Store settings initialized with enabled = 1, 
2019-11-06 20:34:41.57 spid6s      Error: 904, Severity: 16, State: 2.
2019-11-06 20:34:41.57 spid6s      Database 1 cannot be autostarted during server shutdown or startup.
2019-11-06 20:34:41.58 spid6s      Error: 904, Severity: 16, State: 2.
2019-11-06 20:34:41.58 spid6s      Database 1 cannot be autostarted during server shutdown or startup.
