2019-11-06 20:30:44.88 Server      Microsoft SQL Server 2017 (RTM-CU11) (KB4462262) - 14.0.3038.14 (X64) 
	Sep 14 2018 13:53:44 
	Copyright (C) 2017 Microsoft Corporation
	Developer Edition (64-bit) on Linux (Ubuntu 16.04.5 LTS)
2019-11-06 20:30:44.90 Server      UTC adjustment: 0:00
2019-11-06 20:30:44.90 Server      (c) Microsoft Corporation.
2019-11-06 20:30:44.90 Server      All rights reserved.
2019-11-06 20:30:44.90 Server      Server process ID is 4120.
2019-11-06 20:30:44.90 Server      Logging SQL Server messages in file '/var/opt/mssql/log/errorlog'.
2019-11-06 20:30:44.91 Server      Registry startup parameters: 
	 -d /var/opt/mssql/data/master.mdf
	 -l /var/opt/mssql/data/mastlog.ldf
	 -e /var/opt/mssql/log/errorlog
2019-11-06 20:30:44.99 Server      SQL Server detected 1 sockets with 1 cores per socket and 2 logical processors per socket, 2 total logical processors; using 2 logical processors based on SQL Server licensing. This is an informational message; no user action is required.
2019-11-06 20:30:45.01 Server      SQL Server is starting at normal priority base (=7). This is an informational message only. No user action is required.
2019-11-06 20:30:45.02 Server      Detected 1600 MB of RAM. This is an informational message; no user action is required.
2019-11-06 20:30:45.02 Server      Using conventional memory in the memory manager.
2019-11-06 20:30:53.68 Server      Buffer pool extension is already disabled. No action is necessary. 
2019-11-06 20:30:58.98 Server      InitializeExternalUserGroupSid failed. Implied authentication will be disabled.
2019-11-06 20:30:58.99 Server      Implied authentication manager initialization failed. Implied authentication will be disabled.
2019-11-06 20:30:59.00 Server      Successfully initialized the TLS configuration. Allowed TLS protocol versions are ['1.0 1.1 1.2']. Allowed TLS ciphers are ['ECDHE-ECDSA-AES128-GCM-SHA256:ECDHE-ECDSA-AES256-GCM-SHA384:ECDHE-RSA-AES128-GCM-SHA256:ECDHE-RSA-AES256-GCM-SHA384:ECDHE-ECDSA-AES128-SHA256:ECDHE-ECDSA-AES256-SHA384:ECDHE-ECDSA-AES256-SHA:ECDHE-ECDSA-AES128-SHA:AES256-GCM-SHA384:AES128-GCM-SHA256:AES256-SHA256:AES128-SHA256:AES256-SHA:AES128-SHA:!DHE-RSA-AES256-GCM-SHA384:!DHE-RSA-AES128-GCM-SHA256:!DHE-RSA-AES256-SHA:!DHE-RSA-AES128-SHA'].
2019-11-06 20:30:59.51 Server      Node configuration: node 0: CPU mask: 0x0000000000000003:0 Active CPU mask: 0x0000000000000003:0. This message provides a description of the NUMA configuration for this computer. This is an informational message only. No user action is required.
2019-11-06 20:30:59.51 Server      The maximum number of dedicated administrator connections for this instance is '1'
2019-11-06 20:30:59.52 Server      Using dynamic lock allocation.  Initial allocation of 2500 Lock blocks and 5000 Lock Owner blocks per node.  This is an informational message only.  No user action is required.
2019-11-06 20:30:59.54 Server      In-Memory OLTP initialized on lowend machine.
2019-11-06 20:31:00.47 Server      Database Instant File Initialization: enabled. For security and performance considerations see the topic 'Database Instant File Initialization' in SQL Server Books Online. This is an informational message only. No user action is required.
2019-11-06 20:31:00.49 Server      Query Store settings initialized with enabled = 1, 
2019-11-06 20:31:00.50 spid6s      Starting up database 'master'.
2019-11-06 20:31:00.57 Server      Software Usage Metrics is disabled.
2019-11-06 20:31:09.48 spid6s      Resource governor reconfiguration succeeded.
2019-11-06 20:31:09.49 spid6s      SQL Server Audit is starting the audits. This is an informational message. No user action is required.
2019-11-06 20:31:09.51 spid6s      SQL Server Audit has started the audits. This is an informational message. No user action is required.
2019-11-06 20:31:11.58 spid6s      SQL Trace ID 1 was started by login "sa".
2019-11-06 20:31:11.64 spid6s      Server name is 'a6a8c19c79d0'. This is an informational message only. No user action is required.
2019-11-06 20:31:11.67 spid22s     Always On: The availability replica manager is starting. This is an informational message only. No user action is required.
2019-11-06 20:31:11.70 spid9s      Starting up database 'mssqlsystemresource'.
2019-11-06 20:31:11.70 spid23s     Starting up database 'msdb'.
2019-11-06 20:31:11.72 spid22s     Always On: The availability replica manager is waiting for the instance of SQL Server to allow client connections. This is an informational message only. No user action is required.
2019-11-06 20:31:11.73 spid24s     Starting up database 'my_database'.
2019-11-06 20:31:11.75 spid9s      The resource database build version is 14.00.3038. This is an informational message only. No user action is required.
2019-11-06 20:31:11.82 spid9s      Starting up database 'model'.
2019-11-06 20:31:19.10 spid24s     Parallel redo is started for database 'my_database' with worker pool size [1].
2019-11-06 20:31:19.32 spid6s      Parallel redo is shutdown for database 'my_database' with worker pool size [1].
2019-11-06 20:31:19.38 spid9s      Polybase feature disabled.
2019-11-06 20:31:19.39 spid9s      Clearing tempdb database.
2019-11-06 20:31:23.09 spid18s     A self-generated certificate was successfully loaded for encryption.
2019-11-06 20:31:23.17 spid18s     Server is listening on [ 'any' <ipv4> 1433].
2019-11-06 20:31:23.18 Server      Server is listening on [ 127.0.0.1 <ipv4> 1434].
2019-11-06 20:31:23.19 Server      Dedicated admin connection support was established for listening locally on port 1434.
2019-11-06 20:31:23.21 spid18s     SQL Server is now ready for client connections. This is an informational message; no user action is required.
2019-11-06 20:31:29.94 spid9s      Starting up database 'tempdb'.
2019-11-06 20:31:34.59 spid9s      The tempdb database has 1 data file(s).
2019-11-06 20:31:34.62 spid22s     The Service Broker endpoint is in disabled or stopped state.
2019-11-06 20:31:34.63 spid22s     The Database Mirroring endpoint is in disabled or stopped state.
2019-11-06 20:31:34.70 spid22s     Service Broker manager has started.
2019-11-06 20:31:35.02 spid6s      Recovery is complete. This is an informational message only. No user action is required.
2019-11-06 20:33:45.15 spid6s      Always On: The availability replica manager is going offline because SQL Server is shutting down. This is an informational message only. No user action is required.
2019-11-06 20:33:45.15 spid6s      SQL Server is terminating in response to a 'stop' request from Service Control Manager. This is an informational message only. No user action is required.
2019-11-06 20:33:45.28 spid22s     Service Broker manager has shut down.
2019-11-06 20:33:45.57 spid6s      SQL Trace was stopped due to server shutdown. Trace ID = '1'. This is an informational message only; no user action is required.
