2019-11-06 21:39:54.06 Server      Microsoft SQL Server 2017 (RTM-CU11) (KB4462262) - 14.0.3038.14 (X64) 
	Sep 14 2018 13:53:44 
	Copyright (C) 2017 Microsoft Corporation
	Developer Edition (64-bit) on Linux (Ubuntu 16.04.5 LTS)
2019-11-06 21:39:54.07 Server      UTC adjustment: 0:00
2019-11-06 21:39:54.07 Server      (c) Microsoft Corporation.
2019-11-06 21:39:54.08 Server      All rights reserved.
2019-11-06 21:39:54.08 Server      Server process ID is 4120.
2019-11-06 21:39:54.08 Server      Logging SQL Server messages in file '/var/opt/mssql/log/errorlog'.
2019-11-06 21:39:54.08 Server      Registry startup parameters: 
	 -d /var/opt/mssql/data/master.mdf
	 -l /var/opt/mssql/data/mastlog.ldf
	 -e /var/opt/mssql/log/errorlog
2019-11-06 21:39:54.14 Server      SQL Server detected 1 sockets with 1 cores per socket and 2 logical processors per socket, 2 total logical processors; using 2 logical processors based on SQL Server licensing. This is an informational message; no user action is required.
2019-11-06 21:39:54.14 Server      SQL Server is starting at normal priority base (=7). This is an informational message only. No user action is required.
2019-11-06 21:39:54.15 Server      Detected 1600 MB of RAM. This is an informational message; no user action is required.
2019-11-06 21:39:54.15 Server      Using conventional memory in the memory manager.
2019-11-06 21:40:02.33 Server      Buffer pool extension is already disabled. No action is necessary. 
2019-11-06 21:40:05.59 Server      InitializeExternalUserGroupSid failed. Implied authentication will be disabled.
2019-11-06 21:40:05.59 Server      Implied authentication manager initialization failed. Implied authentication will be disabled.
2019-11-06 21:40:05.60 Server      Successfully initialized the TLS configuration. Allowed TLS protocol versions are ['1.0 1.1 1.2']. Allowed TLS ciphers are ['ECDHE-ECDSA-AES128-GCM-SHA256:ECDHE-ECDSA-AES256-GCM-SHA384:ECDHE-RSA-AES128-GCM-SHA256:ECDHE-RSA-AES256-GCM-SHA384:ECDHE-ECDSA-AES128-SHA256:ECDHE-ECDSA-AES256-SHA384:ECDHE-ECDSA-AES256-SHA:ECDHE-ECDSA-AES128-SHA:AES256-GCM-SHA384:AES128-GCM-SHA256:AES256-SHA256:AES128-SHA256:AES256-SHA:AES128-SHA:!DHE-RSA-AES256-GCM-SHA384:!DHE-RSA-AES128-GCM-SHA256:!DHE-RSA-AES256-SHA:!DHE-RSA-AES128-SHA'].
2019-11-06 21:40:06.05 Server      The maximum number of dedicated administrator connections for this instance is '1'
2019-11-06 21:40:06.05 Server      Node configuration: node 0: CPU mask: 0x0000000000000003:0 Active CPU mask: 0x0000000000000003:0. This message provides a description of the NUMA configuration for this computer. This is an informational message only. No user action is required.
2019-11-06 21:40:06.06 Server      Using dynamic lock allocation.  Initial allocation of 2500 Lock blocks and 5000 Lock Owner blocks per node.  This is an informational message only.  No user action is required.
2019-11-06 21:40:06.07 Server      In-Memory OLTP initialized on lowend machine.
2019-11-06 21:40:07.36 Server      Database Instant File Initialization: enabled. For security and performance considerations see the topic 'Database Instant File Initialization' in SQL Server Books Online. This is an informational message only. No user action is required.
2019-11-06 21:40:07.37 Server      Query Store settings initialized with enabled = 1, 
2019-11-06 21:40:07.39 spid6s      Starting up database 'master'.
2019-11-06 21:40:07.52 Server      Software Usage Metrics is disabled.
2019-11-06 21:40:16.75 spid6s      Resource governor reconfiguration succeeded.
2019-11-06 21:40:16.77 spid6s      SQL Server Audit is starting the audits. This is an informational message. No user action is required.
2019-11-06 21:40:16.80 spid6s      SQL Server Audit has started the audits. This is an informational message. No user action is required.
2019-11-06 21:40:18.59 spid6s      SQL Trace ID 1 was started by login "sa".
2019-11-06 21:40:18.63 spid6s      Server name is 'a6a8c19c79d0'. This is an informational message only. No user action is required.
2019-11-06 21:40:18.68 spid22s     Starting up database 'msdb'.
2019-11-06 21:40:18.71 spid23s     Always On: The availability replica manager is starting. This is an informational message only. No user action is required.
2019-11-06 21:40:18.73 spid23s     Always On: The availability replica manager is waiting for the instance of SQL Server to allow client connections. This is an informational message only. No user action is required.
2019-11-06 21:40:18.74 spid24s     Starting up database 'my_database'.
2019-11-06 21:40:18.75 spid9s      Starting up database 'mssqlsystemresource'.
2019-11-06 21:40:18.79 spid9s      The resource database build version is 14.00.3038. This is an informational message only. No user action is required.
2019-11-06 21:40:18.90 spid9s      Starting up database 'model'.
2019-11-06 21:40:29.42 spid24s     Parallel redo is started for database 'my_database' with worker pool size [1].
2019-11-06 21:40:29.59 spid6s      Parallel redo is shutdown for database 'my_database' with worker pool size [1].
2019-11-06 21:40:29.68 spid9s      Polybase feature disabled.
2019-11-06 21:40:29.69 spid9s      Clearing tempdb database.
