2019-11-06 21:18:01.52 Server      Microsoft SQL Server 2017 (RTM-CU11) (KB4462262) - 14.0.3038.14 (X64) 
	Sep 14 2018 13:53:44 
	Copyright (C) 2017 Microsoft Corporation
	Developer Edition (64-bit) on Linux (Ubuntu 16.04.5 LTS)
2019-11-06 21:18:01.53 Server      UTC adjustment: 0:00
2019-11-06 21:18:01.53 Server      (c) Microsoft Corporation.
2019-11-06 21:18:01.54 Server      All rights reserved.
2019-11-06 21:18:01.54 Server      Server process ID is 4120.
2019-11-06 21:18:01.54 Server      Logging SQL Server messages in file '/var/opt/mssql/log/errorlog'.
2019-11-06 21:18:01.54 Server      Registry startup parameters: 
	 -d /var/opt/mssql/data/master.mdf
	 -l /var/opt/mssql/data/mastlog.ldf
	 -e /var/opt/mssql/log/errorlog
2019-11-06 21:18:01.60 Server      SQL Server detected 1 sockets with 1 cores per socket and 2 logical processors per socket, 2 total logical processors; using 2 logical processors based on SQL Server licensing. This is an informational message; no user action is required.
2019-11-06 21:18:01.60 Server      SQL Server is starting at normal priority base (=7). This is an informational message only. No user action is required.
2019-11-06 21:18:01.61 Server      Detected 1600 MB of RAM. This is an informational message; no user action is required.
2019-11-06 21:18:01.61 Server      Using conventional memory in the memory manager.
2019-11-06 21:18:09.98 Server      Buffer pool extension is already disabled. No action is necessary. 
2019-11-06 21:18:13.49 Server      InitializeExternalUserGroupSid failed. Implied authentication will be disabled.
2019-11-06 21:18:13.49 Server      Implied authentication manager initialization failed. Implied authentication will be disabled.
2019-11-06 21:18:13.49 Server      Successfully initialized the TLS configuration. Allowed TLS protocol versions are ['1.0 1.1 1.2']. Allowed TLS ciphers are ['ECDHE-ECDSA-AES128-GCM-SHA256:ECDHE-ECDSA-AES256-GCM-SHA384:ECDHE-RSA-AES128-GCM-SHA256:ECDHE-RSA-AES256-GCM-SHA384:ECDHE-ECDSA-AES128-SHA256:ECDHE-ECDSA-AES256-SHA384:ECDHE-ECDSA-AES256-SHA:ECDHE-ECDSA-AES128-SHA:AES256-GCM-SHA384:AES128-GCM-SHA256:AES256-SHA256:AES128-SHA256:AES256-SHA:AES128-SHA:!DHE-RSA-AES256-GCM-SHA384:!DHE-RSA-AES128-GCM-SHA256:!DHE-RSA-AES256-SHA:!DHE-RSA-AES128-SHA'].
2019-11-06 21:18:13.94 Server      The maximum number of dedicated administrator connections for this instance is '1'
2019-11-06 21:18:13.95 Server      Node configuration: node 0: CPU mask: 0x0000000000000003:0 Active CPU mask: 0x0000000000000003:0. This message provides a description of the NUMA configuration for this computer. This is an informational message only. No user action is required.
2019-11-06 21:18:13.96 Server      Using dynamic lock allocation.  Initial allocation of 2500 Lock blocks and 5000 Lock Owner blocks per node.  This is an informational message only.  No user action is required.
2019-11-06 21:18:13.97 Server      In-Memory OLTP initialized on lowend machine.
2019-11-06 21:18:15.37 Server      Database Instant File Initialization: enabled. For security and performance considerations see the topic 'Database Instant File Initialization' in SQL Server Books Online. This is an informational message only. No user action is required.
2019-11-06 21:18:15.40 Server      Query Store settings initialized with enabled = 1, 
2019-11-06 21:18:15.43 spid5s      Starting up database 'master'.
2019-11-06 21:18:15.64 Server      Software Usage Metrics is disabled.
2019-11-06 21:18:23.43 spid5s      Resource governor reconfiguration succeeded.
2019-11-06 21:18:23.45 spid5s      SQL Server Audit is starting the audits. This is an informational message. No user action is required.
2019-11-06 21:18:23.45 spid5s      SQL Server Audit has started the audits. This is an informational message. No user action is required.
2019-11-06 21:18:25.17 spid5s      SQL Trace ID 1 was started by login "sa".
2019-11-06 21:18:25.21 spid5s      Server name is 'a6a8c19c79d0'. This is an informational message only. No user action is required.
2019-11-06 21:18:25.26 spid20s     Always On: The availability replica manager is starting. This is an informational message only. No user action is required.
2019-11-06 21:18:25.27 spid20s     Always On: The availability replica manager is waiting for the instance of SQL Server to allow client connections. This is an informational message only. No user action is required.
2019-11-06 21:18:25.28 spid9s      Starting up database 'mssqlsystemresource'.
2019-11-06 21:18:25.29 spid24s     Starting up database 'my_database'.
2019-11-06 21:18:25.29 spid22s     Starting up database 'msdb'.
2019-11-06 21:18:25.34 spid9s      The resource database build version is 14.00.3038. This is an informational message only. No user action is required.
2019-11-06 21:18:25.52 spid9s      Starting up database 'model'.
2019-11-06 21:18:32.12 spid24s     Parallel redo is started for database 'my_database' with worker pool size [1].
2019-11-06 21:18:32.39 spid5s      Parallel redo is shutdown for database 'my_database' with worker pool size [1].
2019-11-06 21:18:32.48 spid9s      Polybase feature disabled.
2019-11-06 21:18:32.49 spid9s      Clearing tempdb database.
2019-11-06 21:18:36.24 spid18s     A self-generated certificate was successfully loaded for encryption.
2019-11-06 21:18:36.41 spid18s     Server is listening on [ 'any' <ipv4> 1433].
2019-11-06 21:18:36.42 Server      Server is listening on [ 127.0.0.1 <ipv4> 1434].
2019-11-06 21:18:36.44 Server      Dedicated admin connection support was established for listening locally on port 1434.
2019-11-06 21:18:36.48 spid18s     SQL Server is now ready for client connections. This is an informational message; no user action is required.
2019-11-06 21:18:43.14 spid9s      Starting up database 'tempdb'.
2019-11-06 21:18:47.48 spid9s      The tempdb database has 1 data file(s).
2019-11-06 21:18:47.52 spid20s     The Service Broker endpoint is in disabled or stopped state.
2019-11-06 21:18:47.52 spid20s     The Database Mirroring endpoint is in disabled or stopped state.
2019-11-06 21:18:47.65 spid20s     Service Broker manager has started.
2019-11-06 21:18:47.77 spid5s      Recovery is complete. This is an informational message only. No user action is required.
2019-11-06 21:18:54.25 spid5s      Always On: The availability replica manager is going offline because SQL Server is shutting down. This is an informational message only. No user action is required.
2019-11-06 21:18:54.26 spid5s      SQL Server is terminating in response to a 'stop' request from Service Control Manager. This is an informational message only. No user action is required.
2019-11-06 21:18:54.72 spid20s     Service Broker manager has shut down.
2019-11-06 21:18:58.17 spid5s      SQL Trace was stopped due to server shutdown. Trace ID = '1'. This is an informational message only; no user action is required.
