<?xml version="1.0" encoding="UTF-8" standalone="no"?>
<svg
   xmlns:dc="http://purl.org/dc/elements/1.1/"
   xmlns:cc="http://creativecommons.org/ns#"
   xmlns:rdf="http://www.w3.org/1999/02/22-rdf-syntax-ns#"
   xmlns:svg="http://www.w3.org/2000/svg"
   xmlns="http://www.w3.org/2000/svg"
   id="svg8"
   version="1.1"
   viewBox="0 0 16 16"
   height="16"
   width="16">
  <defs
     id="defs2" />
  <metadata
     id="metadata5">
    <rdf:RDF>
      <cc:Work
         rdf:about="">
        <dc:format>image/svg+xml</dc:format>
        <dc:type
           rdf:resource="http://purl.org/dc/dcmitype/StillImage" />
        <dc:title></dc:title>
      </cc:Work>
    </rdf:RDF>
  </metadata>
  <g
     transform="translate(0,-292.76665)"
     id="layer1">
    <circle
       r="7"
       id="circle951"
       cy="300.76666"
       cx="8"
       style="fill:#fc5b6f;stroke-width:0.02874271" />
    <path
       id="path953"
       d="m 7.5329569,304.83875 c -0.065966,1.35927 -0.4468348,1.97802 -0.4468348,1.97802 H 7.999996 8.9138457 c 0,0 -0.3787416,-0.61587 -0.4462586,-1.9666 -0.00772,-0.15407 -0.133826,-0.27555 -0.2880893,-0.27555 H 7.8089481 c -0.1478248,0 -0.2688354,0.11654 -0.2759912,0.26413 z"
       style="fill:#ceccca;stroke-width:0.02874271" />
    <path
       id="path955"
       d="m 7.5329569,304.83875 c -0.065966,1.35927 -0.4468348,1.97802 -0.4468348,1.97802 H 7.999996 8.9138457 c 0,0 -0.3787416,-0.61587 -0.4462586,-1.9666 -0.00772,-0.15407 -0.133826,-0.27555 -0.2880893,-0.27555 H 7.8089481 c -0.1478248,0 -0.2688354,0.11654 -0.2759912,0.26413 z"
       style="fill:#dddddd;stroke-width:0.02874271" />
    <path
       id="path957"
       d="M 8.1794978,304.57462 H 7.8089481 c -0.1478002,0 -0.2688354,0.11654 -0.2759912,0.26413 -0.065966,1.35927 -0.4468348,1.97802 -0.4468348,1.97802 H 7.999996 8.02066 c 0,0 0.3796061,-0.61689 0.446461,-1.97165 -0.010177,-0.15162 -0.1350647,-0.2705 -0.2875989,-0.2705 z"
       style="fill:#ceccca;stroke-width:0.02874271" />
    <path
       id="path959"
       d="M 9.389022,306.7501 H 6.6109522 c -0.2526231,0 -0.4593376,0.20668 -0.4593376,0.45933 v 0.31009 c 0.5888777,0.16077 1.2085121,0.24712 1.8483814,0.24712 0.6398756,0 1.25948,-0.0864 1.848357,-0.24717 v -0.31006 c 0,-0.25263 -0.206684,-0.45931 -0.459331,-0.45931 z"
       style="fill:#fac149;stroke-width:0.02874271" />
    <path
       id="path961"
       d="m 7.7037208,307.20941 c 0,-0.25263 0.2066838,-0.45934 0.4593376,-0.45934 H 6.6109522 c -0.2526231,0 -0.4593376,0.20668 -0.4593376,0.45934 v 0.31006 c 0.4975081,0.13588 1.0170288,0.21834 1.5521062,0.24073 z"
       style="fill:#f8a748;stroke-width:0.02874271" />
    <path
       id="path963"
       d="m 7.999996,304.82928 c -0.1406629,0 -0.2546588,-0.114 -0.2546588,-0.25466 v -1.15798 c 0,-0.14062 0.1139962,-0.25463 0.2546588,-0.25463 0.1406692,0 0.2546651,0.11398 0.2546651,0.25463 v 1.15798 c 0,0.14063 -0.1139962,0.25466 -0.2546651,0.25466 z"
       style="fill:#ceccca;stroke-width:0.02874271" />
    <path
       id="path965"
       d="m 7.999996,303.41669 v 0 c -1.2283481,0 -2.2333345,-1.005 -2.2333345,-2.23335 v -3.41895 c 0,-1.22835 1.0049864,-2.23332 2.2333345,-2.23332 v 0 c 1.228324,0 2.233341,1.00497 2.233341,2.23332 v 3.41895 c 0,1.22833 -1.005017,2.23335 -2.233341,2.23335 z"
       style="fill:#fac149;stroke-width:0.02874271" />
    <path
       id="path967"
       d="m 6.707583,301.18334 v -3.41895 c 0,-1.067 0.758519,-1.96507 1.7628739,-2.18265 -0.1518475,-0.033 -0.3091521,-0.0506 -0.4704609,-0.0506 v 0 c -1.2283481,0 -2.2333345,1.00502 -2.2333345,2.23335 v 3.41894 c 0,1.22831 1.0050168,2.23333 2.2333345,2.23333 v 0 c 0.1613088,0 0.3186134,-0.0178 0.4704609,-0.0506 C 7.466102,303.14852 6.707583,302.25044 6.707583,301.18344 Z"
       style="fill:#f8a748;stroke-width:0.02874271" />
    <path
       id="path969"
       d="m 7.9999716,304.82928 c -1.8554576,0 -3.4095752,-1.38943 -3.615088,-3.23191 -0.039183,-0.35193 0.2391701,-0.66032 0.5941694,-0.66032 h 1.172531 c 0.1406691,0 0.2546588,0.11398 0.2546588,0.25466 0,0.14065 -0.1139892,0.25466 -0.2546588,0.25466 H 4.979053 c -0.050771,0 -0.09373,0.0433 -0.087978,0.0947 0.1766811,1.58426 1.5131881,2.77899 3.1088666,2.77899 1.5956784,0 2.9322464,-1.19473 3.1088974,-2.77902 0.0055,-0.0512 -0.0371,-0.0947 -0.08797,-0.0947 H 9.848337 c -0.140669,0 -0.254659,-0.11398 -0.254659,-0.25466 0,-0.14065 0.113989,-0.25466 0.254659,-0.25466 h 1.172531 c 0.355545,0 0.633314,0.30886 0.594169,0.66029 -0.205427,1.84253 -1.759575,3.23196 -3.6150567,3.23196 z"
       style="fill:#efefef;stroke-width:0.02874271" />
    <g
       id="g989"
       transform="matrix(0.02874271,0,0,0.02874271,0.641862,293.05038)">
      <path
         id="path971"
         d="m 214.779,172.868 h -36.105 c -4.894,0 -8.86,-3.967 -8.86,-8.86 0,-4.893 3.966,-8.86 8.86,-8.86 h 36.105 c 4.894,0 8.86,3.967 8.86,8.86 0,4.893 -3.966,8.86 -8.86,8.86 z"
         style="fill:#f38d1a" />
      <path
         id="path973"
         d="m 214.779,212.615 h -36.105 c -4.894,0 -8.86,-3.967 -8.86,-8.86 0,-4.893 3.966,-8.86 8.86,-8.86 h 36.105 c 4.894,0 8.86,3.967 8.86,8.86 0,4.893 -3.966,8.86 -8.86,8.86 z"
         style="fill:#f38d1a" />
      <path
         id="path975"
         d="m 214.779,252.363 h -36.105 c -4.894,0 -8.86,-3.967 -8.86,-8.86 0,-4.893 3.966,-8.86 8.86,-8.86 h 36.105 c 4.894,0 8.86,3.967 8.86,8.86 0,4.893 -3.966,8.86 -8.86,8.86 z"
         style="fill:#f38d1a" />
      <path
         id="path977"
         d="m 214.779,292.109 h -36.105 c -4.894,0 -8.86,-3.967 -8.86,-8.86 0,-4.893 3.966,-8.86 8.86,-8.86 h 36.105 c 4.894,0 8.86,3.967 8.86,8.86 0,4.894 -3.966,8.86 -8.86,8.86 z"
         style="fill:#f38d1a" />
      <path
         id="path979"
         d="m 333.701,172.868 h -36.105 c -4.894,0 -8.86,-3.967 -8.86,-8.86 0,-4.893 3.966,-8.86 8.86,-8.86 h 36.105 c 4.894,0 8.86,3.967 8.86,8.86 0,4.893 -3.966,8.86 -8.86,8.86 z"
         style="fill:#f38d1a" />
      <path
         id="path981"
         d="m 333.701,212.615 h -36.105 c -4.894,0 -8.86,-3.967 -8.86,-8.86 0,-4.893 3.966,-8.86 8.86,-8.86 h 36.105 c 4.894,0 8.86,3.967 8.86,8.86 0,4.893 -3.966,8.86 -8.86,8.86 z"
         style="fill:#f38d1a" />
      <path
         id="path983"
         d="m 333.701,252.363 h -36.105 c -4.894,0 -8.86,-3.967 -8.86,-8.86 0,-4.893 3.966,-8.86 8.86,-8.86 h 36.105 c 4.894,0 8.86,3.967 8.86,8.86 0,4.893 -3.966,8.86 -8.86,8.86 z"
         style="fill:#f38d1a" />
      <path
         id="path985"
         d="m 333.701,292.109 h -36.105 c -4.894,0 -8.86,-3.967 -8.86,-8.86 0,-4.893 3.966,-8.86 8.86,-8.86 h 36.105 c 4.894,0 8.86,3.967 8.86,8.86 0,4.894 -3.966,8.86 -8.86,8.86 z"
         style="fill:#f38d1a" />
      <path
         id="path987"
         d="m 256,232.339 c -4.835,0 -8.86,-3.909 -8.86,-8.86 0,-3.984 2.711,-7.762 7.123,-8.683 1.147,-0.224 2.328,-0.224 3.474,0 4.289,0.895 7.124,4.575 7.124,8.683 -10e-4,4.902 -3.981,8.86 -8.861,8.86 z"
         style="fill:#f38d1a" />
    </g>
    <g
       id="g1009"
       transform="matrix(0.02874271,0,0,0.02874271,0.641862,293.05038)">
      <path
         id="path991"
         d="m 135.114,170.722 h -32.116 c -4.894,0 -8.86,-3.967 -8.86,-8.86 0,-4.893 3.966,-8.86 8.86,-8.86 h 32.116 c 4.894,0 8.86,3.967 8.86,8.86 0,4.894 -3.966,8.86 -8.86,8.86 z"
         style="fill:#fac149" />
      <path
         id="path993"
         d="m 409.002,170.722 h -32.118 c -4.894,0 -8.86,-3.967 -8.86,-8.86 0,-4.893 3.966,-8.86 8.86,-8.86 h 32.118 c 4.894,0 8.86,3.967 8.86,8.86 0,4.894 -3.966,8.86 -8.86,8.86 z"
         style="fill:#fac149" />
      <path
         id="path995"
         d="m 115.823,242.794 c -2.447,-4.238 -0.995,-9.657 3.243,-12.103 l 27.815,-16.059 c 4.235,-2.447 9.656,-0.995 12.103,3.243 2.447,4.238 0.994,9.657 -3.243,12.103 l -27.815,16.059 c -4.201,2.427 -9.635,1.03 -12.103,-3.243 z"
         style="fill:#fac149" />
      <path
         id="path997"
         d="m 353.017,105.85 c -2.447,-4.237 -0.994,-9.657 3.243,-12.103 l 27.814,-16.058 c 4.236,-2.447 9.655,-0.996 12.103,3.243 2.447,4.237 0.995,9.657 -3.243,12.103 l -27.814,16.058 c -4.211,2.432 -9.641,1.021 -12.103,-3.243 z"
         style="fill:#fac149" />
      <path
         id="path999"
         d="m 312.012,64.845 c -4.237,-2.447 -5.69,-7.866 -3.243,-12.103 l 16.059,-27.814 c 2.444,-4.238 7.865,-5.691 12.103,-3.243 4.237,2.447 5.69,7.866 3.243,12.103 l -16.059,27.814 c -2.458,4.259 -7.886,5.679 -12.103,3.243 z"
         style="fill:#fac149" />
      <path
         id="path1001"
         d="m 256,49.837 c -4.894,0 -8.86,-3.967 -8.86,-8.86 V 8.86 C 247.14,3.967 251.106,0 256,0 c 4.894,0 8.86,3.967 8.86,8.86 v 32.117 c 0,4.894 -3.966,8.86 -8.86,8.86 z"
         style="fill:#fac149" />
      <path
         id="path1003"
         d="M 187.884,61.602 171.826,33.788 c -2.447,-4.238 -0.994,-9.657 3.243,-12.103 4.236,-2.448 9.657,-0.996 12.103,3.243 l 16.058,27.814 c 2.447,4.238 0.995,9.657 -3.243,12.103 -4.209,2.432 -9.642,1.023 -12.103,-3.243 z"
         style="fill:#fac149" />
      <path
         id="path1005"
         d="m 384.073,246.036 -27.814,-16.059 c -4.237,-2.447 -5.69,-7.866 -3.243,-12.103 2.444,-4.239 7.867,-5.692 12.103,-3.243 l 27.814,16.059 c 4.237,2.447 5.69,7.866 3.243,12.103 -2.458,4.259 -7.887,5.68 -12.103,3.243 z"
         style="fill:#fac149" />
      <path
         id="path1007"
         d="M 146.88,109.093 119.065,93.035 c -4.237,-2.446 -5.69,-7.865 -3.243,-12.103 2.446,-4.238 7.863,-5.692 12.103,-3.243 l 27.815,16.058 c 4.237,2.446 5.69,7.865 3.243,12.103 -2.445,4.235 -7.862,5.691 -12.103,3.243 z"
         style="fill:#fac149" />
    </g>
    <g
       id="g1011"
       transform="matrix(0.02874271,0,0,0.02874271,0.641862,293.05038)" />
    <g
       id="g1013"
       transform="matrix(0.02874271,0,0,0.02874271,0.641862,293.05038)" />
    <g
       id="g1015"
       transform="matrix(0.02874271,0,0,0.02874271,0.641862,293.05038)" />
    <g
       id="g1017"
       transform="matrix(0.02874271,0,0,0.02874271,0.641862,293.05038)" />
    <g
       id="g1019"
       transform="matrix(0.02874271,0,0,0.02874271,0.641862,293.05038)" />
    <g
       id="g1021"
       transform="matrix(0.02874271,0,0,0.02874271,0.641862,293.05038)" />
    <g
       id="g1023"
       transform="matrix(0.02874271,0,0,0.02874271,0.641862,293.05038)" />
    <g
       id="g1025"
       transform="matrix(0.02874271,0,0,0.02874271,0.641862,293.05038)" />
    <g
       id="g1027"
       transform="matrix(0.02874271,0,0,0.02874271,0.641862,293.05038)" />
    <g
       id="g1029"
       transform="matrix(0.02874271,0,0,0.02874271,0.641862,293.05038)" />
    <g
       id="g1031"
       transform="matrix(0.02874271,0,0,0.02874271,0.641862,293.05038)" />
    <g
       id="g1033"
       transform="matrix(0.02874271,0,0,0.02874271,0.641862,293.05038)" />
    <g
       id="g1035"
       transform="matrix(0.02874271,0,0,0.02874271,0.641862,293.05038)" />
    <g
       id="g1037"
       transform="matrix(0.02874271,0,0,0.02874271,0.641862,293.05038)" />
    <g
       id="g1039"
       transform="matrix(0.02874271,0,0,0.02874271,0.641862,293.05038)" />
  </g>
</svg>
