{
  "$schema": "https://json.schemastore.org/nest-cli",
  "collection": "@nestjs/schematics",
  "sourceRoot": "apps/rabbit-tester/src",
  "monorepo": true,
  "root": "apps/rabbit-tester",
  "compilerOptions": {
    "webpack": true,
    "tsConfigPath": "apps/rabbit-tester/tsconfig.app.json"
  },
  "projects": {
    "rabbit-tester": {
      "type": "application",
      "root": "apps/rabbit-tester",
      "entryFile": "main",
      "sourceRoot": "apps/rabbit-tester/src",
      "compilerOptions": {
        "tsConfigPath": "apps/rabbit-tester/tsconfig.app.json"
      }
    },
    "shared": {
      "type": "library",
      "root": "libs/shared",
      "entryFile": "index",
      "sourceRoot": "libs/shared/src",
      "compilerOptions": {
        "tsConfigPath": "libs/shared/tsconfig.lib.json"
      }
    }
  }
}