<svg width="50" height="50" viewBox="0 0 50 50" fill="none" xmlns="http://www.w3.org/2000/svg">
    <g clip-path="url(#a)" fill="#fff">
        <path d="M38.521 39.742a3.992 3.992 0 0 0-3.995-3.978H32.42a3.99 3.99 0 0 0-2.632.989 3.99 3.99 0 0 0-2.631-.99H25.05a3.964 3.964 0 0 0-2.106.61 3.964 3.964 0 0 0-2.105-.61h-2.105a3.91 3.91 0 0 0-1.83.453 3.936 3.936 0 0 0-1.58-.986l-2.197-.727a4.02 4.02 0 0 0-1.948-.153 3.801 3.801 0 0 0-.938-1.526L8.59 31.178a3.754 3.754 0 0 0-.814-.612c.144-.415.218-.852.217-1.292V27.18a3.908 3.908 0 0 0-.502-1.892 15.738 15.738 0 0 1 11.143-4.598h3.14v-1.675h-3.14a17.215 17.215 0 0 0-10.641 3.639V20.9c0-.44-.074-.877-.218-1.293.298-.165.571-.371.813-.612l1.655-1.645c.43-.428.751-.951.938-1.528.65.112 1.32.06 1.946-.15l2.197-.728a3.954 3.954 0 0 0 1.582-.987 3.909 3.909 0 0 0 1.83.452h2.105a3.964 3.964 0 0 0 2.105-.61c.63.398 1.36.61 2.106.61h2.106c.57.001 1.133-.12 1.652-.357l-.692-1.524c-.301.137-.629.207-.96.207H25.05a2.319 2.319 0 0 1-1.547-.604.837.837 0 0 0-1.118 0 2.32 2.32 0 0 1-1.546.603h-2.105a2.308 2.308 0 0 1-1.47-.541.837.837 0 0 0-1.237.19 2.339 2.339 0 0 1-1.232.97l-2.2.728a2.345 2.345 0 0 1-1.725-.09.837.837 0 0 0-1.179.727 2.136 2.136 0 0 1-.631 1.447L7.406 17.81c-.275.27-.617.462-.99.556a.837.837 0 0 0-.484 1.274c.25.373.384.813.385 1.262v2.094a2.279 2.279 0 0 1-.605 1.53.838.838 0 0 0 0 1.126c.385.417.6.963.605 1.53v2.094c-.001.45-.135.89-.385 1.263a.837.837 0 0 0 .483 1.273c.374.094.716.286.991.556l1.656 1.647c.387.384.612.9.63 1.446a.838.838 0 0 0 1.178.727 2.345 2.345 0 0 1 1.729-.094l2.2.729c.508.172.942.514 1.23.968a.837.837 0 0 0 1.235.191c.412-.347.932-.54 1.47-.544h2.106a2.32 2.32 0 0 1 1.546.603c.318.285.8.285 1.118 0 .423-.385.974-.6 1.547-.603h2.106c.778 0 1.504.39 1.934 1.037a.868.868 0 0 0 1.394 0 2.324 2.324 0 0 1 1.935-1.037h2.106a2.303 2.303 0 0 1 0 4.605H32.42a2.324 2.324 0 0 1-1.938-1.037.868.868 0 0 0-1.393 0 2.321 2.321 0 0 1-1.935 1.038h-2.103a2.319 2.319 0 0 1-1.547-.604.837.837 0 0 0-1.118 0 2.32 2.32 0 0 1-1.546.603h-2.105a2.325 2.325 0 0 1-1.926-1.02.838.838 0 0 0-1.232-.169 2.39 2.39 0 0 1-2.289.442l-2.199-.729a2.372 2.372 0 0 1-1.608-2.157.837.837 0 0 0-1.201-.72 2.188 2.188 0 0 1-2.68-.592l-1.472-1.825a2.15 2.15 0 0 1-.15-2.512.838.838 0 0 0-.518-1.256 2.293 2.293 0 0 1-1.778-2.153c-.007-.394-.007-.777-.007-1.126V27.18c.004-.567.22-1.113.604-1.53a.838.838 0 0 0 0-1.126 2.279 2.279 0 0 1-.604-1.53V20.9a2.295 2.295 0 0 1 1.785-2.233.837.837 0 0 0 .519-1.256 2.154 2.154 0 0 1 .148-2.512l1.47-1.83a2.186 2.186 0 0 1 2.68-.59.837.837 0 0 0 1.202-.72 2.374 2.374 0 0 1 1.61-2.159l2.2-.728a2.406 2.406 0 0 1 2.285.442.837.837 0 0 0 1.232-.17 2.325 2.325 0 0 1 1.929-1.015h2.105a2.32 2.32 0 0 1 1.546.603c.318.285.8.285 1.118 0 .423-.385.974-.6 1.547-.603h2.106c.778 0 1.504.39 1.934 1.037a.868.868 0 0 0 1.394 0A2.324 2.324 0 0 1 32.42 8.13h2.106c.31 0 .618.061.904.182l.649-1.545a3.983 3.983 0 0 0-1.553-.312H32.42a3.99 3.99 0 0 0-2.632.989 3.99 3.99 0 0 0-2.631-.989H25.05a3.964 3.964 0 0 0-2.106.61 3.964 3.964 0 0 0-2.105-.61h-2.105a4 4 0 0 0-2.77 1.111 4.085 4.085 0 0 0-3.203-.28l-2.196.728a4.048 4.048 0 0 0-2.573 2.628 3.881 3.881 0 0 0-3.7 1.382l-1.47 1.828a3.859 3.859 0 0 0-.806 3.005c.028.179.069.355.123.527A3.952 3.952 0 0 0 0 20.9v2.093c.001.742.213 1.468.61 2.094A3.921 3.921 0 0 0 0 27.18v2.094c0 .03.005.058.006.084-.03 1.77.07 3.541.3 5.297A18.59 18.59 0 0 0 18.633 50H32.66a5.869 5.869 0 0 0 5.861-5.862v-4.187h-.02c0-.071.02-.137.02-.21zm-1.674 4.396a4.192 4.192 0 0 1-4.188 4.187H18.634A16.95 16.95 0 0 1 1.937 34.281c-.1-.567-.156-1.14-.168-1.715.12.081.243.156.37.223a3.86 3.86 0 0 0 .684 3.534l1.47 1.828a3.88 3.88 0 0 0 3.7 1.381 4.046 4.046 0 0 0 2.571 2.624l2.196.728c1.061.35 2.22.25 3.205-.28a4 4 0 0 0 2.77 1.115h2.105a3.964 3.964 0 0 0 2.105-.61c.63.398 1.36.609 2.106.61h2.106c.968 0 1.903-.35 2.631-.989.728.639 1.664.99 2.632.99h2.106a3.975 3.975 0 0 0 2.32-.754v1.172z"/>
        <path d="M47.488 5.862l-3.35-3.35L41.626 0l-1.184 1.184 1.92 1.92-8.028 8.028-.245-.245-1.675-1.675-1.184 1.184 1.083 1.083-13.644 13.644a.837.837 0 0 0 0 1.184l.351.352-2.968 4.453a.838.838 0 0 0 .104 1.057l1.675 1.675a.837.837 0 0 0 1.057.104l4.453-2.968.352.351a.837.837 0 0 0 1.184 0l13.644-13.644 1.083 1.083 1.184-1.184-1.674-1.675-.246-.245 8.028-8.028 1.92 1.92L50 8.374l-2.512-2.512zM18.532 32.174l-.703-.704 2.401-3.6 1.903 1.902-3.6 2.402zm5.753-2.619l-.245-.245-3.35-3.35-.245-.245 6.352-6.353 3.84 3.84-6.352 6.353zm7.537-7.537l-3.84-3.84 5.515-5.515.245.245 3.35 3.35.245.245-5.515 5.515zm5.862-7.536l-2.166-2.166 8.028-8.028 2.166 2.166-8.028 8.028z"/>
    </g>
    <defs>
        <clipPath id="a">
            <path fill="#fff" d="M0 0h50v50H0z"/>
        </clipPath>
    </defs>
</svg>
