<?xml version="1.0" encoding="UTF-8"?>
<svg width="20px" height="20px" viewBox="0 0 20 20" version="1.1" xmlns="http://www.w3.org/2000/svg" xmlns:xlink="http://www.w3.org/1999/xlink">
    <!-- Generator: Sketch 53.2 (72643) - https://sketchapp.com -->
    <title>insta_red copy</title>
    <desc>Created with Sketch.</desc>
    <g id="Symbols" stroke="none" stroke-width="1" fill="none" fill-rule="evenodd">
        <g id="1920/footer-dark" transform="translate(-1662.000000, -436.000000)" fill="#8BBEF5">
            <g id="socials" transform="translate(1548.000000, 436.000000)">
                <path d="M129.647738,5.58391878 C128.944749,5.58391878 128.374896,5.01528766 128.374896,4.31389894 C128.374896,3.6124682 128.944749,3.04383709 129.647738,3.04383709 C130.350727,3.04383709 130.92058,3.6124682 130.92058,4.31389894 C130.92058,5.01528766 130.350727,5.58391878 129.647738,5.58391878 Z M123.985599,6.43557988 C125.938315,6.43557988 127.521346,8.0150594 127.521346,9.96348745 C127.521346,11.9118735 125.938315,13.491353 123.985599,13.491353 C122.032883,13.491353 120.449852,11.9118735 120.449852,9.96348745 C120.449852,8.0150594 122.032883,6.43557988 123.985599,6.43557988 Z M123.985591,15.3983195 C120.977338,15.3983195 118.538685,12.9650321 118.538685,9.96344964 C118.538685,6.9618672 120.977338,4.52862178 123.985591,4.52862178 C126.993843,4.52862178 129.432538,6.9618672 129.432538,9.96344964 C129.432538,12.9650321 126.993843,15.3983195 123.985591,15.3983195 M132.596406,1.40354938 C132.169616,0.976715094 131.76326,0.71236987 131.193925,0.491117635 C130.764064,0.324043262 130.118203,0.125361427 128.928917,0.0710945308 C127.642715,0.0124203971 127.256926,0 123.999978,0 C120.743029,0 120.35724,0.0124203971 119.070994,0.0710945308 C117.881752,0.125361427 117.235892,0.324043262 116.806075,0.491117635 C116.236695,0.71236987 115.830384,0.976715094 115.403549,1.40354938 C114.976715,1.83038367 114.71237,2.23673989 114.491073,2.80607487 C114.324043,3.23589183 114.125361,3.881797 114.071095,5.07103888 C114.01242,6.35724 114,6.74302911 114,9.99997774 C114,13.2569709 114.01242,13.6427155 114.071095,14.9289611 C114.125361,16.118203 114.324043,16.7641082 114.491073,17.1939251 C114.71237,17.7632601 114.976715,18.1696163 115.403549,18.5964506 C115.830384,19.0232849 116.236695,19.2876301 116.806075,19.5088824 C117.235892,19.6759122 117.881752,19.8746386 119.071039,19.9289055 C120.357062,19.9875796 120.742807,20 123.999978,20 C127.257149,20 127.642894,19.9875796 128.928917,19.9289055 C130.118203,19.8746386 130.764064,19.6759122 131.193925,19.5088824 C131.76326,19.2876301 132.169616,19.0232849 132.596451,18.5964061 C133.02324,18.1696163 133.28763,17.7632601 133.508882,17.1939251 C133.675912,16.7641082 133.874639,16.118203 133.928905,14.9289611 C133.98758,13.6427155 134,13.2569709 134,9.99997774 C134,6.74302911 133.98758,6.35724 133.928905,5.07103888 C133.874639,3.881797 133.675912,3.23589183 133.508882,2.80607487 C133.28763,2.23673989 133.02324,1.83038367 132.596406,1.40354938" id="insta_red-copy"></path>
            </g>
        </g>
    </g>
</svg>