<svg width="50" height="50" viewBox="0 0 50 50" fill="none" xmlns="http://www.w3.org/2000/svg">
    <path d="M.732 36.507a.732.732 0 0 0 .733-.732V14.442h43.274v8.051a.732.732 0 0 0 1.465 0V8.018a4.458 4.458 0 0 0-4.453-4.453h-1.92v-.907c0-.981-.799-1.78-1.78-1.78h-1.36c-.981 0-1.78.799-1.78 1.78v.907h-4.857v-.907c0-.981-.798-1.78-1.78-1.78h-1.36c-.98 0-1.779.799-1.779 1.78v.907h-4.858v-.907c0-.981-.798-1.78-1.779-1.78h-1.36c-.981 0-1.78.799-1.78 1.78v.907h-4.857v-.907c0-.981-.798-1.78-1.78-1.78h-1.36c-.98 0-1.779.799-1.779 1.78v.907H4.453A4.458 4.458 0 0 0 0 8.018v27.757c0 .404.328.732.732.732zM36.377 2.658c0-.173.14-.314.314-.314h1.36c.174 0 .315.14.315.314v3.558c0 .174-.141.315-.314.315H36.69a.315.315 0 0 1-.314-.315V2.658zm-9.777 0c0-.173.141-.314.314-.314h1.36c.174 0 .315.14.315.314v3.558a.315.315 0 0 1-.314.315h-1.36a.314.314 0 0 1-.315-.315V2.658zm-9.776 0c0-.173.14-.314.314-.314h1.36c.174 0 .315.14.315.314v3.558a.315.315 0 0 1-.314.315h-1.361a.315.315 0 0 1-.314-.315V2.658zm-9.777 0c0-.173.141-.314.315-.314h1.36c.173 0 .314.14.314.314v3.558c0 .174-.14.315-.314.315h-1.36a.315.315 0 0 1-.315-.315V2.658zM4.453 5.03h1.13v1.186c0 .982.797 1.78 1.779 1.78h1.36c.981 0 1.78-.798 1.78-1.78V5.03h4.857v1.186c0 .982.798 1.78 1.779 1.78h1.36c.982 0 1.78-.798 1.78-1.78V5.03h4.857v1.186c0 .982.798 1.78 1.78 1.78h1.36c.981 0 1.78-.798 1.78-1.78V5.03h4.857v1.186c0 .982.798 1.78 1.779 1.78h1.36c.981 0 1.78-.798 1.78-1.78V5.03h1.92a2.992 2.992 0 0 1 2.989 2.988v4.96H1.465v-4.96A2.992 2.992 0 0 1 4.453 5.03z" fill="#fff"/>
    <path d="M8.292 43.319H1.905a.441.441 0 0 1-.44-.441v-3.766a.732.732 0 1 0-1.465 0v3.766c0 1.05.855 1.905 1.905 1.905h6.387a.733.733 0 0 0 0-1.464z" fill="#fff"/>
    <path d="M8.268 16.578H5.722a.733.733 0 0 0 0 1.465h2.546a.732.732 0 1 0 0-1.465z" fill="#fff"/>
    <path d="M13.546 18.043h2.546a.732.732 0 1 0 0-1.465h-2.546a.733.733 0 0 0 0 1.465z" fill="#fff"/>
    <path d="M21.37 18.043h2.545a.732.732 0 1 0 0-1.465H21.37a.732.732 0 1 0 0 1.465z" fill="#fff"/>
    <path d="M29.193 18.043h2.546a.732.732 0 1 0 0-1.465h-2.546a.733.733 0 0 0 0 1.465z" fill="#fff"/>
    <path d="M39.563 16.578h-2.546a.732.732 0 1 0 0 1.465h2.546a.732.732 0 1 0 0-1.465z" fill="#fff"/>
    <path d="M8.268 20.261H5.722a.732.732 0 1 0 0 1.465h2.546a.732.732 0 1 0 0-1.465z" fill="#fff"/>
    <path d="M13.546 21.726h2.546a.732.732 0 1 0 0-1.465h-2.546a.732.732 0 1 0 0 1.465z" fill="#fff"/>
    <path d="M21.37 21.726h2.545a.732.732 0 1 0 0-1.465H21.37a.732.732 0 1 0 0 1.465z" fill="#fff"/>
    <path d="M29.193 21.726h2.546a.732.732 0 1 0 0-1.465h-2.546a.732.732 0 1 0 0 1.465z" fill="#fff"/>
    <path d="M39.563 20.261h-2.546a.732.732 0 1 0 0 1.465h2.546a.732.732 0 1 0 0-1.465z" fill="#fff"/>
    <path d="M13.563 36.105l3.766 3.766a2.864 2.864 0 0 0 2.04.844c.77 0 1.495-.3 2.04-.844L31.72 29.558a2.888 2.888 0 0 0 0-4.08 2.888 2.888 0 0 0-4.079 0l-8.273 8.274-1.727-1.726a2.888 2.888 0 0 0-4.079 0 2.888 2.888 0 0 0 0 4.079zm1.036-3.043c.277-.277.64-.415 1.004-.415.363 0 .727.138 1.004.415l2.244 2.244a.732.732 0 0 0 1.035 0l8.792-8.791a1.421 1.421 0 0 1 2.007 0 1.421 1.421 0 0 1 0 2.007L20.372 38.835a1.41 1.41 0 0 1-1.003.416 1.41 1.41 0 0 1-1.004-.416L14.6 35.069a1.42 1.42 0 0 1 0-2.007z" fill="#fff"/>
    <path d="M46.204 31.676V25.83a.732.732 0 1 0-1.465 0v4.91a9.655 9.655 0 0 0-4.456-1.084c-5.358 0-9.717 4.36-9.717 9.717 0 1.404.3 2.738.837 3.945H11.63a.732.732 0 1 0 0 1.464h20.584a9.715 9.715 0 0 0 8.069 4.309c5.358 0 9.717-4.36 9.717-9.718 0-3.13-1.49-5.92-3.796-7.698zm-5.921 15.95c-4.55 0-8.252-3.7-8.252-8.252 0-4.55 3.702-8.252 8.252-8.252 4.55 0 8.252 3.702 8.252 8.252 0 4.551-3.702 8.253-8.252 8.253z" fill="#fff"/>
    <path d="M40.283 32.18c-3.967 0-7.194 3.228-7.194 7.194 0 3.967 3.227 7.195 7.194 7.195s7.194-3.228 7.194-7.195c0-3.966-3.228-7.194-7.194-7.194zm.656 12.885a.73.73 0 0 0 .076-.325v-.892a.733.733 0 0 0-1.465 0v.892c0 .117.028.227.077.325a5.738 5.738 0 0 1-5.035-5.035.725.725 0 0 0 .325.077h.892a.732.732 0 1 0 0-1.465h-.892a.729.729 0 0 0-.325.077 5.738 5.738 0 0 1 5.035-5.035.724.724 0 0 0-.077.325v.892a.732.732 0 1 0 1.465 0v-.892a.73.73 0 0 0-.076-.325 5.738 5.738 0 0 1 5.034 5.035.73.73 0 0 0-.324-.077h-.893a.732.732 0 1 0 0 1.465h.893a.726.726 0 0 0 .324-.077 5.738 5.738 0 0 1-5.034 5.035z" fill="#fff"/>
    <path d="M41.897 38.642h-.882v-.751a.733.733 0 0 0-1.465 0v1.483c0 .405.328.733.733.733h1.614a.732.732 0 1 0 0-1.465z" fill="#fff"/>
</svg>
