<svg width="70" height="70" viewBox="0 0 70 70" fill="none" xmlns="http://www.w3.org/2000/svg">
<path d="M41.5641 53.7488C41.5641 43.853 46.2516 41.2488 46.2516 41.2488C52.762 34.7384 53.085 24.5144 46.5799 18.004C43.4545 14.8795 39.2159 13.124 34.7961 13.124C30.3763 13.124 26.1377 14.8795 23.0122 18.004C16.5018 24.5144 16.8247 34.7384 23.3349 41.2488C23.3349 41.2488 28.0224 43.853 28.0224 53.7488H41.5641Z" fill="#E96FAA"/>
<path fill-rule="evenodd" clip-rule="evenodd" d="M21.5391 16.531C25.0553 13.0159 29.8237 11.041 34.7959 11.041C39.7681 11.041 44.5365 13.0159 48.0527 16.531L48.0535 16.5318C55.4245 23.9089 54.9944 35.4525 47.7246 42.7223C47.5977 42.8492 47.455 42.9591 47.3 43.0494C47.2926 43.0541 47.2763 43.0648 47.252 43.082C47.189 43.1265 47.0725 43.2142 46.919 43.3535C46.6132 43.631 46.1549 44.1182 45.6778 44.8869C44.7333 46.4085 43.6473 49.1441 43.6473 53.7491C43.6473 54.8997 42.7145 55.8325 41.5639 55.8325H28.0223C26.8717 55.8325 25.9389 54.8997 25.9389 53.7491C25.9389 49.1441 24.8529 46.4085 23.9084 44.8869C23.4314 44.1182 22.973 43.631 22.6672 43.3535C22.5137 43.2142 22.3972 43.1265 22.3342 43.082C22.3099 43.0648 22.2936 43.0541 22.2862 43.0494C22.1313 42.9591 21.9885 42.8492 21.8616 42.7223C14.5919 35.4524 14.1618 23.9083 21.5389 16.5312L21.5391 16.531ZM24.6551 39.6211C24.6815 39.6391 24.7092 39.6583 24.7381 39.6787C24.9315 39.8153 25.1813 40.0084 25.4672 40.2678C26.0403 40.7879 26.7538 41.5702 27.4486 42.6895C28.6555 44.6339 29.757 47.5155 30.0372 51.6658H39.5491C39.8292 47.5155 40.9307 44.6339 42.1376 42.6895C42.8324 41.5702 43.5459 40.7879 44.119 40.2678C44.405 40.0084 44.6547 39.8153 44.8481 39.6787C44.877 39.6583 44.9047 39.6391 44.9311 39.6211C50.5324 33.8664 50.6947 25.0711 45.1068 19.4777C42.372 16.7437 38.6632 15.2077 34.7959 15.2077C30.9286 15.2077 27.2198 16.7437 24.485 19.4777C18.8919 25.0711 19.0539 33.8663 24.6551 39.6211Z" fill="#E96FAA"/>
<path fill-rule="evenodd" clip-rule="evenodd" d="M29.5833 66.2489C29.5833 65.0983 30.516 64.1655 31.6666 64.1655H37.9166C39.0672 64.1655 39.9999 65.0983 39.9999 66.2489C39.9999 67.3995 39.0672 68.3322 37.9166 68.3322H31.6666C30.516 68.3322 29.5833 67.3995 29.5833 66.2489Z" fill="#E96FAA"/>
<path fill-rule="evenodd" clip-rule="evenodd" d="M27.4998 59.9993C27.4998 58.8488 28.4325 57.916 29.5831 57.916H39.9998C41.1503 57.916 42.0831 58.8488 42.0831 59.9993C42.0831 61.1499 41.1503 62.0827 39.9998 62.0827H29.5831C28.4325 62.0827 27.4998 61.1499 27.4998 59.9993Z" fill="#E96FAA"/>
<path fill-rule="evenodd" clip-rule="evenodd" d="M34.2708 1.66602C35.4214 1.66602 36.3542 2.59876 36.3542 3.74935V6.87435C36.3542 8.02494 35.4214 8.95768 34.2708 8.95768C33.1202 8.95768 32.1875 8.02494 32.1875 6.87435V3.74935C32.1875 2.59876 33.1202 1.66602 34.2708 1.66602Z" fill="#E96FAA"/>
<path fill-rule="evenodd" clip-rule="evenodd" d="M6.6665 29.2694C6.6665 28.1188 7.59924 27.186 8.74984 27.186H11.8748C13.0254 27.186 13.9582 28.1188 13.9582 29.2694C13.9582 30.42 13.0254 31.3527 11.8748 31.3527H8.74984C7.59924 31.3527 6.6665 30.42 6.6665 29.2694Z" fill="#E96FAA"/>
<path fill-rule="evenodd" clip-rule="evenodd" d="M55.6248 29.2694C55.6248 28.1188 56.5575 27.186 57.7081 27.186H59.7914C60.942 27.186 61.8748 28.1188 61.8748 29.2694C61.8748 30.42 60.942 31.3527 59.7914 31.3527H57.7081C56.5575 31.3527 55.6248 30.42 55.6248 29.2694Z" fill="#E96FAA"/>
<path fill-rule="evenodd" clip-rule="evenodd" d="M19.9053 43.6361C20.7189 44.4497 20.7189 45.7688 19.9053 46.5824L17.6969 48.7908C16.8833 49.6044 15.5642 49.6044 14.7506 48.7908C13.937 47.9772 13.937 46.6581 14.7506 45.8445L16.959 43.6361C17.7726 42.8225 19.0917 42.8225 19.9053 43.6361Z" fill="#E96FAA"/>
<path fill-rule="evenodd" clip-rule="evenodd" d="M53.7936 9.74984C54.6072 10.5634 54.6072 11.8825 53.7936 12.6961L52.3194 14.1703C51.5058 14.9839 50.1867 14.9839 49.3731 14.1703C48.5595 13.3567 48.5595 12.0376 49.3731 11.224L50.8473 9.74984C51.6609 8.93625 52.98 8.93625 53.7936 9.74984Z" fill="#E96FAA"/>
<path fill-rule="evenodd" clip-rule="evenodd" d="M14.7506 9.74984C15.5642 8.93625 16.8833 8.93625 17.6969 9.74984L19.9053 11.9583C20.7189 12.7719 20.7189 14.091 19.9053 14.9046C19.0917 15.7182 17.7726 15.7182 16.959 14.9046L14.7506 12.6961C13.937 11.8825 13.937 10.5634 14.7506 9.74984Z" fill="#E96FAA"/>
<path fill-rule="evenodd" clip-rule="evenodd" d="M49.3731 44.369C50.1867 43.5554 51.5058 43.5554 52.3194 44.369L53.7936 45.8431C54.6072 46.6567 54.6072 47.9758 53.7936 48.7894C52.98 49.603 51.6609 49.603 50.8473 48.7894L49.3731 47.3153C48.5595 46.5017 48.5595 45.1826 49.3731 44.369Z" fill="#E96FAA"/>
</svg>
