[
    null
][
    null
][
    null
][
    null
][
    null
][
    null
][
    null
][
    null
][
    null
][
    null
][
    null
][
    null
][
    null
][
    null
][
    null
][
    null
][
    null
][
    null
][
    null
][
    null
][
    null
][
    null
][
    null
][
    null
][
    null
][
    null
][
    null
][
    null
][
    null
][
    null
]Shortcodes are amazing! was just saved! It was saved at 2021-03-22 08:14:19[
    null
][
    null
][
    null
][
    null
][
    null
][
    null
][
    null
][
    null
][
    null
]Shortcodes are amazing! was just saved! It was saved at 2021-03-22 08:17:54[
    null
][
    null
][
    null
]Shortcodes are amazing! was just saved! It was saved at 2021-03-22 08:18:20[
    null
][
    null
][
    null
][
    null
][
    null
][
    null
]Shortcodes are amazing! was just saved! It was saved at 2021-03-22 08:20:55[
    null
][
    null
][
    null
]Shortcodes are amazing! was just saved! It was saved at 2021-03-22 08:21:13[
    null
][
    null
][
    null
][
    null
][
    null
]Shortcodes are amazing! was just saved! It was saved at 2021-03-22 08:21:34[
    null
][
    null
][
    null
]Shortcodes are amazing! was just saved! It was saved at 2021-03-22 08:22:24[
    null
][
    null
][
    null
][
    null
]Shortcodes are amazing! was just saved! It was saved at 2021-03-22 08:22:59[
    null
][
    null
][
    null
]Shortcodes are amazing! was just saved! It was saved at 2021-03-22 08:23:20[
    null
][
    null
][
    null
][
    null
][
    null
][
    null
][
    null
]Shortcodes are amazing! was just saved! It was saved at 2021-03-22 08:24:47[
    null
][
    null
][
    null
][
    null
]Shortcodes are amazing! was just saved! It was saved at 2021-03-22 08:25:32[
    null
][
    null
][
    null
][
    null
][
    null
][
    null
][
    null
]Shortcodes are amazing! was just saved! It was saved at 2021-03-22 08:31:37[
    null
][
    null
][
    null
][
    null
][
    null
][
    null
][
    null
][
    null
][
    null
][
    null
][
    null
][
    null
][
    null
][
    null
][
    null
][
    null
][
    null
][
    null
][
    null
][
    null
][
    null
][
    null
][
    null
][
    null
][
    null
][
    null
][
    null
][
    null
][
    null
][
    null
][
    null
][
    null
][
    null
][
    null
][
    null
][
    null
][
    null
][
    null
][
    null
][
    null
][
    null
][
    null
][
    null
][
    null
][
    null
][
    null
][
    null
][
    null
][
    null
][
    null
][
    null
][
    null
][
    null
][
    null
][
    null
][
    null
][
    null
][
    null
][
    null
][
    null
][
    null
][
    null
][
    null
][
    null
][
    null
][
    null
][
    null
][
    null
][
    null
][
    null
][
    null
][
    null
][
    null
][
    null
][
    null
][
    null
][
    null
][
    null
][
    null
][
    null
][
    null
][
    null
][
    null
][
    null
][
    null
][
    null
][
    null
][
    null
][
    null
][
    null
][
    null
][
    null
][
    null
][
    null
][
    null
][
    null
][
    null
][
    null
][
    null
][
    null
][
    null
][
    null
][
    null
][
    null
][
    null
][
    null
][
    null
][
    null
][
    null
][
    null
][
    null
][
    null
][
    null
][
    null
][
    null
][
    null
][
    null
][
    null
][
    null
][
    null
][
    null
][
    null
][
    null
][
    null
][
    null
][
    null
][
    null
][
    null
][
    null
][
    null
][
    null
][
    null
][
    null
][
    null
][
    null
][
    null
][
    null
][
    null
][
    null
][
    null
][
    null
][
    null
][
    null
][
    null
][
    null
][
    null
][
    null
][
    null
][
    null
][
    null
][
    null
][
    null
][
    null
][
    null
][
    null
][
    null
][
    null
][
    null
]About me! was just saved! It was saved at 2021-03-22 12:03:04[
    null
][
    null
][
    null
][
    null
][
    null
][
    null
][
    null
][
    null
][
    null
][
    null
][
    null
][
    null
][
    null
][
    null
][
    null
][
    null
][
    null
][
    null
][
    null
][
    null
][
    null
][
    null
][
    null
][
    null
][
    null
][
    null
][
    null
][
    null
][
    null
][
    null
][
    null
][
    null
][
    null
][
    null
][
    null
][
    null
][
    null
][
    null
][
    null
][
    null
][
    null
][
    null
][
    null
][
    null
][
    null
][
    null
][
    null
][
    null
][
    null
][
    null
][
    null
][
    null
][
    null
][
    null
][
    null
][
    null
][
    null
][
    null
][
    null
][
    null
][
    null
][
    null
][
    null
][
    null
][
    null
]