\relax 
\@writefile{toc}{\contentsline {section}{\numberline {1}大気差・大気分散表式}{1}}
\newlabel{eqn:n-1}{{1}{1}}
\@writefile{lot}{\contentsline {table}{\numberline {1}{\ignorespaces 大気差・大気分散の主要数値}}{2}}
\newlabel{tbl:atmref}{{1}{2}}
\@writefile{toc}{\contentsline {section}{\numberline {2}可視・近赤外線にわたる大気差・大気分散}{2}}
\@writefile{lof}{\contentsline {figure}{\numberline {1}{\ignorespaces 乾燥大気の大気差}}{3}}
\newlabel{fig:atmref}{{1}{3}}
\@writefile{lof}{\contentsline {figure}{\numberline {2}{\ignorespaces 図1\relax の部分拡大}}{3}}
\newlabel{fig:atmref_mag}{{2}{3}}
\@writefile{lof}{\contentsline {figure}{\numberline {3}{\ignorespaces 大気分散の評価。各波長の大気差と$0.55 \mathrm   {\mu m}$の大気差の差分。}}{4}}
\newlabel{fig:atmdif}{{3}{4}}
