﻿Observer,LNG,LAT,ObsType
Ichiro OSAKA,135.4368780 ,34.7858930 ,1
Jiro NARA,135.7604600 ,34.6313720 ,1
Saburo UMEDA,135.4965310 ,34.7009070 ,2
Shiro NAGAI,135.5186320 ,34.6141910 ,2
Ichiko TAKARAZUKA,135.3460690 ,34.8102800 ,3
Futaba NOSE,135.4666290 ,34.9284450 ,3
Mitsuha SANDA,135.2303700 ,34.8874450 ,4