{
  "idecon": "gJAy",
  "servic": "utoy",
  "servdes": "2XnBb9UhuAr7Bzn878fs5xRxS2ZRSwpMiH26MXAX",
  "indser": "F",
  "desind": "GCzGT6Aw0m6sV0s75nz5BBZnaYWk21bnn4gSiLEf",
  "permide": "QS",
  "permdes": "bQyUhJRrb3VkP4hWU4GijNmZpHD8EhO1NcFHhBrqwUNXqRotty",
  "powerid": "S",
  "powedes": "xIrxDPxco7Vhxc6sKQpKnMjoouUkBEodgfCg1pMq",
  "amount": 551141687381876.14,
  "curency": "VYJS7D1l3LHIM8VlfC7B",
  "empaud": "S"
}
