module grpc-starter

go 1.18

require (
	cloud.google.com/go/errorreporting v0.3.0
	cloud.google.com/go/profiler v0.1.0
	cloud.google.com/go/pubsub v1.28.0
	contrib.go.opencensus.io/exporter/stackdriver v0.13.8
	github.com/alicebob/miniredis/v2 v2.15.1
	github.com/cucumber/godog v0.12.5
	github.com/dgrijalva/jwt-go v3.2.0+incompatible
	github.com/envoyproxy/protoc-gen-validate v1.0.2
	github.com/golang/mock v1.6.0
	github.com/gomodule/redigo v1.8.4
	github.com/google/uuid v1.3.0
	github.com/grpc-ecosystem/go-grpc-middleware v1.3.0
	github.com/grpc-ecosystem/go-grpc-prometheus v1.2.0
	github.com/grpc-ecosystem/grpc-gateway/v2 v2.11.3
	github.com/grpc-ecosystem/grpc-opentracing v0.0.0-20180507213350-8e809c8a8645
	github.com/jackc/pgx/v4 v4.12.0
	github.com/joeshaw/envdecode v0.0.0-20200121155833-099f1fc765bd
	github.com/joho/godotenv v1.3.0
	github.com/opentracing/opentracing-go v1.1.0
	github.com/pawelWritesCode/gdutils v1.2.0
	github.com/pkg/errors v0.9.1
	github.com/prometheus/client_golang v1.9.0
	github.com/rs/zerolog v1.23.0
	github.com/spf13/pflag v1.0.5
	github.com/stretchr/testify v1.8.1
	go.opencensus.io v0.24.0
	go.uber.org/zap v1.16.0
	golang.org/x/crypto v0.10.0
	golang.org/x/net v0.11.0
	google.golang.org/api v0.109.0
	google.golang.org/genproto v0.0.0-20230125152338-dcaf20b6aeaa
	google.golang.org/grpc v1.53.0-dev
	google.golang.org/protobuf v1.30.0
	gorm.io/driver/postgres v1.1.0
	gorm.io/gorm v1.21.14
)

require (
	cloud.google.com/go v0.109.0 // indirect
	cloud.google.com/go/compute v1.18.0 // indirect
	cloud.google.com/go/compute/metadata v0.2.3 // indirect
	cloud.google.com/go/iam v0.10.0 // indirect
	cloud.google.com/go/monitoring v1.12.0 // indirect
	cloud.google.com/go/trace v1.8.0 // indirect
	github.com/alicebob/gopher-json v0.0.0-20200520072559-a9ecdc9d1d3a // indirect
	github.com/antchfx/htmlquery v1.2.5 // indirect
	github.com/antchfx/jsonquery v1.3.0 // indirect
	github.com/antchfx/xmlquery v1.3.9 // indirect
	github.com/antchfx/xpath v1.2.1 // indirect
	github.com/aws/aws-sdk-go v1.37.0 // indirect
	github.com/beorn7/perks v1.0.1 // indirect
	github.com/census-instrumentation/opencensus-proto v0.4.1 // indirect
	github.com/cespare/xxhash/v2 v2.2.0 // indirect
	github.com/cucumber/gherkin-go/v19 v19.0.3 // indirect
	github.com/cucumber/messages-go/v16 v16.0.1 // indirect
	github.com/davecgh/go-spew v1.1.1 // indirect
	github.com/fatih/color v1.13.0 // indirect
	github.com/goccy/go-yaml v1.9.5 // indirect
	github.com/gofrs/uuid v4.0.0+incompatible // indirect
	github.com/golang/groupcache v0.0.0-20210331224755-41bb18bfe9da // indirect
	github.com/golang/protobuf v1.5.3 // indirect
	github.com/google/go-cmp v0.5.9 // indirect
	github.com/google/pprof v0.0.0-20210804190019-f964ff605595 // indirect
	github.com/googleapis/enterprise-certificate-proxy v0.2.3 // indirect
	github.com/googleapis/gax-go/v2 v2.7.0 // indirect
	github.com/hashicorp/go-immutable-radix v1.3.0 // indirect
	github.com/hashicorp/go-memdb v1.3.0 // indirect
	github.com/hashicorp/golang-lru v0.5.4 // indirect
	github.com/hokaccha/go-prettyjson v0.0.0-20211117102719-0474bc63780f // indirect
	github.com/jackc/chunkreader/v2 v2.0.1 // indirect
	github.com/jackc/pgconn v1.9.0 // indirect
	github.com/jackc/pgio v1.0.0 // indirect
	github.com/jackc/pgpassfile v1.0.0 // indirect
	github.com/jackc/pgproto3/v2 v2.1.1 // indirect
	github.com/jackc/pgservicefile v0.0.0-20200714003250-2b9c44734f2b // indirect
	github.com/jackc/pgtype v1.8.0 // indirect
	github.com/jackc/puddle v1.1.3 // indirect
	github.com/jinzhu/inflection v1.0.0 // indirect
	github.com/jinzhu/now v1.1.2 // indirect
	github.com/jmespath/go-jmespath v0.4.0 // indirect
	github.com/mattn/go-colorable v0.1.12 // indirect
	github.com/mattn/go-isatty v0.0.14 // indirect
	github.com/matttproud/golang_protobuf_extensions v1.0.1 // indirect
	github.com/moul/http2curl v1.0.0 // indirect
	github.com/oliveagle/jsonpath v0.0.0-20180606110733-2e52cf6e6852 // indirect
	github.com/pawelWritesCode/qjson v1.0.1 // indirect
	github.com/pmezard/go-difflib v1.0.0 // indirect
	github.com/prometheus/client_model v0.2.0 // indirect
	github.com/prometheus/common v0.15.0 // indirect
	github.com/prometheus/procfs v0.2.0 // indirect
	github.com/qri-io/jsonpointer v0.1.1 // indirect
	github.com/qri-io/jsonschema v0.2.1 // indirect
	github.com/tidwall/gjson v1.14.1 // indirect
	github.com/tidwall/match v1.1.1 // indirect
	github.com/tidwall/pretty v1.2.0 // indirect
	github.com/xeipuuv/gojsonpointer v0.0.0-20190905194746-02993c407bfb // indirect
	github.com/xeipuuv/gojsonreference v0.0.0-20180127040603-bd5ef7bd5415 // indirect
	github.com/xeipuuv/gojsonschema v1.2.0 // indirect
	github.com/yuin/gopher-lua v0.0.0-20200816102855-ee81675732da // indirect
	go.uber.org/atomic v1.6.0 // indirect
	go.uber.org/multierr v1.5.0 // indirect
	golang.org/x/oauth2 v0.7.0 // indirect
	golang.org/x/sync v0.3.0 // indirect
	golang.org/x/sys v0.9.0 // indirect
	golang.org/x/text v0.10.0 // indirect
	golang.org/x/xerrors v0.0.0-20220907171357-04be3eba64a2 // indirect
	google.golang.org/appengine v1.6.7 // indirect
	gopkg.in/yaml.v2 v2.4.0 // indirect
	gopkg.in/yaml.v3 v3.0.1 // indirect
)
