<svg width="58" height="58" viewBox="0 0 58 58" fill="none" xmlns="http://www.w3.org/2000/svg">
<circle cx="27.4998" cy="30.0779" r="27.4998" fill="#FF5C00"/>
<g style="mix-blend-mode:multiply">
<circle cx="38.0001" cy="19.9999" r="19.9999" fill="#F17B38"/>
</g>
<g clip-path="url(#clip0)">
<path d="M31.6252 25.7282C31.1822 25.2853 30.4225 24.754 29.9003 24.4043L16.4969 37.8078C15.982 38.3226 15.9819 39.1609 16.4969 39.6768L17.6776 40.8574C18.1928 41.372 19.0312 41.3721 19.5462 40.857L32.9495 27.4537C32.4569 26.718 31.9941 26.0971 31.6252 25.7282Z" fill="white"/>
<path d="M38.2802 22.1231C38.7951 21.6082 38.7952 20.7699 38.2802 20.254L37.0996 19.0734C36.5842 18.5587 35.7458 18.5589 35.2309 19.0738L34.1206 20.1841C30.769 18.6788 25.498 18.7283 25.2655 18.7309C24.9633 18.7348 24.7022 18.9433 24.6315 19.2372C24.5609 19.5311 24.6986 19.8355 24.9661 19.9764C26.7272 20.9055 31.1115 23.3574 32.5602 24.7933C33.9762 26.2093 36.4458 30.6182 37.3772 32.3879C37.5185 32.6563 37.8234 32.7929 38.1163 32.7225C38.4102 32.6518 38.6187 32.3907 38.6226 32.0884C38.6256 31.856 38.6746 26.5858 37.1694 23.2338L38.2802 22.1231Z" fill="white"/>
<path d="M36.2559 35.3031L35.4212 32.5899C35.2903 32.164 34.7818 31.986 34.4134 32.2408L31.1182 34.5222L32.8672 36.2713L36.2559 35.3031Z" fill="white"/>
<path d="M38.3073 36.0932C32.3725 37.7889 32.8085 37.6759 32.6756 37.6759C32.5027 37.6759 32.3339 37.608 32.2083 37.4823L28.9037 34.1777L24.4719 38.293C24.2183 38.5285 24.1893 38.9198 24.4056 39.19L25.8154 40.9523C25.9408 41.1091 26.1306 41.2003 26.3314 41.2003H37.9623C38.3453 41.2003 38.6488 40.8751 38.6215 40.4924L38.3073 36.0932Z" fill="white"/>
</g>
<defs>
<clipPath id="clip0">
<rect width="22.5554" height="22.5554" fill="white" transform="translate(16.111 18.6875)"/>
</clipPath>
</defs>
</svg>
