{
    "variables": {
        "base_ami_id": "{{ env `EC2_PROVISION_BASE_AMI` }}",
        "subnet_id": "{{ env `EC2_PROVISION_SUBNET_ID` }}",
        "associate_public_ip_address": "{{ env `EC2_PROVISION_WITH_PUBLIC_IP` }}",
        "ec2_user": "{{ env `EC2_PROVISION_USER` }}",
        "service_name": "{{ env `SERVICE_NAME` }}",
        "commit": "{{ env `CI_COMMIT_SHA` }}",
        "instance_type": "{{ env `EC2_INSTANCE_TYPE` }}",
        "docker_image": "{{ env `DOCKER_IMAGE` }}"
    },

    "builders": [
        {
            "type": "amazon-ebs",
            "ami_name": "{{ user `service_name` }}-{{ user `commit` }}",
            "ssh_username": "{{ user `ec2_user` }}",
            "instance_type": "{{ user `instance_type` }}",
            "source_ami": "{{ user `base_ami_id` }}",
            "subnet_id": "{{ user `subnet_id` }}",
            "associate_public_ip_address": "{{ user `associate_public_ip_address` }}",
            "tags": {
                "Name": "{{ user `service_name` }}"
            }
        }
    ],

    "provisioners": [
        {
            "type": "shell",
            "inline":[
                "sudo apt-get update",
                "sudo apt-get install -y apt-transport-https ca-certificates curl gnupg-agent software-properties-common",
                "curl -fsSL https://download.docker.com/linux/ubuntu/gpg | sudo apt-key add -",
                "sudo add-apt-repository \"deb [arch=amd64] https://download.docker.com/linux/ubuntu $(lsb_release -cs) stable\"",
                "sudo apt-get update",
                "sudo apt-get install -y docker-ce docker-ce-cli containerd.io",
                "sudo usermod -aG docker '{{ user `ec2_user` }}'",
                "sudo docker run -d --restart always -p 80:80 {{ user `docker_image` }}"

            ]
        }
    ],

    "post-processors": [
        [
            {
                "strip_path": true,
                "type": "manifest"
            }
        ]
    ]
}