[
  {
    "identifier": "Etc/GMT+12",
    "name": "International Date Line West",
    "abbr": "-12",
    "formatted_offset": "-12:00"
  },
  {
    "identifier": "Pacific/Pago_Pago",
    "name": "American Samoa",
    "abbr": "SST",
    "formatted_offset": "-11:00"
  },
  {
    "identifier": "Pacific/Midway",
    "name": "Midway Island",
    "abbr": "SST",
    "formatted_offset": "-11:00"
  },
  {
    "identifier": "America/Los_Angeles",
    "name": "Pacific Time (US & Canada)",
    "abbr": "PT",
    "formatted_offset": "-7:00"
  }
]
