{
    "telegram": {
        "token": "1009142278:AAEAOErmKcph4Z5UZSXoYAgj9S5xrbrZJr4",
        "chat_id": "-352855014",
        "uri": "https://api.telegram.org/bot1009142278:AAEAOErmKcph4Z5UZSXoYAgj9S5xrbrZJr4/sendMessage",
        "enable": true
    }
}