{
    "apiKey": "AIzaSyCXw5L8uepdBaYJI88tQwFphkCdQ4psNA4",
    "authDomain": "bbi-chat.firebaseapp.com",
    "databaseURL": "https://bbi-chat.firebaseio.com",
    "projectId": "bbi-chat",
    "storageBucket": "bbi-chat.appspot.com",
    "messagingSenderId": "713707159577",
    "appId": "1:713707159577:web:49e054641f354752c0aa88",
    "measurementId": "G-ZSKENPT0DR"
}