{
    "local": {
        "cassandra": {
            "host": "localhost",
            "keyspace": "bbi_chat",
            "username": "lemon",
            "password": "admin",
            "localDataCenter": "datacenter1",
            "maxRequestsPerConnection": 32768
        },
        "mysql": {
            "host": "localhost",
            "database": "bbi_chat",
            "user": "bbi_chat",
            "password": "jbvbbTRzpj3vQhobRjCz"
        }
    },
    "dev":{
        "cassandra": {
            "host": "localhost",
            "keyspace": "bbi_chat",
            "username": "lemon",
            "password": "admin",
            "localDataCenter": "datacenter1",
            "maxRequestsPerConnection": 32768
        },
        "mysql": {
            "host": "192.168.1.7",
            "database": "bbi_chat",
            "user": "bbi_chat",
            "password": "jbvbbTRzpj3vQhobRjCz"
        }
    }
}