{
    "type": "object",
    "required": [
        "group_name",
        "list_member"
    ],
    "properties": {
        "group_name": {
            "type": [
                "string"
            ],
            "minLength": 1,
            "maxLength": 200
        },
        "avatar": {
            "type": [
                "string"
            ],
            "minLength": 1,
            "maxLength": 1000
        },
        "list_member": {
            "type": [
                "array"
            ],
            "items":{
                "type": [
                    "string"
                ],
                "minLength": 1,
                "maxLength": 200
            }
        }
    },
    "additionalProperties": false
}