[gd_scene load_steps=3 format=2]

[ext_resource path="res://Scripts/Area2D.gd" type="Script" id=1]

[sub_resource type="RectangleShape2D" id=1]
extents = Vector2( 196.97, 264.88 )

[node name="Area Trigger" type="Area2D"]
script = ExtResource( 1 )
sceneName = "Game Over"

[node name="CollisionShape2D" type="CollisionShape2D" parent="."]
shape = SubResource( 1 )
[connection signal="body_entered" from="." to="." method="_on_Area_Trigger_body_entered"]
