<svg width="512" height="104" viewBox="0 0 512 104" fill="none" xmlns="http://www.w3.org/2000/svg">
<path d="M15.5924 83V20.3012H53.1872V27.0364H23.1849V48.2218H50.3707V54.957H23.1849V83H15.5924ZM119.093 51.6506C119.093 58.2634 117.899 63.9781 115.511 68.7948C113.123 73.6115 109.847 77.3261 105.684 79.9385C101.52 82.551 96.7646 83.8572 91.4172 83.8572C86.0699 83.8572 81.3144 82.551 77.1508 79.9385C72.9872 77.3261 69.7115 73.6115 67.3235 68.7948C64.9356 63.9781 63.7416 58.2634 63.7416 51.6506C63.7416 45.0379 64.9356 39.3231 67.3235 34.5064C69.7115 29.6897 72.9872 25.9751 77.1508 23.3627C81.3144 20.7502 86.0699 19.444 91.4172 19.444C96.7646 19.444 101.52 20.7502 105.684 23.3627C109.847 25.9751 113.123 29.6897 115.511 34.5064C117.899 39.3231 119.093 45.0379 119.093 51.6506ZM111.745 51.6506C111.745 46.2216 110.837 41.6396 109.021 37.9046C107.225 34.1697 104.786 31.3429 101.704 29.4244C98.6423 27.5059 95.2134 26.5466 91.4172 26.5466C87.621 26.5466 84.182 27.5059 81.1001 29.4244C78.0386 31.3429 75.5997 34.1697 73.7832 37.9046C71.9871 41.6396 71.0891 46.2216 71.0891 51.6506C71.0891 57.0796 71.9871 61.6616 73.7832 65.3966C75.5997 69.1316 78.0386 71.9583 81.1001 73.8768C84.182 75.7954 87.621 76.7546 91.4172 76.7546C95.2134 76.7546 98.6423 75.7954 101.704 73.8768C104.786 71.9583 107.225 69.1316 109.021 65.3966C110.837 61.6616 111.745 57.0796 111.745 51.6506ZM166.148 35.9759C165.78 32.8736 164.29 30.4653 161.678 28.7509C159.065 27.0364 155.861 26.1792 152.065 26.1792C149.289 26.1792 146.86 26.6282 144.779 27.5263C142.717 28.4243 141.105 29.6591 139.941 31.2306C138.798 32.8022 138.227 34.5881 138.227 36.5882C138.227 38.2618 138.625 39.7007 139.421 40.9049C140.237 42.0886 141.278 43.0785 142.544 43.8745C143.809 44.6501 145.136 45.293 146.524 45.8032C147.911 46.2931 149.187 46.691 150.35 46.9972L156.718 48.7116C158.351 49.1402 160.168 49.7321 162.168 50.4873C164.188 51.2424 166.117 52.2731 167.954 53.5793C169.811 54.8651 171.342 56.5183 172.546 58.5389C173.75 60.5595 174.352 63.0393 174.352 65.9783C174.352 69.3663 173.464 72.4277 171.689 75.1627C169.934 77.8976 167.362 80.0712 163.974 81.6836C160.606 83.2959 156.514 84.1021 151.697 84.1021C147.207 84.1021 143.319 83.3776 140.033 81.9285C136.768 80.4794 134.196 78.4588 132.318 75.8668C130.461 73.2748 129.41 70.2643 129.165 66.8355H137.002C137.207 69.203 138.003 71.1623 139.39 72.7135C140.799 74.2442 142.574 75.3872 144.717 76.1423C146.881 76.8771 149.207 77.2444 151.697 77.2444C154.596 77.2444 157.198 76.775 159.504 75.8362C161.81 74.8769 163.637 73.5503 164.984 71.8563C166.331 70.1419 167.005 68.1417 167.005 65.8558C167.005 63.774 166.423 62.08 165.26 60.7738C164.096 59.4675 162.566 58.4062 160.668 57.5899C158.769 56.7735 156.718 56.0591 154.514 55.4468L146.799 53.2426C141.901 51.8343 138.023 49.8239 135.166 47.2115C132.308 44.599 130.88 41.1804 130.88 36.9556C130.88 33.4451 131.829 30.3836 133.727 27.7712C135.645 25.1383 138.217 23.0974 141.442 21.6483C144.687 20.1788 148.309 19.444 152.31 19.444C156.351 19.444 159.943 20.1686 163.086 21.6177C166.229 23.0463 168.719 25.0057 170.556 27.4957C172.413 29.9857 173.393 32.8124 173.495 35.9759H166.148ZM221.124 35.9759C220.756 32.8736 219.267 30.4653 216.654 28.7509C214.042 27.0364 210.837 26.1792 207.041 26.1792C204.265 26.1792 201.837 26.6282 199.755 27.5263C197.693 28.4243 196.081 29.6591 194.918 31.2306C193.775 32.8022 193.203 34.5881 193.203 36.5882C193.203 38.2618 193.601 39.7007 194.397 40.9049C195.214 42.0886 196.254 43.0785 197.52 43.8745C198.785 44.6501 200.112 45.293 201.5 45.8032C202.888 46.2931 204.163 46.691 205.327 46.9972L211.694 48.7116C213.327 49.1402 215.144 49.7321 217.144 50.4873C219.164 51.2424 221.093 52.2731 222.93 53.5793C224.787 54.8651 226.318 56.5183 227.522 58.5389C228.726 60.5595 229.329 63.0393 229.329 65.9783C229.329 69.3663 228.441 72.4277 226.665 75.1627C224.91 77.8976 222.338 80.0712 218.95 81.6836C215.583 83.2959 211.49 84.1021 206.674 84.1021C202.184 84.1021 198.295 83.3776 195.01 81.9285C191.744 80.4794 189.172 78.4588 187.295 75.8668C185.437 73.2748 184.386 70.2643 184.141 66.8355H191.979C192.183 69.203 192.979 71.1623 194.367 72.7135C195.775 74.2442 197.551 75.3872 199.694 76.1423C201.857 76.8771 204.184 77.2444 206.674 77.2444C209.572 77.2444 212.174 76.775 214.48 75.8362C216.787 74.8769 218.613 73.5503 219.96 71.8563C221.307 70.1419 221.981 68.1417 221.981 65.8558C221.981 63.774 221.399 62.08 220.236 60.7738C219.073 59.4675 217.542 58.4062 215.644 57.5899C213.746 56.7735 211.694 56.0591 209.49 55.4468L201.775 53.2426C196.877 51.8343 192.999 49.8239 190.142 47.2115C187.284 44.599 185.856 41.1804 185.856 36.9556C185.856 33.4451 186.805 30.3836 188.703 27.7712C190.621 25.1383 193.193 23.0974 196.418 21.6483C199.663 20.1788 203.286 19.444 207.286 19.444C211.327 19.444 214.919 20.1686 218.062 21.6177C221.205 23.0463 223.695 25.0057 225.532 27.4957C227.39 29.9857 228.369 32.8124 228.471 35.9759H221.124ZM241.812 83V20.3012H249.404V48.2218H282.835V20.3012H290.428V83H282.835V54.957H249.404V83H241.812ZM412.657 35.9759C412.289 32.8736 410.799 30.4653 408.187 28.7509C405.574 27.0364 402.37 26.1792 398.574 26.1792C395.798 26.1792 393.369 26.6282 391.288 27.5263C389.226 28.4243 387.614 29.6591 386.45 31.2306C385.308 32.8022 384.736 34.5881 384.736 36.5882C384.736 38.2618 385.134 39.7007 385.93 40.9049C386.746 42.0886 387.787 43.0785 389.053 43.8745C390.318 44.6501 391.645 45.293 393.033 45.8032C394.42 46.2931 395.696 46.691 396.859 46.9972L403.227 48.7116C404.86 49.1402 406.677 49.7321 408.677 50.4873C410.697 51.2424 412.626 52.2731 414.463 53.5793C416.32 54.8651 417.851 56.5183 419.055 58.5389C420.259 60.5595 420.861 63.0393 420.861 65.9783C420.861 69.3663 419.974 72.4277 418.198 75.1627C416.443 77.8976 413.871 80.0712 410.483 81.6836C407.115 83.2959 403.023 84.1021 398.207 84.1021C393.716 84.1021 389.828 83.3776 386.542 81.9285C383.277 80.4794 380.705 78.4588 378.827 75.8668C376.97 73.2748 375.919 70.2643 375.674 66.8355H383.511C383.716 69.203 384.512 71.1623 385.899 72.7135C387.308 74.2442 389.083 75.3872 391.226 76.1423C393.39 76.8771 395.717 77.2444 398.207 77.2444C401.105 77.2444 403.707 76.775 406.013 75.8362C408.32 74.8769 410.146 73.5503 411.493 71.8563C412.84 70.1419 413.514 68.1417 413.514 65.8558C413.514 63.774 412.932 62.08 411.769 60.7738C410.605 59.4675 409.075 58.4062 407.177 57.5899C405.278 56.7735 403.227 56.0591 401.023 55.4468L393.308 53.2426C388.41 51.8343 384.532 49.8239 381.675 47.2115C378.817 44.599 377.389 41.1804 377.389 36.9556C377.389 33.4451 378.338 30.3836 380.236 27.7712C382.154 25.1383 384.726 23.0974 387.951 21.6483C391.196 20.1788 394.818 19.444 398.819 19.444C402.86 19.444 406.452 20.1686 409.595 21.6177C412.738 23.0463 415.228 25.0057 417.065 27.4957C418.922 29.9857 419.902 32.8124 420.004 35.9759H412.657ZM429.916 27.0364V20.3012H476.94V27.0364H457.224V83H449.631V27.0364H429.916Z" fill="white"/>
<path fill-rule="evenodd" clip-rule="evenodd" d="M305 51.8481C305 34.8112 318.811 21 335.848 21C352.885 21 366.696 34.8112 366.696 51.8481C366.696 58.2806 364.727 64.2534 361.359 69.1965C355.807 77.3455 346.452 82.6962 335.848 82.6962C318.811 82.6962 305 68.8849 305 51.8481Z" fill="#F67653" stroke="black" stroke-width="1.96479"/>
<path fill-rule="evenodd" clip-rule="evenodd" d="M336.377 40.5777C336.377 40.5777 328.332 25.5353 314.2 35.3903C292.023 51.1447 336.327 80.0204 336.327 80.0204C336.327 80.0204 378.985 52.0656 357.914 35.2057C344.527 24.7804 336.377 40.5777 336.377 40.5777Z" fill="white" stroke="black" stroke-width="1.96485"/>
<path fill-rule="evenodd" clip-rule="evenodd" d="M332.389 54.8978C331.394 57.3855 336.369 64.8488 336.369 64.8488C336.369 64.8488 341.345 57.3855 340.349 54.8978C339.354 52.41 333.384 52.41 332.389 54.8978Z" fill="white" stroke="black" stroke-width="1.96485"/>
<path fill-rule="evenodd" clip-rule="evenodd" d="M354.828 46.9224C354.828 43.4601 352.021 40.6533 348.559 40.6533C345.096 40.6533 342.289 43.4601 342.289 46.9224C342.289 50.3848 345.096 53.1916 348.559 53.1916C352.021 53.1916 354.828 50.3848 354.828 46.9224Z" fill="black"/>
<path fill-rule="evenodd" clip-rule="evenodd" d="M353.434 46.0517C353.434 43.8396 351.641 42.0464 349.429 42.0464C347.217 42.0464 345.424 43.8396 345.424 46.0517C345.424 48.2637 347.217 50.0569 349.429 50.0569C351.641 50.0569 353.434 48.2637 353.434 46.0517Z" fill="white"/>
<path fill-rule="evenodd" clip-rule="evenodd" d="M330.196 46.9176C330.196 43.4552 327.389 40.6484 323.927 40.6484C320.465 40.6484 317.658 43.4552 317.658 46.9176C317.658 50.3799 320.465 53.1867 323.927 53.1867C327.389 53.1867 330.196 50.3799 330.196 46.9176Z" fill="black"/>
<path fill-rule="evenodd" clip-rule="evenodd" d="M328.803 46.0468C328.803 43.8347 327.01 42.0415 324.798 42.0415C322.586 42.0415 320.792 43.8347 320.792 46.0468C320.792 48.2588 322.586 50.052 324.798 50.052C327.01 50.052 328.803 48.2588 328.803 46.0468Z" fill="white"/>
</svg>
