<svg width="717" height="170" viewBox="0 0 717 170" fill="none" xmlns="http://www.w3.org/2000/svg">
<path d="M158.303 60.5606L158.086 59.9894L136.175 3.58386C135.732 2.47632 134.942 1.53679 133.922 0.901272C133.161 0.420212 132.295 0.121895 131.396 0.030226C130.497 -0.0614433 129.588 0.0560892 128.743 0.373401C127.898 0.690713 127.14 1.19898 126.53 1.85746C125.92 2.51594 125.475 3.30632 125.23 4.16525L110.44 48.8511H50.5483L35.7587 4.16525C35.512 3.30761 35.0657 2.51871 34.4553 1.86149C33.8449 1.20427 33.0873 0.696905 32.243 0.379852C31.3987 0.0627993 30.491 -0.0551676 29.5923 0.035362C28.6937 0.125892 27.8288 0.422409 27.0669 0.901272C26.0464 1.53679 25.2573 2.47632 24.8138 3.58386L2.91361 59.9996L2.68624 60.5606C-0.466747 68.6931 -0.855183 77.6168 1.57948 85.9861C4.01415 94.3555 9.13994 101.717 16.184 106.96L16.2666 107.021L16.4527 107.164L49.7835 131.817L66.3197 144.149L76.3655 151.646C77.5442 152.525 78.9811 153 80.4582 153C81.9354 153 83.3723 152.525 84.5509 151.646L94.5967 144.149L111.133 131.817L144.701 107.021L144.795 106.95C151.838 101.709 156.965 94.3496 159.401 85.9823C161.837 77.615 161.452 68.6928 158.303 60.5606V60.5606Z" fill="#E24329"/>
<path d="M158.303 60.5607L158.086 59.9895C147.41 62.1514 137.352 66.6169 128.63 73.0658L80.5202 108.97L111.154 131.817L144.722 107.021L144.815 106.95C151.855 101.706 156.977 94.3458 159.41 85.9787C161.843 77.6116 161.454 68.6908 158.303 60.5607V60.5607Z" fill="#FC6D26"/>
<path d="M49.7835 131.817L66.3197 144.149L76.3655 151.646C77.5442 152.524 78.9811 153 80.4582 153C81.9354 153 83.3723 152.524 84.5509 151.646L94.5967 144.149L111.133 131.817L80.4996 108.969L49.7835 131.817Z" fill="#FCA326"/>
<path d="M32.3585 73.0659C23.6403 66.6201 13.585 62.1581 2.91361 59.9998L2.68624 60.5607C-0.466747 68.6932 -0.855183 77.6169 1.57949 85.9863C4.01415 94.3556 9.13994 101.717 16.184 106.96L16.2666 107.021L16.4527 107.164L49.7835 131.817L80.4376 108.97L32.3585 73.0659Z" fill="#FC6D26"/>
<path d="M289.476 57.6434H313.02C309.092 32.9392 287.42 15.7319 259.215 15.7319C225.843 15.7319 200.801 39.9465 200.801 80.5014C200.801 120.332 224.716 145.036 259.897 145.036C291.471 145.036 314.074 124.993 314.074 92.5475V77.4313H262.326V95.2505H291.719C291.347 113.202 279.203 124.565 260.021 124.565C238.669 124.565 224.034 108.776 224.034 80.2566C224.034 51.9212 238.917 36.193 259.525 36.193C274.904 36.193 285.425 44.3019 289.476 57.6434Z" fill="white"/>
<path d="M329.639 143.312H352.18V48.9632H329.639V143.312ZM341.007 33.9693C348.17 33.9693 354.019 28.5532 354.019 21.9232C354.019 15.2933 348.17 9.81592 341.007 9.81592C333.845 9.81592 327.933 15.2219 327.933 21.9232C327.933 28.6246 333.742 33.9693 340.966 33.9693H341.007Z" fill="white"/>
<path d="M419.678 48.9633H400.806V26.2991H378.265V48.9633H364.695V66.1706H378.265V118.659C378.141 136.417 391.226 145.179 408.155 144.659C412.664 144.57 417.136 143.825 421.425 142.446L417.622 125.044C415.467 125.596 413.253 125.887 411.028 125.911C405.354 125.911 400.806 123.943 400.806 114.967V66.1196H419.678V48.9633Z" fill="white"/>
<path d="M437.124 143.313H516.395V124.198H460.234V17.4456H437.124V143.313Z" fill="white"/>
<path d="M559.575 145.22C574.582 145.22 583.542 138.274 587.656 130.349H588.4V143.313H610.104V80.1344C610.104 55.1854 589.495 47.6885 571.243 47.6885C551.131 47.6885 535.691 56.5318 530.709 73.7391L551.762 76.6971C553.994 70.2405 560.35 64.7121 571.398 64.7121C581.868 64.7121 587.594 69.9957 587.594 79.2776V79.6448C587.594 86.03 580.803 86.3462 563.926 88.121C545.374 90.0895 527.629 95.5567 527.629 116.824C527.567 135.387 541.323 145.22 559.575 145.22ZM566.985 128.9C557.58 128.9 550.852 124.657 550.852 116.487C550.852 107.939 558.386 104.38 568.422 102.962C574.344 102.166 586.178 100.687 589.092 98.3617V109.48C589.154 119.955 580.555 128.87 566.985 128.87V128.9Z" fill="white"/>
<path d="M626.702 143.313H648.871V128.441H650.173C653.728 135.326 661.139 144.975 677.582 144.975C700.123 144.975 717 127.329 717 96.2399C717 64.7732 699.627 47.6883 677.52 47.6883C660.642 47.6883 653.604 57.7046 650.173 64.5284H649.222V17.4456H626.702V143.313ZM648.809 96.1175C648.809 77.7577 656.777 65.936 671.288 65.936C686.294 65.936 694.025 78.5329 694.025 96.1175C694.025 113.702 686.181 126.717 671.288 126.717C656.901 126.717 648.809 114.426 648.809 96.1175Z" fill="white"/>
</svg>
